mesos-builds mailing list archives

Site index · List index
Message view « Date » · « Thread »
Top « Date » · « Thread »
From Apache Jenkins Server <jenk...@builds.apache.org>
Subject Build failed in Jenkins: Mesos-Buildbot » autotools,gcc,--verbose,GLOG_v=1 MESOS_VERBOSE=1,centos:7,(ubuntu)&&(!ubuntu-us1)&&(!ubuntu-eu2) #4199
Date Wed, 06 Sep 2017 02:43:19 GMT
See <https://builds.apache.org/job/Mesos-Buildbot/BUILDTOOL=autotools,COMPILER=gcc,CONFIGURATION=--verbose,ENVIRONMENT=GLOG_v=1%20MESOS_VERBOSE=1,OS=centos%3A7,label_exp=(ubuntu)&&(!ubuntu-us1)&&(!ubuntu-eu2)/4199/display/redirect?page=changes>

Changes:

[yujie.jay] Moved sandbox path volume logic to the dedicated isolator.

[yujie.jay] Moved SANDBOX_PATH volume tests to the right place.

------------------------------------------
[...truncated 31.07 MB...]
I0906 02:43:05.851779  6822 slave.cpp:285] Agent using credential for: test-principal
I0906 02:43:05.851809  6822 credentials.hpp:37] Loading credentials for authentication from
'/tmp/Endpoint_SlaveEndpointTest_AuthorizedRequest_2_R8bZ1h/http_credentials'
I0906 02:43:05.852084  6822 http.cpp:1045] Creating default 'basic' HTTP authenticator for
realm 'mesos-agent-readonly'
I0906 02:43:05.852255  6822 http.cpp:1045] Creating default 'basic' HTTP authenticator for
realm 'mesos-agent-readwrite'
I0906 02:43:05.853638  6822 slave.cpp:581] Agent resources: [{"name":"cpus","scalar":{"value":2.0},"type":"SCALAR"},{"name":"mem","scalar":{"value":1024.0},"type":"SCALAR"},{"name":"disk","scalar":{"value":1024.0},"type":"SCALAR"},{"name":"ports","ranges":{"range":[{"begin":31000,"end":32000}]},"type":"RANGES"}]
I0906 02:43:05.853879  6822 slave.cpp:589] Agent attributes: [  ]
I0906 02:43:05.853909  6822 slave.cpp:598] Agent hostname: df5f0d8c4260
I0906 02:43:05.854063  6819 status_update_manager.cpp:177] Pausing sending status updates
I0906 02:43:05.855593  6803 state.cpp:64] Recovering state from '/tmp/Endpoint_SlaveEndpointTest_AuthorizedRequest_2_3jHmMy/meta'
I0906 02:43:05.855952  6805 status_update_manager.cpp:203] Recovering status update manager
I0906 02:43:05.856233  6809 containerizer.cpp:648] Recovering containerizer
I0906 02:43:05.857801  6817 provisioner.cpp:416] Provisioner recovery complete
I0906 02:43:05.858194  6822 slave.cpp:6296] Finished recovery
I0906 02:43:05.858613  6822 slave.cpp:6478] Querying resource estimator for oversubscribable
resources
I0906 02:43:05.858871  6804 slave.cpp:6492] Received oversubscribable resources {} from the
resource estimator
I0906 02:43:05.861389  6813 process.cpp:3954] Handling HTTP event for process 'slave(807)'
with path: '/slave(807)/containers'
I0906 02:43:05.862635  6814 http.cpp:1185] HTTP GET for /slave(807)/containers from 172.17.0.3:43540
I0906 02:43:05.862704  6814 http.cpp:976] Authorizing principal 'test-principal' to GET the
'/containers' endpoint
I0906 02:43:05.867981  6820 slave.cpp:859] Agent terminating
[       OK ] Endpoint/SlaveEndpointTest.AuthorizedRequest/2 (37 ms)
[ RUN      ] Endpoint/SlaveEndpointTest.UnauthorizedRequest/0
I0906 02:43:05.882241  6780 containerizer.cpp:292] Using isolation { environment_secret, posix/cpu,
posix/mem, filesystem/posix, network/cni }
W0906 02:43:05.882756  6780 backend.cpp:76] Failed to create 'aufs' backend: AufsBackend requires
root privileges
W0906 02:43:05.882870  6780 backend.cpp:76] Failed to create 'bind' backend: BindBackend requires
root privileges
I0906 02:43:05.882903  6780 provisioner.cpp:255] Using default backend 'copy'
I0906 02:43:05.886521  6801 slave.cpp:252] Mesos agent started on (808)@172.17.0.3:35792
I0906 02:43:05.886546  6801 slave.cpp:253] Flags at startup: --acls="" --appc_simple_discovery_uri_prefix="http://"
--appc_store_dir="/tmp/Endpoint_SlaveEndpointTest_UnauthorizedRequest_0_NWF9kd/store/appc"
--authenticate_http_readonly="true" --authenticate_http_readwrite="true" --authenticatee="crammd5"
--authentication_backoff_factor="1secs" --authorizer="local" --cgroups_cpu_enable_pids_and_tids_count="false"
--cgroups_enable_cfs="false" --cgroups_hierarchy="/sys/fs/cgroup" --cgroups_limit_swap="false"
--cgroups_root="mesos" --container_disk_watch_interval="15secs" --containerizers="mesos" --credential="/tmp/Endpoint_SlaveEndpointTest_UnauthorizedRequest_0_NWF9kd/credential"
--default_role="*" --disallow_sharing_agent_pid_namespace="false" --disk_watch_interval="1mins"
--docker="docker" --docker_kill_orphans="true" --docker_registry="https://registry-1.docker.io"
--docker_remove_delay="6hrs" --docker_socket="/var/run/docker.sock" --docker_stop_timeout="0ns"
--docker_store_dir="/tmp/Endpoint_SlaveEndpointTest_UnauthorizedRequest_0_NWF9kd/store/docker"
--docker_volume_checkpoint_dir="/var/run/mesos/isolators/docker/volume" --enforce_container_disk_quota="false"
--executor_registration_timeout="1mins" --executor_reregistration_timeout="2secs" --executor_shutdown_grace_period="5secs"
--fetcher_cache_dir="/tmp/Endpoint_SlaveEndpointTest_UnauthorizedRequest_0_NWF9kd/fetch" --fetcher_cache_size="2GB"
--frameworks_home="" --gc_delay="1weeks" --gc_disk_headroom="0.1" --hadoop_home="" --help="false"
--hostname_lookup="true" --http_command_executor="false" --http_credentials="/tmp/Endpoint_SlaveEndpointTest_UnauthorizedRequest_0_NWF9kd/http_credentials"
--http_heartbeat_interval="30secs" --initialize_driver_logging="true" --isolation="posix/cpu,posix/mem"
--launcher="posix" --launcher_dir="/mesos/mesos-1.5.0/_build/src" --logbufsecs="0" --logging_level="INFO"
--max_completed_executors_per_framework="150" --oversubscribed_resources_interval="15secs"
--perf_duration="10secs" --perf_interval="1mins" --port="5051" --qos_correction_interval_min="0ns"
--quiet="false" --recover="reconnect" --recovery_timeout="15mins" --registration_backoff_factor="10ms"
--resources="cpus:2;gpus:0;mem:1024;disk:1024;ports:[31000-32000]" --revocable_cpu_low_priority="true"
--runtime_dir="/tmp/Endpoint_SlaveEndpointTest_UnauthorizedRequest_0_NWF9kd" --sandbox_directory="/mnt/mesos/sandbox"
--strict="true" --switch_user="true" --systemd_enable_support="true" --systemd_runtime_directory="/run/systemd/system"
--version="false" --work_dir="/tmp/Endpoint_SlaveEndpointTest_UnauthorizedRequest_0_dR7ZZt"
--zk_session_timeout="10secs"
I0906 02:43:05.887099  6801 credentials.hpp:86] Loading credential for authentication from
'/tmp/Endpoint_SlaveEndpointTest_UnauthorizedRequest_0_NWF9kd/credential'
I0906 02:43:05.887265  6801 slave.cpp:285] Agent using credential for: test-principal
I0906 02:43:05.887289  6801 credentials.hpp:37] Loading credentials for authentication from
'/tmp/Endpoint_SlaveEndpointTest_UnauthorizedRequest_0_NWF9kd/http_credentials'
I0906 02:43:05.887560  6801 http.cpp:1045] Creating default 'basic' HTTP authenticator for
realm 'mesos-agent-readonly'
I0906 02:43:05.887759  6801 http.cpp:1045] Creating default 'basic' HTTP authenticator for
realm 'mesos-agent-readwrite'
I0906 02:43:05.889241  6801 slave.cpp:581] Agent resources: [{"name":"cpus","scalar":{"value":2.0},"type":"SCALAR"},{"name":"mem","scalar":{"value":1024.0},"type":"SCALAR"},{"name":"disk","scalar":{"value":1024.0},"type":"SCALAR"},{"name":"ports","ranges":{"range":[{"begin":31000,"end":32000}]},"type":"RANGES"}]
I0906 02:43:05.889478  6801 slave.cpp:589] Agent attributes: [  ]
I0906 02:43:05.889492  6801 slave.cpp:598] Agent hostname: df5f0d8c4260
I0906 02:43:05.889744  6805 status_update_manager.cpp:177] Pausing sending status updates
I0906 02:43:05.891198  6817 state.cpp:64] Recovering state from '/tmp/Endpoint_SlaveEndpointTest_UnauthorizedRequest_0_dR7ZZt/meta'
I0906 02:43:05.891508  6817 status_update_manager.cpp:203] Recovering status update manager
I0906 02:43:05.891726  6807 containerizer.cpp:648] Recovering containerizer
I0906 02:43:05.893612  6805 provisioner.cpp:416] Provisioner recovery complete
I0906 02:43:05.894148  6800 slave.cpp:6296] Finished recovery
I0906 02:43:05.894757  6800 slave.cpp:6478] Querying resource estimator for oversubscribable
resources
I0906 02:43:05.895066  6821 slave.cpp:6492] Received oversubscribable resources {} from the
resource estimator
I0906 02:43:05.897653  6812 process.cpp:3954] Handling HTTP event for process 'slave(808)'
with path: '/slave(808)/monitor/statistics'
I0906 02:43:05.899019  6805 http.cpp:1185] HTTP GET for /slave(808)/monitor/statistics from
172.17.0.3:43542
I0906 02:43:05.899179  6805 http.cpp:976] Authorizing principal 'test-principal' to GET the
'/monitor/statistics' endpoint
I0906 02:43:05.901362  6780 slave.cpp:859] Agent terminating
[       OK ] Endpoint/SlaveEndpointTest.UnauthorizedRequest/0 (31 ms)
[ RUN      ] Endpoint/SlaveEndpointTest.UnauthorizedRequest/1
I0906 02:43:05.913851  6780 containerizer.cpp:292] Using isolation { environment_secret, posix/cpu,
posix/mem, filesystem/posix, network/cni }
W0906 02:43:05.914333  6780 backend.cpp:76] Failed to create 'aufs' backend: AufsBackend requires
root privileges
W0906 02:43:05.914443  6780 backend.cpp:76] Failed to create 'bind' backend: BindBackend requires
root privileges
I0906 02:43:05.914476  6780 provisioner.cpp:255] Using default backend 'copy'
I0906 02:43:05.918134  6811 slave.cpp:252] Mesos agent started on (809)@172.17.0.3:35792
I0906 02:43:05.918170  6811 slave.cpp:253] Flags at startup: --acls="" --appc_simple_discovery_uri_prefix="http://"
--appc_store_dir="/tmp/Endpoint_SlaveEndpointTest_UnauthorizedRequest_1_jQtNX8/store/appc"
--authenticate_http_readonly="true" --authenticate_http_readwrite="true" --authenticatee="crammd5"
--authentication_backoff_factor="1secs" --authorizer="local" --cgroups_cpu_enable_pids_and_tids_count="false"
--cgroups_enable_cfs="false" --cgroups_hierarchy="/sys/fs/cgroup" --cgroups_limit_swap="false"
--cgroups_root="mesos" --container_disk_watch_interval="15secs" --containerizers="mesos" --credential="/tmp/Endpoint_SlaveEndpointTest_UnauthorizedRequest_1_jQtNX8/credential"
--default_role="*" --disallow_sharing_agent_pid_namespace="false" --disk_watch_interval="1mins"
--docker="docker" --docker_kill_orphans="true" --docker_registry="https://registry-1.docker.io"
--docker_remove_delay="6hrs" --docker_socket="/var/run/docker.sock" --docker_stop_timeout="0ns"
--docker_store_dir="/tmp/Endpoint_SlaveEndpointTest_UnauthorizedRequest_1_jQtNX8/store/docker"
--docker_volume_checkpoint_dir="/var/run/mesos/isolators/docker/volume" --enforce_container_disk_quota="false"
--executor_registration_timeout="1mins" --executor_reregistration_timeout="2secs" --executor_shutdown_grace_period="5secs"
--fetcher_cache_dir="/tmp/Endpoint_SlaveEndpointTest_UnauthorizedRequest_1_jQtNX8/fetch" --fetcher_cache_size="2GB"
--frameworks_home="" --gc_delay="1weeks" --gc_disk_headroom="0.1" --hadoop_home="" --help="false"
--hostname_lookup="true" --http_command_executor="false" --http_credentials="/tmp/Endpoint_SlaveEndpointTest_UnauthorizedRequest_1_jQtNX8/http_credentials"
--http_heartbeat_interval="30secs" --initialize_driver_logging="true" --isolation="posix/cpu,posix/mem"
--launcher="posix" --launcher_dir="/mesos/mesos-1.5.0/_build/src" --logbufsecs="0" --logging_level="INFO"
--max_completed_executors_per_framework="150" --oversubscribed_resources_interval="15secs"
--perf_duration="10secs" --perf_interval="1mins" --port="5051" --qos_correction_interval_min="0ns"
--quiet="false" --recover="reconnect" --recovery_timeout="15mins" --registration_backoff_factor="10ms"
--resources="cpus:2;gpus:0;mem:1024;disk:1024;ports:[31000-32000]" --revocable_cpu_low_priority="true"
--runtime_dir="/tmp/Endpoint_SlaveEndpointTest_UnauthorizedRequest_1_jQtNX8" --sandbox_directory="/mnt/mesos/sandbox"
--strict="true" --switch_user="true" --systemd_enable_support="true" --systemd_runtime_directory="/run/systemd/system"
--version="false" --work_dir="/tmp/Endpoint_SlaveEndpointTest_UnauthorizedRequest_1_lX6Vxp"
--zk_session_timeout="10secs"
I0906 02:43:05.919144  6811 credentials.hpp:86] Loading credential for authentication from
'/tmp/Endpoint_SlaveEndpointTest_UnauthorizedRequest_1_jQtNX8/credential'
I0906 02:43:05.919459  6811 slave.cpp:285] Agent using credential for: test-principal
I0906 02:43:05.919519  6811 credentials.hpp:37] Loading credentials for authentication from
'/tmp/Endpoint_SlaveEndpointTest_UnauthorizedRequest_1_jQtNX8/http_credentials'
I0906 02:43:05.919916  6811 http.cpp:1045] Creating default 'basic' HTTP authenticator for
realm 'mesos-agent-readonly'
I0906 02:43:05.920168  6811 http.cpp:1045] Creating default 'basic' HTTP authenticator for
realm 'mesos-agent-readwrite'
I0906 02:43:05.922364  6811 slave.cpp:581] Agent resources: [{"name":"cpus","scalar":{"value":2.0},"type":"SCALAR"},{"name":"mem","scalar":{"value":1024.0},"type":"SCALAR"},{"name":"disk","scalar":{"value":1024.0},"type":"SCALAR"},{"name":"ports","ranges":{"range":[{"begin":31000,"end":32000}]},"type":"RANGES"}]
I0906 02:43:05.922798  6811 slave.cpp:589] Agent attributes: [  ]
I0906 02:43:05.922828  6811 slave.cpp:598] Agent hostname: df5f0d8c4260
I0906 02:43:05.923099  6813 status_update_manager.cpp:177] Pausing sending status updates
I0906 02:43:05.925232  6820 state.cpp:64] Recovering state from '/tmp/Endpoint_SlaveEndpointTest_UnauthorizedRequest_1_lX6Vxp/meta'
I0906 02:43:05.925640  6807 status_update_manager.cpp:203] Recovering status update manager
I0906 02:43:05.925930  6814 containerizer.cpp:648] Recovering containerizer
I0906 02:43:05.927534  6801 provisioner.cpp:416] Provisioner recovery complete
I0906 02:43:05.928042  6811 slave.cpp:6296] Finished recovery
I0906 02:43:05.928537  6811 slave.cpp:6478] Querying resource estimator for oversubscribable
resources
I0906 02:43:05.928802  6818 slave.cpp:6492] Received oversubscribable resources {} from the
resource estimator
I0906 02:43:05.932098  6816 process.cpp:3954] Handling HTTP event for process 'slave(809)'
with path: '/slave(809)/monitor/statistics.json'
I0906 02:43:05.933476  6801 http.cpp:1185] HTTP GET for /slave(809)/monitor/statistics.json
from 172.17.0.3:43546
I0906 02:43:05.933542  6801 http.cpp:976] Authorizing principal 'test-principal' to GET the
'/monitor/statistics.json' endpoint
I0906 02:43:05.936134  6780 slave.cpp:859] Agent terminating
[       OK ] Endpoint/SlaveEndpointTest.UnauthorizedRequest/1 (36 ms)
[ RUN      ] Endpoint/SlaveEndpointTest.UnauthorizedRequest/2
I0906 02:43:05.953930  6780 containerizer.cpp:292] Using isolation { environment_secret, posix/cpu,
posix/mem, filesystem/posix, network/cni }
W0906 02:43:05.954710  6780 backend.cpp:76] Failed to create 'aufs' backend: AufsBackend requires
root privileges
W0906 02:43:05.954870  6780 backend.cpp:76] Failed to create 'bind' backend: BindBackend requires
root privileges
I0906 02:43:05.954921  6780 provisioner.cpp:255] Using default backend 'copy'
I0906 02:43:05.960065  6822 slave.cpp:252] Mesos agent started on (810)@172.17.0.3:35792
I0906 02:43:05.960089  6822 slave.cpp:253] Flags at startup: --acls="" --appc_simple_discovery_uri_prefix="http://"
--appc_store_dir="/tmp/Endpoint_SlaveEndpointTest_UnauthorizedRequest_2_viVoW4/store/appc"
--authenticate_http_readonly="true" --authenticate_http_readwrite="true" --authenticatee="crammd5"
--authentication_backoff_factor="1secs" --authorizer="local" --cgroups_cpu_enable_pids_and_tids_count="false"
--cgroups_enable_cfs="false" --cgroups_hierarchy="/sys/fs/cgroup" --cgroups_limit_swap="false"
--cgroups_root="mesos" --container_disk_watch_interval="15secs" --containerizers="mesos" --credential="/tmp/Endpoint_SlaveEndpointTest_UnauthorizedRequest_2_viVoW4/credential"
--default_role="*" --disallow_sharing_agent_pid_namespace="false" --disk_watch_interval="1mins"
--docker="docker" --docker_kill_orphans="true" --docker_registry="https://registry-1.docker.io"
--docker_remove_delay="6hrs" --docker_socket="/var/run/docker.sock" --docker_stop_timeout="0ns"
--docker_store_dir="/tmp/Endpoint_SlaveEndpointTest_UnauthorizedRequest_2_viVoW4/store/docker"
--docker_volume_checkpoint_dir="/var/run/mesos/isolators/docker/volume" --enforce_container_disk_quota="false"
--executor_registration_timeout="1mins" --executor_reregistration_timeout="2secs" --executor_shutdown_grace_period="5secs"
--fetcher_cache_dir="/tmp/Endpoint_SlaveEndpointTest_UnauthorizedRequest_2_viVoW4/fetch" --fetcher_cache_size="2GB"
--frameworks_home="" --gc_delay="1weeks" --gc_disk_headroom="0.1" --hadoop_home="" --help="false"
--hostname_lookup="true" --http_command_executor="false" --http_credentials="/tmp/Endpoint_SlaveEndpointTest_UnauthorizedRequest_2_viVoW4/http_credentials"
--http_heartbeat_interval="30secs" --initialize_driver_logging="true" --isolation="posix/cpu,posix/mem"
--launcher="posix" --launcher_dir="/mesos/mesos-1.5.0/_build/src" --logbufsecs="0" --logging_level="INFO"
--max_completed_executors_per_framework="150" --oversubscribed_resources_interval="15secs"
--perf_duration="10secs" --perf_interval="1mins" --port="5051" --qos_correction_interval_min="0ns"
--quiet="false" --recover="reconnect" --recovery_timeout="15mins" --registration_backoff_factor="10ms"
--resources="cpus:2;gpus:0;mem:1024;disk:1024;ports:[31000-32000]" --revocable_cpu_low_priority="true"
--runtime_dir="/tmp/Endpoint_SlaveEndpointTest_UnauthorizedRequest_2_viVoW4" --sandbox_directory="/mnt/mesos/sandbox"
--strict="true" --switch_user="true" --systemd_enable_support="true" --systemd_runtime_directory="/run/systemd/system"
--version="false" --work_dir="/tmp/Endpoint_SlaveEndpointTest_UnauthorizedRequest_2_jW3Oql"
--zk_session_timeout="10secs"
I0906 02:43:05.960561  6822 credentials.hpp:86] Loading credential for authentication from
'/tmp/Endpoint_SlaveEndpointTest_UnauthorizedRequest_2_viVoW4/credential'
I0906 02:43:05.960739  6822 slave.cpp:285] Agent using credential for: test-principal
I0906 02:43:05.960765  6822 credentials.hpp:37] Loading credentials for authentication from
'/tmp/Endpoint_SlaveEndpointTest_UnauthorizedRequest_2_viVoW4/http_credentials'
I0906 02:43:05.961019  6822 http.cpp:1045] Creating default 'basic' HTTP authenticator for
realm 'mesos-agent-readonly'
I0906 02:43:05.961181  6822 http.cpp:1045] Creating default 'basic' HTTP authenticator for
realm 'mesos-agent-readwrite'
I0906 02:43:05.962554  6822 slave.cpp:581] Agent resources: [{"name":"cpus","scalar":{"value":2.0},"type":"SCALAR"},{"name":"mem","scalar":{"value":1024.0},"type":"SCALAR"},{"name":"disk","scalar":{"value":1024.0},"type":"SCALAR"},{"name":"ports","ranges":{"range":[{"begin":31000,"end":32000}]},"type":"RANGES"}]
I0906 02:43:05.962795  6822 slave.cpp:589] Agent attributes: [  ]
I0906 02:43:05.962810  6822 slave.cpp:598] Agent hostname: df5f0d8c4260
I0906 02:43:05.963021  6799 status_update_manager.cpp:177] Pausing sending status updates
I0906 02:43:05.964411  6807 state.cpp:64] Recovering state from '/tmp/Endpoint_SlaveEndpointTest_UnauthorizedRequest_2_jW3Oql/meta'
I0906 02:43:05.964722  6814 status_update_manager.cpp:203] Recovering status update manager
I0906 02:43:05.965021  6814 containerizer.cpp:648] Recovering containerizer
I0906 02:43:05.966686  6820 provisioner.cpp:416] Provisioner recovery complete
I0906 02:43:05.967082  6822 slave.cpp:6296] Finished recovery
I0906 02:43:05.967514  6822 slave.cpp:6478] Querying resource estimator for oversubscribable
resources
I0906 02:43:05.967813  6808 slave.cpp:6492] Received oversubscribable resources {} from the
resource estimator
I0906 02:43:05.970113  6799 process.cpp:3954] Handling HTTP event for process 'slave(810)'
with path: '/slave(810)/containers'
I0906 02:43:05.971400  6818 http.cpp:1185] HTTP GET for /slave(810)/containers from 172.17.0.3:43548
I0906 02:43:05.971515  6818 http.cpp:976] Authorizing principal 'test-principal' to GET the
'/containers' endpoint
I0906 02:43:05.974418  6780 slave.cpp:859] Agent terminating
[       OK ] Endpoint/SlaveEndpointTest.UnauthorizedRequest/2 (37 ms)
[ RUN      ] Endpoint/SlaveEndpointTest.NoAuthorizer/0
I0906 02:43:05.988729  6780 containerizer.cpp:292] Using isolation { environment_secret, posix/cpu,
posix/mem, filesystem/posix, network/cni }
W0906 02:43:05.989274  6780 backend.cpp:76] Failed to create 'aufs' backend: AufsBackend requires
root privileges
W0906 02:43:05.989426  6780 backend.cpp:76] Failed to create 'bind' backend: BindBackend requires
root privileges
I0906 02:43:05.989464  6780 provisioner.cpp:255] Using default backend 'copy'
I0906 02:43:05.991410  6780 cluster.cpp:448] Creating default 'local' authorizer
I0906 02:43:05.993753  6814 slave.cpp:252] Mesos agent started on (811)@172.17.0.3:35792
I0906 02:43:05.993789  6814 slave.cpp:253] Flags at startup: --acls="" --appc_simple_discovery_uri_prefix="http://"
--appc_store_dir="/tmp/Endpoint_SlaveEndpointTest_NoAuthorizer_0_N2t3g1/store/appc" --authenticate_http_readonly="true"
--authenticate_http_readwrite="true" --authenticatee="crammd5" --authentication_backoff_factor="1secs"
--authorizer="local" --cgroups_cpu_enable_pids_and_tids_count="false" --cgroups_enable_cfs="false"
--cgroups_hierarchy="/sys/fs/cgroup" --cgroups_limit_swap="false" --cgroups_root="mesos" --container_disk_watch_interval="15secs"
--containerizers="mesos" --credential="/tmp/Endpoint_SlaveEndpointTest_NoAuthorizer_0_N2t3g1/credential"
--default_role="*" --disallow_sharing_agent_pid_namespace="false" --disk_watch_interval="1mins"
--docker="docker" --docker_kill_orphans="true" --docker_registry="https://registry-1.docker.io"
--docker_remove_delay="6hrs" --docker_socket="/var/run/docker.sock" --docker_stop_timeout="0ns"
--docker_store_dir="/tmp/Endpoint_SlaveEndpointTest_NoAuthorizer_0_N2t3g1/store/docker" --docker_volume_checkpoint_dir="/var/run/mesos/isolators/docker/volume"
--enforce_container_disk_quota="false" --executor_registration_timeout="1mins" --executor_reregistration_timeout="2secs"
--executor_shutdown_grace_period="5secs" --fetcher_cache_dir="/tmp/Endpoint_SlaveEndpointTest_NoAuthorizer_0_N2t3g1/fetch"
--fetcher_cache_size="2GB" --frameworks_home="" --gc_delay="1weeks" --gc_disk_headroom="0.1"
--hadoop_home="" --help="false" --hostname_lookup="true" --http_command_executor="false" --http_credentials="/tmp/Endpoint_SlaveEndpointTest_NoAuthorizer_0_N2t3g1/http_credentials"
--http_heartbeat_interval="30secs" --initialize_driver_logging="true" --isolation="posix/cpu,posix/mem"
--launcher="posix" --launcher_dir="/mesos/mesos-1.5.0/_build/src" --logbufsecs="0" --logging_level="INFO"
--max_completed_executors_per_framework="150" --oversubscribed_resources_interval="15secs"
--perf_duration="10secs" --perf_interval="1mins" --port="5051" --qos_correction_interval_min="0ns"
--quiet="false" --recover="reconnect" --recovery_timeout="15mins" --registration_backoff_factor="10ms"
--resources="cpus:2;gpus:0;mem:1024;disk:1024;ports:[31000-32000]" --revocable_cpu_low_priority="true"
--runtime_dir="/tmp/Endpoint_SlaveEndpointTest_NoAuthorizer_0_N2t3g1" --sandbox_directory="/mnt/mesos/sandbox"
--strict="true" --switch_user="true" --systemd_enable_support="true" --systemd_runtime_directory="/run/systemd/system"
--version="false" --work_dir="/tmp/Endpoint_SlaveEndpointTest_NoAuthorizer_0_FkY7Fh" --zk_session_timeout="10secs"
I0906 02:43:05.994376  6814 credentials.hpp:86] Loading credential for authentication from
'/tmp/Endpoint_SlaveEndpointTest_NoAuthorizer_0_N2t3g1/credential'
I0906 02:43:05.994539  6814 slave.cpp:285] Agent using credential for: test-principal
I0906 02:43:05.994562  6814 credentials.hpp:37] Loading credentials for authentication from
'/tmp/Endpoint_SlaveEndpointTest_NoAuthorizer_0_N2t3g1/http_credentials'
I0906 02:43:05.994879  6814 http.cpp:1045] Creating default 'basic' HTTP authenticator for
realm 'mesos-agent-readonly'
I0906 02:43:05.995110  6814 http.cpp:1045] Creating default 'basic' HTTP authenticator for
realm 'mesos-agent-readwrite'
I0906 02:43:05.996775  6814 slave.cpp:581] Agent resources: [{"name":"cpus","scalar":{"value":2.0},"type":"SCALAR"},{"name":"mem","scalar":{"value":1024.0},"type":"SCALAR"},{"name":"disk","scalar":{"value":1024.0},"type":"SCALAR"},{"name":"ports","ranges":{"range":[{"begin":31000,"end":32000}]},"type":"RANGES"}]
I0906 02:43:05.997074  6814 slave.cpp:589] Agent attributes: [  ]
I0906 02:43:05.997092  6814 slave.cpp:598] Agent hostname: df5f0d8c4260
I0906 02:43:05.997354  6811 status_update_manager.cpp:177] Pausing sending status updates
I0906 02:43:05.999145  6813 state.cpp:64] Recovering state from '/tmp/Endpoint_SlaveEndpointTest_NoAuthorizer_0_FkY7Fh/meta'
I0906 02:43:05.999413  6822 status_update_manager.cpp:203] Recovering status update manager
I0906 02:43:05.999630  6799 containerizer.cpp:648] Recovering containerizer
I0906 02:43:06.001026  6817 provisioner.cpp:416] Provisioner recovery complete
I0906 02:43:06.001525  6806 slave.cpp:6296] Finished recovery
I0906 02:43:06.001932  6806 slave.cpp:6478] Querying resource estimator for oversubscribable
resources
I0906 02:43:06.002197  6809 slave.cpp:6492] Received oversubscribable resources {} from the
resource estimator
I0906 02:43:06.004986  6815 process.cpp:3954] Handling HTTP event for process 'slave(811)'
with path: '/slave(811)/monitor/statistics'
I0906 02:43:06.006217  6817 http.cpp:1185] HTTP GET for /slave(811)/monitor/statistics from
172.17.0.3:43552
I0906 02:43:06.006285  6817 http.cpp:976] Authorizing principal 'test-principal' to GET the
'/monitor/statistics' endpoint
I0906 02:43:06.009982  6822 slave.cpp:859] Agent terminating
[       OK ] Endpoint/SlaveEndpointTest.NoAuthorizer/0 (35 ms)
[ RUN      ] Endpoint/SlaveEndpointTest.NoAuthorizer/1
I0906 02:43:06.023460  6780 containerizer.cpp:292] Using isolation { environment_secret, posix/cpu,
posix/mem, filesystem/posix, network/cni }
W0906 02:43:06.024024  6780 backend.cpp:76] Failed to create 'aufs' backend: AufsBackend requires
root privileges
W0906 02:43:06.024163  6780 backend.cpp:76] Failed to create 'bind' backend: BindBackend requires
root privileges
I0906 02:43:06.024207  6780 provisioner.cpp:255] Using default backend 'copy'
I0906 02:43:06.026129  6780 cluster.cpp:448] Creating default 'local' authorizer
I0906 02:43:06.028247  6817 slave.cpp:252] Mesos agent started on (812)@172.17.0.3:35792
I0906 02:43:06.028280  6817 slave.cpp:253] Flags at startup: --acls="" --appc_simple_discovery_uri_prefix="http://"
--appc_store_dir="/tmp/Endpoint_SlaveEndpointTest_NoAuthorizer_1_XbasWX/store/appc" --authenticate_http_readonly="true"
--authenticate_http_readwrite="true" --authenticatee="crammd5" --authentication_backoff_factor="1secs"
--authorizer="local" --cgroups_cpu_enable_pids_and_tids_count="false" --cgroups_enable_cfs="false"
--cgroups_hierarchy="/sys/fs/cgroup" --cgroups_limit_swap="false" --cgroups_root="mesos" --container_disk_watch_interval="15secs"
--containerizers="mesos" --credential="/tmp/Endpoint_SlaveEndpointTest_NoAuthorizer_1_XbasWX/credential"
--default_role="*" --disallow_sharing_agent_pid_namespace="false" --disk_watch_interval="1mins"
--docker="docker" --docker_kill_orphans="true" --docker_registry="https://registry-1.docker.io"
--docker_remove_delay="6hrs" --docker_socket="/var/run/docker.sock" --docker_stop_timeout="0ns"
--docker_store_dir="/tmp/Endpoint_SlaveEndpointTest_NoAuthorizer_1_XbasWX/store/docker" --docker_volume_checkpoint_dir="/var/run/mesos/isolators/docker/volume"
--enforce_container_disk_quota="false" --executor_registration_timeout="1mins" --executor_reregistration_timeout="2secs"
--executor_shutdown_grace_period="5secs" --fetcher_cache_dir="/tmp/Endpoint_SlaveEndpointTest_NoAuthorizer_1_XbasWX/fetch"
--fetcher_cache_size="2GB" --frameworks_home="" --gc_delay="1weeks" --gc_disk_headroom="0.1"
--hadoop_home="" --help="false" --hostname_lookup="true" --http_command_executor="false" --http_credentials="/tmp/Endpoint_SlaveEndpointTest_NoAuthorizer_1_XbasWX/http_credentials"
--http_heartbeat_interval="30secs" --initialize_driver_logging="true" --isolation="posix/cpu,posix/mem"
--launcher="posix" --launcher_dir="/mesos/mesos-1.5.0/_build/src" --logbufsecs="0" --logging_level="INFO"
--max_completed_executors_per_framework="150" --oversubscribed_resources_interval="15secs"
--perf_duration="10secs" --perf_interval="1mins" --port="5051" --qos_correction_interval_min="0ns"
--quiet="false" --recover="reconnect" --recovery_timeout="15mins" --registration_backoff_factor="10ms"
--resources="cpus:2;gpus:0;mem:1024;disk:1024;ports:[31000-32000]" --revocable_cpu_low_priority="true"
--runtime_dir="/tmp/Endpoint_SlaveEndpointTest_NoAuthorizer_1_XbasWX" --sandbox_directory="/mnt/mesos/sandbox"
--strict="true" --switch_user="true" --systemd_enable_support="true" --systemd_runtime_directory="/run/systemd/system"
--version="false" --work_dir="/tmp/Endpoint_SlaveEndpointTest_NoAuthorizer_1_XkMkge" --zk_session_timeout="10secs"
I0906 02:43:06.028875  6817 credentials.hpp:86] Loading credential for authentication from
'/tmp/Endpoint_SlaveEndpointTest_NoAuthorizer_1_XbasWX/credential'
I0906 02:43:06.029067  6817 slave.cpp:285] Agent using credential for: test-principal
I0906 02:43:06.029103  6817 credentials.hpp:37] Loading credentials for authentication from
'/tmp/Endpoint_SlaveEndpointTest_NoAuthorizer_1_XbasWX/http_credentials'
I0906 02:43:06.029407  6817 http.cpp:1045] Creating default 'basic' HTTP authenticator for
realm 'mesos-agent-readonly'
I0906 02:43:06.029611  6817 http.cpp:1045] Creating default 'basic' HTTP authenticator for
realm 'mesos-agent-readwrite'
I0906 02:43:06.031174  6817 slave.cpp:581] Agent resources: [{"name":"cpus","scalar":{"value":2.0},"type":"SCALAR"},{"name":"mem","scalar":{"value":1024.0},"type":"SCALAR"},{"name":"disk","scalar":{"value":1024.0},"type":"SCALAR"},{"name":"ports","ranges":{"range":[{"begin":31000,"end":32000}]},"type":"RANGES"}]
I0906 02:43:06.031440  6817 slave.cpp:589] Agent attributes: [  ]
I0906 02:43:06.031453  6817 slave.cpp:598] Agent hostname: df5f0d8c4260
I0906 02:43:06.031625  6816 status_update_manager.cpp:177] Pausing sending status updates
I0906 02:43:06.033258  6799 state.cpp:64] Recovering state from '/tmp/Endpoint_SlaveEndpointTest_NoAuthorizer_1_XkMkge/meta'
I0906 02:43:06.033612  6814 status_update_manager.cpp:203] Recovering status update manager
I0906 02:43:06.033779  6802 containerizer.cpp:648] Recovering containerizer
I0906 02:43:06.035298  6820 provisioner.cpp:416] Provisioner recovery complete
I0906 02:43:06.035737  6812 slave.cpp:6296] Finished recovery
I0906 02:43:06.036288  6812 slave.cpp:6478] Querying resource estimator for oversubscribable
resources
I0906 02:43:06.036521  6810 slave.cpp:6492] Received oversubscribable resources {} from the
resource estimator
I0906 02:43:06.038857  6813 process.cpp:3954] Handling HTTP event for process 'slave(812)'
with path: '/slave(812)/monitor/statistics.json'
I0906 02:43:06.040347  6814 http.cpp:1185] HTTP GET for /slave(812)/monitor/statistics.json
from 172.17.0.3:43554
I0906 02:43:06.040431  6814 http.cpp:976] Authorizing principal 'test-principal' to GET the
'/monitor/statistics.json' endpoint
I0906 02:43:06.044503  6780 slave.cpp:859] Agent terminating
[       OK ] Endpoint/SlaveEndpointTest.NoAuthorizer/1 (33 ms)
[ RUN      ] Endpoint/SlaveEndpointTest.NoAuthorizer/2
I0906 02:43:06.056613  6780 containerizer.cpp:292] Using isolation { environment_secret, posix/cpu,
posix/mem, filesystem/posix, network/cni }
W0906 02:43:06.057081  6780 backend.cpp:76] Failed to create 'aufs' backend: AufsBackend requires
root privileges
W0906 02:43:06.057189  6780 backend.cpp:76] Failed to create 'bind' backend: BindBackend requires
root privileges
I0906 02:43:06.057224  6780 provisioner.cpp:255] Using default backend 'copy'
I0906 02:43:06.058867  6780 cluster.cpp:448] Creating default 'local' authorizer
I0906 02:43:06.061260  6806 slave.cpp:252] Mesos agent started on (813)@172.17.0.3:35792
I0906 02:43:06.061309  6806 slave.cpp:253] Flags at startup: --acls="" --appc_simple_discovery_uri_prefix="http://"
--appc_store_dir="/tmp/Endpoint_SlaveEndpointTest_NoAuthorizer_2_3pjUVU/store/appc" --authenticate_http_readonly="true"
--authenticate_http_readwrite="true" --authenticatee="crammd5" --authentication_backoff_factor="1secs"
--authorizer="local" --cgroups_cpu_enable_pids_and_tids_count="false" --cgroups_enable_cfs="false"
--cgroups_hierarchy="/sys/fs/cgroup" --cgroups_limit_swap="false" --cgroups_root="mesos" --container_disk_watch_interval="15secs"
--containerizers="mesos" --credential="/tmp/Endpoint_SlaveEndpointTest_NoAuthorizer_2_3pjUVU/credential"
--default_role="*" --disallow_sharing_agent_pid_namespace="false" --disk_watch_interval="1mins"
--docker="docker" --docker_kill_orphans="true" --docker_registry="https://registry-1.docker.io"
--docker_remove_delay="6hrs" --docker_socket="/var/run/docker.sock" --docker_stop_timeout="0ns"
--docker_store_dir="/tmp/Endpoint_SlaveEndpointTest_NoAuthorizer_2_3pjUVU/store/docker" --docker_volume_checkpoint_dir="/var/run/mesos/isolators/docker/volume"
--enforce_container_disk_quota="false" --executor_registration_timeout="1mins" --executor_reregistration_timeout="2secs"
--executor_shutdown_grace_period="5secs" --fetcher_cache_dir="/tmp/Endpoint_SlaveEndpointTest_NoAuthorizer_2_3pjUVU/fetch"
--fetcher_cache_size="2GB" --frameworks_home="" --gc_delay="1weeks" --gc_disk_headroom="0.1"
--hadoop_home="" --help="false" --hostname_lookup="true" --http_command_executor="false" --http_credentials="/tmp/Endpoint_SlaveEndpointTest_NoAuthorizer_2_3pjUVU/http_credentials"
--http_heartbeat_interval="30secs" --initialize_driver_logging="true" --isolation="posix/cpu,posix/mem"
--launcher="posix" --launcher_dir="/mesos/mesos-1.5.0/_build/src" --logbufsecs="0" --logging_level="INFO"
--max_completed_executors_per_framework="150" --oversubscribed_resources_interval="15secs"
--perf_duration="10secs" --perf_interval="1mins" --port="5051" --qos_correction_interval_min="0ns"
--quiet="false" --recover="reconnect" --recovery_timeout="15mins" --registration_backoff_factor="10ms"
--resources="cpus:2;gpus:0;mem:1024;disk:1024;ports:[31000-32000]" --revocable_cpu_low_priority="true"
--runtime_dir="/tmp/Endpoint_SlaveEndpointTest_NoAuthorizer_2_3pjUVU" --sandbox_directory="/mnt/mesos/sandbox"
--strict="true" --switch_user="true" --systemd_enable_support="true" --systemd_runtime_directory="/run/systemd/system"
--version="false" --work_dir="/tmp/Endpoint_SlaveEndpointTest_NoAuthorizer_2_fXnOab" --zk_session_timeout="10secs"
I0906 02:43:06.062125  6806 credentials.hpp:86] Loading credential for authentication from
'/tmp/Endpoint_SlaveEndpointTest_NoAuthorizer_2_3pjUVU/credential'
I0906 02:43:06.062360  6806 slave.cpp:285] Agent using credential for: test-principal
I0906 02:43:06.062403  6806 credentials.hpp:37] Loading credentials for authentication from
'/tmp/Endpoint_SlaveEndpointTest_NoAuthorizer_2_3pjUVU/http_credentials'
I0906 02:43:06.062795  6806 http.cpp:1045] Creating default 'basic' HTTP authenticator for
realm 'mesos-agent-readonly'
I0906 02:43:06.062978  6806 http.cpp:1045] Creating default 'basic' HTTP authenticator for
realm 'mesos-agent-readwrite'
I0906 02:43:06.064350  6806 slave.cpp:581] Agent resources: [{"name":"cpus","scalar":{"value":2.0},"type":"SCALAR"},{"name":"mem","scalar":{"value":1024.0},"type":"SCALAR"},{"name":"disk","scalar":{"value":1024.0},"type":"SCALAR"},{"name":"ports","ranges":{"range":[{"begin":31000,"end":32000}]},"type":"RANGES"}]
I0906 02:43:06.064584  6806 slave.cpp:589] Agent attributes: [  ]
I0906 02:43:06.064607  6806 slave.cpp:598] Agent hostname: df5f0d8c4260
I0906 02:43:06.064859  6819 status_update_manager.cpp:177] Pausing sending status updates
I0906 02:43:06.066179  6808 state.cpp:64] Recovering state from '/tmp/Endpoint_SlaveEndpointTest_NoAuthorizer_2_fXnOab/meta'
I0906 02:43:06.066527  6809 status_update_manager.cpp:203] Recovering status update manager
I0906 02:43:06.066818  6809 containerizer.cpp:648] Recovering containerizer
I0906 02:43:06.068619  6814 provisioner.cpp:416] Provisioner recovery complete
I0906 02:43:06.068964  6822 slave.cpp:6296] Finished recovery
I0906 02:43:06.069403  6822 slave.cpp:6478] Querying resource estimator for oversubscribable
resources
I0906 02:43:06.069656  6820 slave.cpp:6492] Received oversubscribable resources {} from the
resource estimator
I0906 02:43:06.071931  6816 process.cpp:3954] Handling HTTP event for process 'slave(813)'
with path: '/slave(813)/containers'
I0906 02:43:06.073371  6802 http.cpp:1185] HTTP GET for /slave(813)/containers from 172.17.0.3:43556
I0906 02:43:06.073458  6802 http.cpp:976] Authorizing principal 'test-principal' to GET the
'/containers' endpoint
I0906 02:43:06.078042  6810 slave.cpp:859] Agent terminating
[       OK ] Endpoint/SlaveEndpointTest.NoAuthorizer/2 (33 ms)
[----------] 9 tests from Endpoint/SlaveEndpointTest (317 ms total)

[----------] 2 tests from ContainerizerType/DefaultContainerDNSFlagTest
[ RUN      ] ContainerizerType/DefaultContainerDNSFlagTest.ValidateFlag/0
[       OK ] ContainerizerType/DefaultContainerDNSFlagTest.ValidateFlag/0 (10 ms)
[ RUN      ] ContainerizerType/DefaultContainerDNSFlagTest.ValidateFlag/1
[       OK ] ContainerizerType/DefaultContainerDNSFlagTest.ValidateFlag/1 (10 ms)
[----------] 2 tests from ContainerizerType/DefaultContainerDNSFlagTest (20 ms total)

[----------] Global test environment tear-down
[==========] 1664 tests from 183 test cases ran. (526442 ms total)
[  PASSED  ] 1663 tests.
[  FAILED  ] 1 test, listed below:
[  FAILED  ] ExamplesTest.DynamicReservationFramework

 1 FAILED TEST
  YOU HAVE 20 DISABLED TESTS

I0906 02:43:06.167263  6823 process.cpp:1072] Failed to accept socket: future discarded
make[4]: *** [check-local] Error 1
make[4]: Leaving directory `/mesos/mesos-1.5.0/_build/src'
make[3]: *** [check-am] Error 2
make[3]: Leaving directory `/mesos/mesos-1.5.0/_build/src'
make[2]: *** [check] Error 2
make[2]: Leaving directory `/mesos/mesos-1.5.0/_build/src'
make[1]: *** [check-recursive] Error 1
make[1]: Leaving directory `/mesos/mesos-1.5.0/_build'
make: *** [distcheck] Error 1
+ docker rmi mesos-1504663274-26687
Untagged: mesos-1504663274-26687:latest
Deleted: sha256:8babb87e377d1050d2e34c3ff22eeeacaf5dda00c5a7d7ec50339732e8324727
Deleted: sha256:5f07b52191d3d241e197bc9e50bbe87f453effd6045c4a8492348309053c48c3
Deleted: sha256:453af4b1a534560ce4a854b038db0f465365008110826f551ee0d228823322f5
Deleted: sha256:42a840e888e503c468a9b630d490c06dcaf5a52db48d59f5fc874256fdd61e5a
Deleted: sha256:1c41fc1dd7eb633d5b5ed2d856699514d480492ca7cff5fd8a65e268e23896bb
Deleted: sha256:4702b1d3a6b20c173645845ee7b7d070b672d6703a56c565e6c1fcbd2ec464bc
Deleted: sha256:dc0624c7e379957d78ecf6b5123a90aa2bd3380230e85ff800ff5c1efe5bc14e
Deleted: sha256:b84fce349eb70372cf49f9071f08477a2943b1b58df6c4f3b8a5e20a8b556143
Deleted: sha256:57549e054a6b29a42bffcbb9e16f18631d95f01ffc7c0e4c8f7034f9c7277def
Deleted: sha256:a68c032a3a88aef5bb76e3aefdc67b3246090392b37881bab91078c7265268c4
Deleted: sha256:c21691e2ade2bfc1f6ffbd1f338847ee0fb82fc6c6cc21dc50673cae8fb2e039
Deleted: sha256:33799f89554cb6fb453f1f19339211a521131088ee3dc5f4ae421f994a12ae5c
Deleted: sha256:aec03a05d742576cae7102d64b8179fe0435d1862389f346dba398a3aa7ce47a
Deleted: sha256:54d6c274875c17d7aafa07eae62021f51add44d1aa34d1a7924c122aa9a121b7
Deleted: sha256:b60d0aaec16b80a649c96c55e545041122d14ef1c0abcb76ec02d6d8a96ff386
Deleted: sha256:0a64536c6bd082caa9015fe9caa0eeeebf14f4f18142aa0648069edf2edb0803
Deleted: sha256:b1fa7bee78ef5ec386bfc6db805a25b051634e6d1ee81ee91b657b891b56a720
Deleted: sha256:660e33d88ed59b0ce3435b298f8cdb21e7a4e58288c9d0786f2b3392f80fbd74
Deleted: sha256:b7ed1c82a0650c611d186677a4afa203b7dc571d5b0c47d328ab302fe034f644
Deleted: sha256:9e2a4cfceedcb4b95a7e77981295f491bacf665a56bdaa48f4076c944b8ab005
Deleted: sha256:e7220a055cae1bd4ca91673b7d0c78e057fb8d27a179468547276f1baaf08e75
Deleted: sha256:b526eb32e1aebf6883281c5eac2c5253b880271883e7cdad4430d2fc631775e9
Deleted: sha256:cf4f7babd0df13f00bb66bcaea9df2098e5040a866e47db50ac5e25cf5bbabdc
Deleted: sha256:691149c6fbed6c65566dcc8a144aefdda71ca71006b5af080628eb7d1858bc59
Deleted: sha256:f4bc96da53fc2e85dea7ffbeeea686ed5533b06bf5354c858eb5610a8d8169d0
Build step 'Execute shell' marked build as failure
Not sending mail to unregistered user yujie.jay@gmail.com
Not sending mail to unregistered user songzihao1990@gmail.com

Mime
View raw message