mesos-builds mailing list archives

Site index · List index
Message view « Date » · « Thread »
Top « Date » · « Thread »
From Apache Jenkins Server <jenk...@builds.apache.org>
Subject Build failed in Jenkins: Mesos-Reviewbot #19487
Date Wed, 20 Sep 2017 19:50:30 GMT
See <https://builds.apache.org/job/Mesos-Reviewbot/19487/display/redirect>

------------------------------------------
[...truncated 31.70 MB...]
I0920 19:50:24.074594  5810 credentials.hpp:37] Loading credentials for authentication from
'/tmp/Endpoint_SlaveEndpointTest_AuthorizedRequest_2_CubVFu/http_credentials'
I0920 19:50:24.074852  5810 http.cpp:1045] Creating default 'basic' HTTP authenticator for
realm 'mesos-agent-readonly'
I0920 19:50:24.075027  5810 http.cpp:1045] Creating default 'basic' HTTP authenticator for
realm 'mesos-agent-readwrite'
I0920 19:50:24.076372  5810 slave.cpp:583] Agent resources: [{"name":"cpus","scalar":{"value":2.0},"type":"SCALAR"},{"name":"mem","scalar":{"value":1024.0},"type":"SCALAR"},{"name":"disk","scalar":{"value":1024.0},"type":"SCALAR"},{"name":"ports","ranges":{"range":[{"begin":31000,"end":32000}]},"type":"RANGES"}]
I0920 19:50:24.076637  5810 slave.cpp:591] Agent attributes: [  ]
I0920 19:50:24.076652  5810 slave.cpp:600] Agent hostname: b6a30ce187c2
I0920 19:50:24.076771  5806 status_update_manager.cpp:177] Pausing sending status updates
I0920 19:50:24.078433  5812 state.cpp:64] Recovering state from '/tmp/Endpoint_SlaveEndpointTest_AuthorizedRequest_2_c90x6o/meta'
I0920 19:50:24.078761  5812 status_update_manager.cpp:203] Recovering status update manager
I0920 19:50:24.079017  5794 containerizer.cpp:648] Recovering containerizer
I0920 19:50:24.080332  5803 provisioner.cpp:416] Provisioner recovery complete
I0920 19:50:24.080689  5806 slave.cpp:6320] Finished recovery
I0920 19:50:24.081094  5806 slave.cpp:6502] Querying resource estimator for oversubscribable
resources
I0920 19:50:24.081327  5805 slave.cpp:6516] Received oversubscribable resources {} from the
resource estimator
I0920 19:50:24.084673  5802 process.cpp:3929] Handling HTTP event for process 'slave(811)'
with path: '/slave(811)/containers'
I0920 19:50:24.085775  5814 http.cpp:1185] HTTP GET for /slave(811)/containers from 172.17.0.3:37818
I0920 19:50:24.085839  5814 http.cpp:976] Authorizing principal 'test-principal' to GET the
'/containers' endpoint
I0920 19:50:24.088910  5810 slave.cpp:867] Agent terminating
[       OK ] Endpoint/SlaveEndpointTest.AuthorizedRequest/2 (29 ms)
[ RUN      ] Endpoint/SlaveEndpointTest.UnauthorizedRequest/0
I0920 19:50:24.099364  5774 containerizer.cpp:292] Using isolation { environment_secret, posix/cpu,
posix/mem, filesystem/posix, network/cni }
W0920 19:50:24.099855  5774 backend.cpp:76] Failed to create 'aufs' backend: AufsBackend requires
root privileges
W0920 19:50:24.099963  5774 backend.cpp:76] Failed to create 'bind' backend: BindBackend requires
root privileges
I0920 19:50:24.099994  5774 provisioner.cpp:255] Using default backend 'copy'
I0920 19:50:24.103302  5800 slave.cpp:252] Mesos agent started on (812)@172.17.0.3:44135
I0920 19:50:24.103322  5800 slave.cpp:253] Flags at startup: --acls="" --appc_simple_discovery_uri_prefix="http://"
--appc_store_dir="/tmp/Endpoint_SlaveEndpointTest_UnauthorizedRequest_0_m0jdcR/store/appc"
--authenticate_http_readonly="true" --authenticate_http_readwrite="true" --authenticatee="crammd5"
--authentication_backoff_factor="1secs" --authorizer="local" --cgroups_cpu_enable_pids_and_tids_count="false"
--cgroups_enable_cfs="false" --cgroups_hierarchy="/sys/fs/cgroup" --cgroups_limit_swap="false"
--cgroups_root="mesos" --container_disk_watch_interval="15secs" --containerizers="mesos" --credential="/tmp/Endpoint_SlaveEndpointTest_UnauthorizedRequest_0_m0jdcR/credential"
--default_role="*" --disallow_sharing_agent_pid_namespace="false" --disk_watch_interval="1mins"
--docker="docker" --docker_kill_orphans="true" --docker_registry="https://registry-1.docker.io"
--docker_remove_delay="6hrs" --docker_socket="/var/run/docker.sock" --docker_stop_timeout="0ns"
--docker_store_dir="/tmp/Endpoint_SlaveEndpointTest_UnauthorizedRequest_0_m0jdcR/store/docker"
--docker_volume_checkpoint_dir="/var/run/mesos/isolators/docker/volume" --enforce_container_disk_quota="false"
--executor_registration_timeout="1mins" --executor_reregistration_timeout="2secs" --executor_shutdown_grace_period="5secs"
--fetcher_cache_dir="/tmp/Endpoint_SlaveEndpointTest_UnauthorizedRequest_0_m0jdcR/fetch" --fetcher_cache_size="2GB"
--frameworks_home="" --gc_delay="1weeks" --gc_disk_headroom="0.1" --hadoop_home="" --help="false"
--hostname_lookup="true" --http_command_executor="false" --http_credentials="/tmp/Endpoint_SlaveEndpointTest_UnauthorizedRequest_0_m0jdcR/http_credentials"
--http_heartbeat_interval="30secs" --initialize_driver_logging="true" --isolation="posix/cpu,posix/mem"
--launcher="posix" --launcher_dir="/mesos/mesos-1.5.0/_build/src" --logbufsecs="0" --logging_level="INFO"
--max_completed_executors_per_framework="150" --oversubscribed_resources_interval="15secs"
--perf_duration="10secs" --perf_interval="1mins" --port="5051" --qos_correction_interval_min="0ns"
--quiet="false" --recover="reconnect" --recovery_timeout="15mins" --registration_backoff_factor="10ms"
--resources="cpus:2;gpus:0;mem:1024;disk:1024;ports:[31000-32000]" --revocable_cpu_low_priority="true"
--runtime_dir="/tmp/Endpoint_SlaveEndpointTest_UnauthorizedRequest_0_m0jdcR" --sandbox_directory="/mnt/mesos/sandbox"
--strict="true" --switch_user="true" --systemd_enable_support="true" --systemd_runtime_directory="/run/systemd/system"
--version="false" --work_dir="/tmp/Endpoint_SlaveEndpointTest_UnauthorizedRequest_0_c6ftyL"
--zk_session_timeout="10secs"
I0920 19:50:24.103703  5800 credentials.hpp:86] Loading credential for authentication from
'/tmp/Endpoint_SlaveEndpointTest_UnauthorizedRequest_0_m0jdcR/credential'
I0920 19:50:24.103852  5800 slave.cpp:285] Agent using credential for: test-principal
I0920 19:50:24.103873  5800 credentials.hpp:37] Loading credentials for authentication from
'/tmp/Endpoint_SlaveEndpointTest_UnauthorizedRequest_0_m0jdcR/http_credentials'
I0920 19:50:24.104142  5800 http.cpp:1045] Creating default 'basic' HTTP authenticator for
realm 'mesos-agent-readonly'
I0920 19:50:24.104310  5800 http.cpp:1045] Creating default 'basic' HTTP authenticator for
realm 'mesos-agent-readwrite'
I0920 19:50:24.105691  5800 slave.cpp:583] Agent resources: [{"name":"cpus","scalar":{"value":2.0},"type":"SCALAR"},{"name":"mem","scalar":{"value":1024.0},"type":"SCALAR"},{"name":"disk","scalar":{"value":1024.0},"type":"SCALAR"},{"name":"ports","ranges":{"range":[{"begin":31000,"end":32000}]},"type":"RANGES"}]
I0920 19:50:24.105927  5800 slave.cpp:591] Agent attributes: [  ]
I0920 19:50:24.105942  5800 slave.cpp:600] Agent hostname: b6a30ce187c2
I0920 19:50:24.106102  5796 status_update_manager.cpp:177] Pausing sending status updates
I0920 19:50:24.107450  5793 state.cpp:64] Recovering state from '/tmp/Endpoint_SlaveEndpointTest_UnauthorizedRequest_0_c6ftyL/meta'
I0920 19:50:24.107700  5793 status_update_manager.cpp:203] Recovering status update manager
I0920 19:50:24.107928  5810 containerizer.cpp:648] Recovering containerizer
I0920 19:50:24.109202  5808 provisioner.cpp:416] Provisioner recovery complete
I0920 19:50:24.109550  5796 slave.cpp:6320] Finished recovery
I0920 19:50:24.109979  5796 slave.cpp:6502] Querying resource estimator for oversubscribable
resources
I0920 19:50:24.110229  5816 slave.cpp:6516] Received oversubscribable resources {} from the
resource estimator
I0920 19:50:24.112632  5807 process.cpp:3929] Handling HTTP event for process 'slave(812)'
with path: '/slave(812)/monitor/statistics'
I0920 19:50:24.113894  5799 http.cpp:1185] HTTP GET for /slave(812)/monitor/statistics from
172.17.0.3:37820
I0920 19:50:24.113966  5799 http.cpp:976] Authorizing principal 'test-principal' to GET the
'/monitor/statistics' endpoint
I0920 19:50:24.115789  5799 slave.cpp:867] Agent terminating
[       OK ] Endpoint/SlaveEndpointTest.UnauthorizedRequest/0 (27 ms)
[ RUN      ] Endpoint/SlaveEndpointTest.UnauthorizedRequest/1
I0920 19:50:24.127190  5774 containerizer.cpp:292] Using isolation { environment_secret, posix/cpu,
posix/mem, filesystem/posix, network/cni }
W0920 19:50:24.127688  5774 backend.cpp:76] Failed to create 'aufs' backend: AufsBackend requires
root privileges
W0920 19:50:24.127800  5774 backend.cpp:76] Failed to create 'bind' backend: BindBackend requires
root privileges
I0920 19:50:24.127831  5774 provisioner.cpp:255] Using default backend 'copy'
I0920 19:50:24.131842  5815 slave.cpp:252] Mesos agent started on (813)@172.17.0.3:44135
I0920 19:50:24.131868  5815 slave.cpp:253] Flags at startup: --acls="" --appc_simple_discovery_uri_prefix="http://"
--appc_store_dir="/tmp/Endpoint_SlaveEndpointTest_UnauthorizedRequest_1_UkLaZd/store/appc"
--authenticate_http_readonly="true" --authenticate_http_readwrite="true" --authenticatee="crammd5"
--authentication_backoff_factor="1secs" --authorizer="local" --cgroups_cpu_enable_pids_and_tids_count="false"
--cgroups_enable_cfs="false" --cgroups_hierarchy="/sys/fs/cgroup" --cgroups_limit_swap="false"
--cgroups_root="mesos" --container_disk_watch_interval="15secs" --containerizers="mesos" --credential="/tmp/Endpoint_SlaveEndpointTest_UnauthorizedRequest_1_UkLaZd/credential"
--default_role="*" --disallow_sharing_agent_pid_namespace="false" --disk_watch_interval="1mins"
--docker="docker" --docker_kill_orphans="true" --docker_registry="https://registry-1.docker.io"
--docker_remove_delay="6hrs" --docker_socket="/var/run/docker.sock" --docker_stop_timeout="0ns"
--docker_store_dir="/tmp/Endpoint_SlaveEndpointTest_UnauthorizedRequest_1_UkLaZd/store/docker"
--docker_volume_checkpoint_dir="/var/run/mesos/isolators/docker/volume" --enforce_container_disk_quota="false"
--executor_registration_timeout="1mins" --executor_reregistration_timeout="2secs" --executor_shutdown_grace_period="5secs"
--fetcher_cache_dir="/tmp/Endpoint_SlaveEndpointTest_UnauthorizedRequest_1_UkLaZd/fetch" --fetcher_cache_size="2GB"
--frameworks_home="" --gc_delay="1weeks" --gc_disk_headroom="0.1" --hadoop_home="" --help="false"
--hostname_lookup="true" --http_command_executor="false" --http_credentials="/tmp/Endpoint_SlaveEndpointTest_UnauthorizedRequest_1_UkLaZd/http_credentials"
--http_heartbeat_interval="30secs" --initialize_driver_logging="true" --isolation="posix/cpu,posix/mem"
--launcher="posix" --launcher_dir="/mesos/mesos-1.5.0/_build/src" --logbufsecs="0" --logging_level="INFO"
--max_completed_executors_per_framework="150" --oversubscribed_resources_interval="15secs"
--perf_duration="10secs" --perf_interval="1mins" --port="5051" --qos_correction_interval_min="0ns"
--quiet="false" --recover="reconnect" --recovery_timeout="15mins" --registration_backoff_factor="10ms"
--resources="cpus:2;gpus:0;mem:1024;disk:1024;ports:[31000-32000]" --revocable_cpu_low_priority="true"
--runtime_dir="/tmp/Endpoint_SlaveEndpointTest_UnauthorizedRequest_1_UkLaZd" --sandbox_directory="/mnt/mesos/sandbox"
--strict="true" --switch_user="true" --systemd_enable_support="true" --systemd_runtime_directory="/run/systemd/system"
--version="false" --work_dir="/tmp/Endpoint_SlaveEndpointTest_UnauthorizedRequest_1_uXTih8"
--zk_session_timeout="10secs"
I0920 19:50:24.132226  5815 credentials.hpp:86] Loading credential for authentication from
'/tmp/Endpoint_SlaveEndpointTest_UnauthorizedRequest_1_UkLaZd/credential'
I0920 19:50:24.132383  5815 slave.cpp:285] Agent using credential for: test-principal
I0920 19:50:24.132405  5815 credentials.hpp:37] Loading credentials for authentication from
'/tmp/Endpoint_SlaveEndpointTest_UnauthorizedRequest_1_UkLaZd/http_credentials'
I0920 19:50:24.132658  5815 http.cpp:1045] Creating default 'basic' HTTP authenticator for
realm 'mesos-agent-readonly'
I0920 19:50:24.132813  5815 http.cpp:1045] Creating default 'basic' HTTP authenticator for
realm 'mesos-agent-readwrite'
I0920 19:50:24.134162  5815 slave.cpp:583] Agent resources: [{"name":"cpus","scalar":{"value":2.0},"type":"SCALAR"},{"name":"mem","scalar":{"value":1024.0},"type":"SCALAR"},{"name":"disk","scalar":{"value":1024.0},"type":"SCALAR"},{"name":"ports","ranges":{"range":[{"begin":31000,"end":32000}]},"type":"RANGES"}]
I0920 19:50:24.134397  5815 slave.cpp:591] Agent attributes: [  ]
I0920 19:50:24.134412  5815 slave.cpp:600] Agent hostname: b6a30ce187c2
I0920 19:50:24.134546  5793 status_update_manager.cpp:177] Pausing sending status updates
I0920 19:50:24.136086  5801 state.cpp:64] Recovering state from '/tmp/Endpoint_SlaveEndpointTest_UnauthorizedRequest_1_uXTih8/meta'
I0920 19:50:24.136322  5801 status_update_manager.cpp:203] Recovering status update manager
I0920 19:50:24.136500  5799 containerizer.cpp:648] Recovering containerizer
I0920 19:50:24.137877  5806 provisioner.cpp:416] Provisioner recovery complete
I0920 19:50:24.138170  5793 slave.cpp:6320] Finished recovery
I0920 19:50:24.138617  5793 slave.cpp:6502] Querying resource estimator for oversubscribable
resources
I0920 19:50:24.138846  5809 slave.cpp:6516] Received oversubscribable resources {} from the
resource estimator
I0920 19:50:24.141053  5803 process.cpp:3929] Handling HTTP event for process 'slave(813)'
with path: '/slave(813)/monitor/statistics.json'
I0920 19:50:24.142210  5797 http.cpp:1185] HTTP GET for /slave(813)/monitor/statistics.json
from 172.17.0.3:37824
I0920 19:50:24.142277  5797 http.cpp:976] Authorizing principal 'test-principal' to GET the
'/monitor/statistics.json' endpoint
I0920 19:50:24.143822  5774 slave.cpp:867] Agent terminating
[       OK ] Endpoint/SlaveEndpointTest.UnauthorizedRequest/1 (26 ms)
[ RUN      ] Endpoint/SlaveEndpointTest.UnauthorizedRequest/2
I0920 19:50:24.153849  5774 containerizer.cpp:292] Using isolation { environment_secret, posix/cpu,
posix/mem, filesystem/posix, network/cni }
W0920 19:50:24.154322  5774 backend.cpp:76] Failed to create 'aufs' backend: AufsBackend requires
root privileges
W0920 19:50:24.154425  5774 backend.cpp:76] Failed to create 'bind' backend: BindBackend requires
root privileges
I0920 19:50:24.154456  5774 provisioner.cpp:255] Using default backend 'copy'
I0920 19:50:24.157737  5806 slave.cpp:252] Mesos agent started on (814)@172.17.0.3:44135
I0920 19:50:24.157759  5806 slave.cpp:253] Flags at startup: --acls="" --appc_simple_discovery_uri_prefix="http://"
--appc_store_dir="/tmp/Endpoint_SlaveEndpointTest_UnauthorizedRequest_2_Ow4o2A/store/appc"
--authenticate_http_readonly="true" --authenticate_http_readwrite="true" --authenticatee="crammd5"
--authentication_backoff_factor="1secs" --authorizer="local" --cgroups_cpu_enable_pids_and_tids_count="false"
--cgroups_enable_cfs="false" --cgroups_hierarchy="/sys/fs/cgroup" --cgroups_limit_swap="false"
--cgroups_root="mesos" --container_disk_watch_interval="15secs" --containerizers="mesos" --credential="/tmp/Endpoint_SlaveEndpointTest_UnauthorizedRequest_2_Ow4o2A/credential"
--default_role="*" --disallow_sharing_agent_pid_namespace="false" --disk_watch_interval="1mins"
--docker="docker" --docker_kill_orphans="true" --docker_registry="https://registry-1.docker.io"
--docker_remove_delay="6hrs" --docker_socket="/var/run/docker.sock" --docker_stop_timeout="0ns"
--docker_store_dir="/tmp/Endpoint_SlaveEndpointTest_UnauthorizedRequest_2_Ow4o2A/store/docker"
--docker_volume_checkpoint_dir="/var/run/mesos/isolators/docker/volume" --enforce_container_disk_quota="false"
--executor_registration_timeout="1mins" --executor_reregistration_timeout="2secs" --executor_shutdown_grace_period="5secs"
--fetcher_cache_dir="/tmp/Endpoint_SlaveEndpointTest_UnauthorizedRequest_2_Ow4o2A/fetch" --fetcher_cache_size="2GB"
--frameworks_home="" --gc_delay="1weeks" --gc_disk_headroom="0.1" --hadoop_home="" --help="false"
--hostname_lookup="true" --http_command_executor="false" --http_credentials="/tmp/Endpoint_SlaveEndpointTest_UnauthorizedRequest_2_Ow4o2A/http_credentials"
--http_heartbeat_interval="30secs" --initialize_driver_logging="true" --isolation="posix/cpu,posix/mem"
--launcher="posix" --launcher_dir="/mesos/mesos-1.5.0/_build/src" --logbufsecs="0" --logging_level="INFO"
--max_completed_executors_per_framework="150" --oversubscribed_resources_interval="15secs"
--perf_duration="10secs" --perf_interval="1mins" --port="5051" --qos_correction_interval_min="0ns"
--quiet="false" --recover="reconnect" --recovery_timeout="15mins" --registration_backoff_factor="10ms"
--resources="cpus:2;gpus:0;mem:1024;disk:1024;ports:[31000-32000]" --revocable_cpu_low_priority="true"
--runtime_dir="/tmp/Endpoint_SlaveEndpointTest_UnauthorizedRequest_2_Ow4o2A" --sandbox_directory="/mnt/mesos/sandbox"
--strict="true" --switch_user="true" --systemd_enable_support="true" --systemd_runtime_directory="/run/systemd/system"
--version="false" --work_dir="/tmp/Endpoint_SlaveEndpointTest_UnauthorizedRequest_2_ulDxgv"
--zk_session_timeout="10secs"
I0920 19:50:24.158159  5806 credentials.hpp:86] Loading credential for authentication from
'/tmp/Endpoint_SlaveEndpointTest_UnauthorizedRequest_2_Ow4o2A/credential'
I0920 19:50:24.158301  5806 slave.cpp:285] Agent using credential for: test-principal
I0920 19:50:24.158324  5806 credentials.hpp:37] Loading credentials for authentication from
'/tmp/Endpoint_SlaveEndpointTest_UnauthorizedRequest_2_Ow4o2A/http_credentials'
I0920 19:50:24.158620  5806 http.cpp:1045] Creating default 'basic' HTTP authenticator for
realm 'mesos-agent-readonly'
I0920 19:50:24.158767  5806 http.cpp:1045] Creating default 'basic' HTTP authenticator for
realm 'mesos-agent-readwrite'
I0920 19:50:24.160131  5806 slave.cpp:583] Agent resources: [{"name":"cpus","scalar":{"value":2.0},"type":"SCALAR"},{"name":"mem","scalar":{"value":1024.0},"type":"SCALAR"},{"name":"disk","scalar":{"value":1024.0},"type":"SCALAR"},{"name":"ports","ranges":{"range":[{"begin":31000,"end":32000}]},"type":"RANGES"}]
I0920 19:50:24.160354  5806 slave.cpp:591] Agent attributes: [  ]
I0920 19:50:24.160367  5806 slave.cpp:600] Agent hostname: b6a30ce187c2
I0920 19:50:24.160492  5796 status_update_manager.cpp:177] Pausing sending status updates
I0920 19:50:24.161906  5799 state.cpp:64] Recovering state from '/tmp/Endpoint_SlaveEndpointTest_UnauthorizedRequest_2_ulDxgv/meta'
I0920 19:50:24.162175  5805 status_update_manager.cpp:203] Recovering status update manager
I0920 19:50:24.162385  5794 containerizer.cpp:648] Recovering containerizer
I0920 19:50:24.163492  5801 provisioner.cpp:416] Provisioner recovery complete
I0920 19:50:24.163780  5796 slave.cpp:6320] Finished recovery
I0920 19:50:24.164144  5796 slave.cpp:6502] Querying resource estimator for oversubscribable
resources
I0920 19:50:24.164377  5812 slave.cpp:6516] Received oversubscribable resources {} from the
resource estimator
I0920 19:50:24.166599  5810 process.cpp:3929] Handling HTTP event for process 'slave(814)'
with path: '/slave(814)/containers'
I0920 19:50:24.167697  5795 http.cpp:1185] HTTP GET for /slave(814)/containers from 172.17.0.3:37830
I0920 19:50:24.167759  5795 http.cpp:976] Authorizing principal 'test-principal' to GET the
'/containers' endpoint
I0920 19:50:24.169607  5802 slave.cpp:867] Agent terminating
[       OK ] Endpoint/SlaveEndpointTest.UnauthorizedRequest/2 (26 ms)
[ RUN      ] Endpoint/SlaveEndpointTest.NoAuthorizer/0
I0920 19:50:24.184872  5774 containerizer.cpp:292] Using isolation { environment_secret, posix/cpu,
posix/mem, filesystem/posix, network/cni }
W0920 19:50:24.185492  5774 backend.cpp:76] Failed to create 'aufs' backend: AufsBackend requires
root privileges
W0920 19:50:24.185622  5774 backend.cpp:76] Failed to create 'bind' backend: BindBackend requires
root privileges
I0920 19:50:24.185654  5774 provisioner.cpp:255] Using default backend 'copy'
I0920 19:50:24.187844  5774 cluster.cpp:448] Creating default 'local' authorizer
I0920 19:50:24.190259  5812 slave.cpp:252] Mesos agent started on (815)@172.17.0.3:44135
I0920 19:50:24.190282  5812 slave.cpp:253] Flags at startup: --acls="" --appc_simple_discovery_uri_prefix="http://"
--appc_store_dir="/tmp/Endpoint_SlaveEndpointTest_NoAuthorizer_0_1AH6lY/store/appc" --authenticate_http_readonly="true"
--authenticate_http_readwrite="true" --authenticatee="crammd5" --authentication_backoff_factor="1secs"
--authorizer="local" --cgroups_cpu_enable_pids_and_tids_count="false" --cgroups_enable_cfs="false"
--cgroups_hierarchy="/sys/fs/cgroup" --cgroups_limit_swap="false" --cgroups_root="mesos" --container_disk_watch_interval="15secs"
--containerizers="mesos" --credential="/tmp/Endpoint_SlaveEndpointTest_NoAuthorizer_0_1AH6lY/credential"
--default_role="*" --disallow_sharing_agent_pid_namespace="false" --disk_watch_interval="1mins"
--docker="docker" --docker_kill_orphans="true" --docker_registry="https://registry-1.docker.io"
--docker_remove_delay="6hrs" --docker_socket="/var/run/docker.sock" --docker_stop_timeout="0ns"
--docker_store_dir="/tmp/Endpoint_SlaveEndpointTest_NoAuthorizer_0_1AH6lY/store/docker" --docker_volume_checkpoint_dir="/var/run/mesos/isolators/docker/volume"
--enforce_container_disk_quota="false" --executor_registration_timeout="1mins" --executor_reregistration_timeout="2secs"
--executor_shutdown_grace_period="5secs" --fetcher_cache_dir="/tmp/Endpoint_SlaveEndpointTest_NoAuthorizer_0_1AH6lY/fetch"
--fetcher_cache_size="2GB" --frameworks_home="" --gc_delay="1weeks" --gc_disk_headroom="0.1"
--hadoop_home="" --help="false" --hostname_lookup="true" --http_command_executor="false" --http_credentials="/tmp/Endpoint_SlaveEndpointTest_NoAuthorizer_0_1AH6lY/http_credentials"
--http_heartbeat_interval="30secs" --initialize_driver_logging="true" --isolation="posix/cpu,posix/mem"
--launcher="posix" --launcher_dir="/mesos/mesos-1.5.0/_build/src" --logbufsecs="0" --logging_level="INFO"
--max_completed_executors_per_framework="150" --oversubscribed_resources_interval="15secs"
--perf_duration="10secs" --perf_interval="1mins" --port="5051" --qos_correction_interval_min="0ns"
--quiet="false" --recover="reconnect" --recovery_timeout="15mins" --registration_backoff_factor="10ms"
--resources="cpus:2;gpus:0;mem:1024;disk:1024;ports:[31000-32000]" --revocable_cpu_low_priority="true"
--runtime_dir="/tmp/Endpoint_SlaveEndpointTest_NoAuthorizer_0_1AH6lY" --sandbox_directory="/mnt/mesos/sandbox"
--strict="true" --switch_user="true" --systemd_enable_support="true" --systemd_runtime_directory="/run/systemd/system"
--version="false" --work_dir="/tmp/Endpoint_SlaveEndpointTest_NoAuthorizer_0_ce9WvS" --zk_session_timeout="10secs"
I0920 19:50:24.190659  5812 credentials.hpp:86] Loading credential for authentication from
'/tmp/Endpoint_SlaveEndpointTest_NoAuthorizer_0_1AH6lY/credential'
I0920 19:50:24.190800  5812 slave.cpp:285] Agent using credential for: test-principal
I0920 19:50:24.190829  5812 credentials.hpp:37] Loading credentials for authentication from
'/tmp/Endpoint_SlaveEndpointTest_NoAuthorizer_0_1AH6lY/http_credentials'
I0920 19:50:24.191079  5812 http.cpp:1045] Creating default 'basic' HTTP authenticator for
realm 'mesos-agent-readonly'
I0920 19:50:24.191242  5812 http.cpp:1045] Creating default 'basic' HTTP authenticator for
realm 'mesos-agent-readwrite'
I0920 19:50:24.192554  5812 slave.cpp:583] Agent resources: [{"name":"cpus","scalar":{"value":2.0},"type":"SCALAR"},{"name":"mem","scalar":{"value":1024.0},"type":"SCALAR"},{"name":"disk","scalar":{"value":1024.0},"type":"SCALAR"},{"name":"ports","ranges":{"range":[{"begin":31000,"end":32000}]},"type":"RANGES"}]
I0920 19:50:24.192909  5812 slave.cpp:591] Agent attributes: [  ]
I0920 19:50:24.192945  5812 slave.cpp:600] Agent hostname: b6a30ce187c2
I0920 19:50:24.193086  5803 status_update_manager.cpp:177] Pausing sending status updates
I0920 19:50:24.194540  5801 state.cpp:64] Recovering state from '/tmp/Endpoint_SlaveEndpointTest_NoAuthorizer_0_ce9WvS/meta'
I0920 19:50:24.194752  5801 status_update_manager.cpp:203] Recovering status update manager
I0920 19:50:24.194957  5799 containerizer.cpp:648] Recovering containerizer
I0920 19:50:24.196290  5813 provisioner.cpp:416] Provisioner recovery complete
I0920 19:50:24.196651  5803 slave.cpp:6320] Finished recovery
I0920 19:50:24.197047  5803 slave.cpp:6502] Querying resource estimator for oversubscribable
resources
I0920 19:50:24.197247  5802 slave.cpp:6516] Received oversubscribable resources {} from the
resource estimator
I0920 19:50:24.199496  5796 process.cpp:3929] Handling HTTP event for process 'slave(815)'
with path: '/slave(815)/monitor/statistics'
I0920 19:50:24.200654  5805 http.cpp:1185] HTTP GET for /slave(815)/monitor/statistics from
172.17.0.3:37834
I0920 19:50:24.200721  5805 http.cpp:976] Authorizing principal 'test-principal' to GET the
'/monitor/statistics' endpoint
I0920 19:50:24.203462  5816 slave.cpp:867] Agent terminating
[       OK ] Endpoint/SlaveEndpointTest.NoAuthorizer/0 (33 ms)
[ RUN      ] Endpoint/SlaveEndpointTest.NoAuthorizer/1
I0920 19:50:24.216543  5774 containerizer.cpp:292] Using isolation { environment_secret, posix/cpu,
posix/mem, filesystem/posix, network/cni }
W0920 19:50:24.217113  5774 backend.cpp:76] Failed to create 'aufs' backend: AufsBackend requires
root privileges
W0920 19:50:24.217233  5774 backend.cpp:76] Failed to create 'bind' backend: BindBackend requires
root privileges
I0920 19:50:24.217264  5774 provisioner.cpp:255] Using default backend 'copy'
I0920 19:50:24.219046  5774 cluster.cpp:448] Creating default 'local' authorizer
I0920 19:50:24.220990  5809 slave.cpp:252] Mesos agent started on (816)@172.17.0.3:44135
I0920 19:50:24.221019  5809 slave.cpp:253] Flags at startup: --acls="" --appc_simple_discovery_uri_prefix="http://"
--appc_store_dir="/tmp/Endpoint_SlaveEndpointTest_NoAuthorizer_1_DYjEZl/store/appc" --authenticate_http_readonly="true"
--authenticate_http_readwrite="true" --authenticatee="crammd5" --authentication_backoff_factor="1secs"
--authorizer="local" --cgroups_cpu_enable_pids_and_tids_count="false" --cgroups_enable_cfs="false"
--cgroups_hierarchy="/sys/fs/cgroup" --cgroups_limit_swap="false" --cgroups_root="mesos" --container_disk_watch_interval="15secs"
--containerizers="mesos" --credential="/tmp/Endpoint_SlaveEndpointTest_NoAuthorizer_1_DYjEZl/credential"
--default_role="*" --disallow_sharing_agent_pid_namespace="false" --disk_watch_interval="1mins"
--docker="docker" --docker_kill_orphans="true" --docker_registry="https://registry-1.docker.io"
--docker_remove_delay="6hrs" --docker_socket="/var/run/docker.sock" --docker_stop_timeout="0ns"
--docker_store_dir="/tmp/Endpoint_SlaveEndpointTest_NoAuthorizer_1_DYjEZl/store/docker" --docker_volume_checkpoint_dir="/var/run/mesos/isolators/docker/volume"
--enforce_container_disk_quota="false" --executor_registration_timeout="1mins" --executor_reregistration_timeout="2secs"
--executor_shutdown_grace_period="5secs" --fetcher_cache_dir="/tmp/Endpoint_SlaveEndpointTest_NoAuthorizer_1_DYjEZl/fetch"
--fetcher_cache_size="2GB" --frameworks_home="" --gc_delay="1weeks" --gc_disk_headroom="0.1"
--hadoop_home="" --help="false" --hostname_lookup="true" --http_command_executor="false" --http_credentials="/tmp/Endpoint_SlaveEndpointTest_NoAuthorizer_1_DYjEZl/http_credentials"
--http_heartbeat_interval="30secs" --initialize_driver_logging="true" --isolation="posix/cpu,posix/mem"
--launcher="posix" --launcher_dir="/mesos/mesos-1.5.0/_build/src" --logbufsecs="0" --logging_level="INFO"
--max_completed_executors_per_framework="150" --oversubscribed_resources_interval="15secs"
--perf_duration="10secs" --perf_interval="1mins" --port="5051" --qos_correction_interval_min="0ns"
--quiet="false" --recover="reconnect" --recovery_timeout="15mins" --registration_backoff_factor="10ms"
--resources="cpus:2;gpus:0;mem:1024;disk:1024;ports:[31000-32000]" --revocable_cpu_low_priority="true"
--runtime_dir="/tmp/Endpoint_SlaveEndpointTest_NoAuthorizer_1_DYjEZl" --sandbox_directory="/mnt/mesos/sandbox"
--strict="true" --switch_user="true" --systemd_enable_support="true" --systemd_runtime_directory="/run/systemd/system"
--version="false" --work_dir="/tmp/Endpoint_SlaveEndpointTest_NoAuthorizer_1_xDFx4f" --zk_session_timeout="10secs"
I0920 19:50:24.221602  5809 credentials.hpp:86] Loading credential for authentication from
'/tmp/Endpoint_SlaveEndpointTest_NoAuthorizer_1_DYjEZl/credential'
I0920 19:50:24.221743  5809 slave.cpp:285] Agent using credential for: test-principal
I0920 19:50:24.221765  5809 credentials.hpp:37] Loading credentials for authentication from
'/tmp/Endpoint_SlaveEndpointTest_NoAuthorizer_1_DYjEZl/http_credentials'
I0920 19:50:24.221984  5809 http.cpp:1045] Creating default 'basic' HTTP authenticator for
realm 'mesos-agent-readonly'
I0920 19:50:24.222128  5809 http.cpp:1045] Creating default 'basic' HTTP authenticator for
realm 'mesos-agent-readwrite'
I0920 19:50:24.223410  5809 slave.cpp:583] Agent resources: [{"name":"cpus","scalar":{"value":2.0},"type":"SCALAR"},{"name":"mem","scalar":{"value":1024.0},"type":"SCALAR"},{"name":"disk","scalar":{"value":1024.0},"type":"SCALAR"},{"name":"ports","ranges":{"range":[{"begin":31000,"end":32000}]},"type":"RANGES"}]
I0920 19:50:24.223636  5809 slave.cpp:591] Agent attributes: [  ]
I0920 19:50:24.223650  5809 slave.cpp:600] Agent hostname: b6a30ce187c2
I0920 19:50:24.223760  5811 status_update_manager.cpp:177] Pausing sending status updates
I0920 19:50:24.225029  5814 state.cpp:64] Recovering state from '/tmp/Endpoint_SlaveEndpointTest_NoAuthorizer_1_xDFx4f/meta'
I0920 19:50:24.225260  5799 status_update_manager.cpp:203] Recovering status update manager
I0920 19:50:24.225431  5797 containerizer.cpp:648] Recovering containerizer
I0920 19:50:24.226636  5806 provisioner.cpp:416] Provisioner recovery complete
I0920 19:50:24.226898  5804 slave.cpp:6320] Finished recovery
I0920 19:50:24.227252  5804 slave.cpp:6502] Querying resource estimator for oversubscribable
resources
I0920 19:50:24.227499  5813 slave.cpp:6516] Received oversubscribable resources {} from the
resource estimator
I0920 19:50:24.229462  5794 process.cpp:3929] Handling HTTP event for process 'slave(816)'
with path: '/slave(816)/monitor/statistics.json'
I0920 19:50:24.230542  5808 http.cpp:1185] HTTP GET for /slave(816)/monitor/statistics.json
from 172.17.0.3:37836
I0920 19:50:24.230602  5808 http.cpp:976] Authorizing principal 'test-principal' to GET the
'/monitor/statistics.json' endpoint
I0920 19:50:24.233074  5797 slave.cpp:867] Agent terminating
[       OK ] Endpoint/SlaveEndpointTest.NoAuthorizer/1 (29 ms)
[ RUN      ] Endpoint/SlaveEndpointTest.NoAuthorizer/2
I0920 19:50:24.244354  5774 containerizer.cpp:292] Using isolation { environment_secret, posix/cpu,
posix/mem, filesystem/posix, network/cni }
W0920 19:50:24.244858  5774 backend.cpp:76] Failed to create 'aufs' backend: AufsBackend requires
root privileges
W0920 19:50:24.244969  5774 backend.cpp:76] Failed to create 'bind' backend: BindBackend requires
root privileges
I0920 19:50:24.245003  5774 provisioner.cpp:255] Using default backend 'copy'
I0920 19:50:24.246618  5774 cluster.cpp:448] Creating default 'local' authorizer
I0920 19:50:24.248437  5813 slave.cpp:252] Mesos agent started on (817)@172.17.0.3:44135
I0920 19:50:24.248457  5813 slave.cpp:253] Flags at startup: --acls="" --appc_simple_discovery_uri_prefix="http://"
--appc_store_dir="/tmp/Endpoint_SlaveEndpointTest_NoAuthorizer_2_rHEnUJ/store/appc" --authenticate_http_readonly="true"
--authenticate_http_readwrite="true" --authenticatee="crammd5" --authentication_backoff_factor="1secs"
--authorizer="local" --cgroups_cpu_enable_pids_and_tids_count="false" --cgroups_enable_cfs="false"
--cgroups_hierarchy="/sys/fs/cgroup" --cgroups_limit_swap="false" --cgroups_root="mesos" --container_disk_watch_interval="15secs"
--containerizers="mesos" --credential="/tmp/Endpoint_SlaveEndpointTest_NoAuthorizer_2_rHEnUJ/credential"
--default_role="*" --disallow_sharing_agent_pid_namespace="false" --disk_watch_interval="1mins"
--docker="docker" --docker_kill_orphans="true" --docker_registry="https://registry-1.docker.io"
--docker_remove_delay="6hrs" --docker_socket="/var/run/docker.sock" --docker_stop_timeout="0ns"
--docker_store_dir="/tmp/Endpoint_SlaveEndpointTest_NoAuthorizer_2_rHEnUJ/store/docker" --docker_volume_checkpoint_dir="/var/run/mesos/isolators/docker/volume"
--enforce_container_disk_quota="false" --executor_registration_timeout="1mins" --executor_reregistration_timeout="2secs"
--executor_shutdown_grace_period="5secs" --fetcher_cache_dir="/tmp/Endpoint_SlaveEndpointTest_NoAuthorizer_2_rHEnUJ/fetch"
--fetcher_cache_size="2GB" --frameworks_home="" --gc_delay="1weeks" --gc_disk_headroom="0.1"
--hadoop_home="" --help="false" --hostname_lookup="true" --http_command_executor="false" --http_credentials="/tmp/Endpoint_SlaveEndpointTest_NoAuthorizer_2_rHEnUJ/http_credentials"
--http_heartbeat_interval="30secs" --initialize_driver_logging="true" --isolation="posix/cpu,posix/mem"
--launcher="posix" --launcher_dir="/mesos/mesos-1.5.0/_build/src" --logbufsecs="0" --logging_level="INFO"
--max_completed_executors_per_framework="150" --oversubscribed_resources_interval="15secs"
--perf_duration="10secs" --perf_interval="1mins" --port="5051" --qos_correction_interval_min="0ns"
--quiet="false" --recover="reconnect" --recovery_timeout="15mins" --registration_backoff_factor="10ms"
--resources="cpus:2;gpus:0;mem:1024;disk:1024;ports:[31000-32000]" --revocable_cpu_low_priority="true"
--runtime_dir="/tmp/Endpoint_SlaveEndpointTest_NoAuthorizer_2_rHEnUJ" --sandbox_directory="/mnt/mesos/sandbox"
--strict="true" --switch_user="true" --systemd_enable_support="true" --systemd_runtime_directory="/run/systemd/system"
--version="false" --work_dir="/tmp/Endpoint_SlaveEndpointTest_NoAuthorizer_2_58o5UD" --zk_session_timeout="10secs"
I0920 19:50:24.248811  5813 credentials.hpp:86] Loading credential for authentication from
'/tmp/Endpoint_SlaveEndpointTest_NoAuthorizer_2_rHEnUJ/credential'
I0920 19:50:24.248952  5813 slave.cpp:285] Agent using credential for: test-principal
I0920 19:50:24.248973  5813 credentials.hpp:37] Loading credentials for authentication from
'/tmp/Endpoint_SlaveEndpointTest_NoAuthorizer_2_rHEnUJ/http_credentials'
I0920 19:50:24.249193  5813 http.cpp:1045] Creating default 'basic' HTTP authenticator for
realm 'mesos-agent-readonly'
I0920 19:50:24.249336  5813 http.cpp:1045] Creating default 'basic' HTTP authenticator for
realm 'mesos-agent-readwrite'
I0920 19:50:24.250603  5813 slave.cpp:583] Agent resources: [{"name":"cpus","scalar":{"value":2.0},"type":"SCALAR"},{"name":"mem","scalar":{"value":1024.0},"type":"SCALAR"},{"name":"disk","scalar":{"value":1024.0},"type":"SCALAR"},{"name":"ports","ranges":{"range":[{"begin":31000,"end":32000}]},"type":"RANGES"}]
I0920 19:50:24.250826  5813 slave.cpp:591] Agent attributes: [  ]
I0920 19:50:24.250840  5813 slave.cpp:600] Agent hostname: b6a30ce187c2
I0920 19:50:24.250991  5798 status_update_manager.cpp:177] Pausing sending status updates
I0920 19:50:24.252250  5811 state.cpp:64] Recovering state from '/tmp/Endpoint_SlaveEndpointTest_NoAuthorizer_2_58o5UD/meta'
I0920 19:50:24.252465  5806 status_update_manager.cpp:203] Recovering status update manager
I0920 19:50:24.252671  5809 containerizer.cpp:648] Recovering containerizer
I0920 19:50:24.253762  5801 provisioner.cpp:416] Provisioner recovery complete
I0920 19:50:24.254058  5798 slave.cpp:6320] Finished recovery
I0920 19:50:24.254456  5798 slave.cpp:6502] Querying resource estimator for oversubscribable
resources
I0920 19:50:24.254672  5796 slave.cpp:6516] Received oversubscribable resources {} from the
resource estimator
I0920 19:50:24.256551  5816 process.cpp:3929] Handling HTTP event for process 'slave(817)'
with path: '/slave(817)/containers'
I0920 19:50:24.257640  5794 http.cpp:1185] HTTP GET for /slave(817)/containers from 172.17.0.3:37840
I0920 19:50:24.257702  5794 http.cpp:976] Authorizing principal 'test-principal' to GET the
'/containers' endpoint
I0920 19:50:24.260443  5813 slave.cpp:867] Agent terminating
[       OK ] Endpoint/SlaveEndpointTest.NoAuthorizer/2 (27 ms)
[----------] 9 tests from Endpoint/SlaveEndpointTest (260 ms total)

[----------] 2 tests from ContainerizerType/DefaultContainerDNSFlagTest
[ RUN      ] ContainerizerType/DefaultContainerDNSFlagTest.ValidateFlag/0
[       OK ] ContainerizerType/DefaultContainerDNSFlagTest.ValidateFlag/0 (10 ms)
[ RUN      ] ContainerizerType/DefaultContainerDNSFlagTest.ValidateFlag/1
[       OK ] ContainerizerType/DefaultContainerDNSFlagTest.ValidateFlag/1 (9 ms)
[----------] 2 tests from ContainerizerType/DefaultContainerDNSFlagTest (19 ms total)

[----------] Global test environment tear-down
[==========] 1668 tests from 183 test cases ran. (651615 ms total)
[  PASSED  ] 1667 tests.
[  FAILED  ] 1 test, listed below:
[  FAILED  ] ExamplesTest.TestFramework

 1 FAILED TEST
  YOU HAVE 20 DISABLED TESTS

I0920 19:50:24.341465  5817 process.cpp:1068] Failed to accept socket: future discarded
make[4]: *** [check-local] Error 1
make[4]: Leaving directory `/mesos/mesos-1.5.0/_build/src'
make[3]: *** [check-am] Error 2
make[3]: Leaving directory `/mesos/mesos-1.5.0/_build/src'
make[2]: *** [check] Error 2
make[2]: Leaving directory `/mesos/mesos-1.5.0/_build/src'
make[1]: *** [check-recursive] Error 1
make[1]: Leaving directory `/mesos/mesos-1.5.0/_build'
make: *** [distcheck] Error 1
+ docker rmi mesos-1505933490-1245
Untagged: mesos-1505933490-1245:latest
Deleted: sha256:5ba8c544dea3328ca758f150521c10fa475293ec8481676c2f6fe963901af176
Deleted: sha256:7b5b70a07120abea7f06cd65366163e42a1736f2e5f09c841939d5e4f6055eb2
Deleted: sha256:9176c130304826a5a56d8c8a4583c0bf5db586ce45dad47bccad64adcf81f1a8
Deleted: sha256:90ccbab7ea9d285df4e8cd8df024a795974b9e865ecc6ce1664164607dd0ec73
Deleted: sha256:b6cec323d72b2f15c8a0ee7c819fafa9025379df8856f5c8486841fd76977225
Deleted: sha256:3627168ef233968d9cb1b66f2d0f9f02125fbd8a43b7cabe05596c40946093f3
Deleted: sha256:6f0feb3f0fb07215507642474615e0017cbab6550da14a6ab945b9c5661d30d0
Deleted: sha256:a39432902e41d2a03d33458ab0c8bafab47a36199a09879b7fa757e848ffd562
Deleted: sha256:b2fe044a8d7763b9b10f3cbf41b42560f566995925d1e818bc1813a67c521c22
Deleted: sha256:d415f7ea91b7be0df1a0d372f933d8c6d079b10d121a79ec86ececc3f2b69f58
Deleted: sha256:51fcf687765e6fbd9137d82eb1e381652b9917505cb757280c39e8c9b9cb1167
Deleted: sha256:59889798692d4ad664c074a72b9138b4bd9fa60efd4ef48f8beef8eb515886ae
Deleted: sha256:fffeeb3221b0975286f2fe156fc71d85e9f4add9025f7fad63bacf7384612fff
Deleted: sha256:b1d9a6fc1ac425e5478c51e72a7459bb5c046e6b3862c80310351c3cb07ff62f
Deleted: sha256:9f39e048c92328c399e110cbc472b24f33843ac3c1fadac753f26d2d9fe21395
Deleted: sha256:aa4279f68884611da492dd8d9a32ae7ab275a925b8e9814dd771878291b58e39
Deleted: sha256:9cf62e3195405bf819dc0f13fd7c0a5ee150466339bd7e5e6f929f5a887f2843
Deleted: sha256:f4809242fed34f33ed9e891918bbc0aa8f6a05ca7062dda3e004d941bf884681
Deleted: sha256:33f370a84d4bea5818f3625078dcaf113669af3f3e10cd4a27577d8e226c0fe9
Deleted: sha256:2ff0418cbc28be7928c69ddbf1dc6bd25a24450fbbe929dcaed4a7a439025068
Deleted: sha256:a84c7968ebfbda7e9e0bf184f995b9502324af6cf07fed1e1d577aaf875e1ff4
Deleted: sha256:431d5fca5aaa778d9c18bd6099767a1841397b4c1b313eb4793c23ba1a7e1329
Deleted: sha256:99e2bc8ff5e56854d3a64f45c4cebb9a4131989bd268a6aecbbaab74cf1c3c77
Deleted: sha256:dc7df6d0bef246a721be30cd968510e7460e9aefba13caea3b1d6ef8490cb032
Deleted: sha256:f3dd34b6abea15995c6a22404eb5f9133fe30ba1d1e1293140168688f29eda5f
Deleted: sha256:3b660fe8307dcf8b14ae39eed06957ebf85787a05fa3204ed8c0aef070daa943
Deleted: sha256:2052627bf121462683ae13c312940f6962a9195a44fb986dfd19c6a8b84e2f9f
Deleted: sha256:c70e81b15e72ad0904a716dc74ee26267eabfae3739cc51bd804ff182ec9cbc8
Build step 'Execute shell' marked build as failure

Mime
View raw message