mesos-builds mailing list archives

Site index · List index
Message view « Date » · « Thread »
Top « Date » · « Thread »
From Apache Jenkins Server <jenk...@builds.apache.org>
Subject Build failed in Jenkins: Mesos-Buildbot » autotools,gcc,--verbose --enable-libevent --enable-ssl,GLOG_v=1 MESOS_VERBOSE=1,ubuntu:14.04,(ubuntu)&&(!ubuntu-us1)&&(!ubuntu-eu2)&&(!qnode3)&&(!H23) #4216
Date Sat, 09 Sep 2017 20:17:26 GMT
See <https://builds.apache.org/job/Mesos-Buildbot/BUILDTOOL=autotools,COMPILER=gcc,CONFIGURATION=--verbose%20--enable-libevent%20--enable-ssl,ENVIRONMENT=GLOG_v=1%20MESOS_VERBOSE=1,OS=ubuntu%3A14.04,label_exp=(ubuntu)&&(!ubuntu-us1)&&(!ubuntu-eu2)&&(!qnode3)&&(!H23)/4216/display/redirect>

------------------------------------------
[...truncated 32.16 MB...]
I0909 20:17:20.998556 29432 slave.cpp:251] Flags at startup: --acls="" --appc_simple_discovery_uri_prefix="http://"
--appc_store_dir="/tmp/Endpoint_SlaveEndpointTest_UnauthorizedRequest_0_IQd7tY/store/appc"
--authenticate_http_executors="true" --authenticate_http_readonly="true" --authenticate_http_readwrite="true"
--authenticatee="crammd5" --authentication_backoff_factor="1secs" --authorizer="local" --cgroups_cpu_enable_pids_and_tids_count="false"
--cgroups_enable_cfs="false" --cgroups_hierarchy="/sys/fs/cgroup" --cgroups_limit_swap="false"
--cgroups_root="mesos" --container_disk_watch_interval="15secs" --containerizers="mesos" --credential="/tmp/Endpoint_SlaveEndpointTest_UnauthorizedRequest_0_IQd7tY/credential"
--default_role="*" --disallow_sharing_agent_pid_namespace="false" --disk_watch_interval="1mins"
--docker="docker" --docker_kill_orphans="true" --docker_registry="https://registry-1.docker.io"
--docker_remove_delay="6hrs" --docker_socket="/var/run/docker.sock" --docker_stop_timeout="0ns"
--docker_store_dir="/tmp/Endpoint_SlaveEndpointTest_UnauthorizedRequest_0_IQd7tY/store/docker"
--docker_volume_checkpoint_dir="/var/run/mesos/isolators/docker/volume" --enforce_container_disk_quota="false"
--executor_registration_timeout="1mins" --executor_reregistration_timeout="2secs" --executor_secret_key="/tmp/Endpoint_SlaveEndpointTest_UnauthorizedRequest_0_IQd7tY/executor_secret_key"
--executor_shutdown_grace_period="5secs" --fetcher_cache_dir="/tmp/Endpoint_SlaveEndpointTest_UnauthorizedRequest_0_IQd7tY/fetch"
--fetcher_cache_size="2GB" --frameworks_home="" --gc_delay="1weeks" --gc_disk_headroom="0.1"
--hadoop_home="" --help="false" --hostname_lookup="true" --http_command_executor="false" --http_credentials="/tmp/Endpoint_SlaveEndpointTest_UnauthorizedRequest_0_IQd7tY/http_credentials"
--http_heartbeat_interval="30secs" --initialize_driver_logging="true" --isolation="posix/cpu,posix/mem"
--launcher="posix" --launcher_dir="/mesos/mesos-1.4.0/_build/src" --logbufsecs="0" --logging_level="INFO"
--max_completed_executors_per_framework="150" --oversubscribed_resources_interval="15secs"
--perf_duration="10secs" --perf_interval="1mins" --port="5051" --qos_correction_interval_min="0ns"
--quiet="false" --recover="reconnect" --recovery_timeout="15mins" --registration_backoff_factor="10ms"
--resources="cpus:2;gpus:0;mem:1024;disk:1024;ports:[31000-32000]" --revocable_cpu_low_priority="true"
--runtime_dir="/tmp/Endpoint_SlaveEndpointTest_UnauthorizedRequest_0_IQd7tY" --sandbox_directory="/mnt/mesos/sandbox"
--strict="true" --switch_user="true" --systemd_enable_support="true" --systemd_runtime_directory="/run/systemd/system"
--version="false" --work_dir="/tmp/Endpoint_SlaveEndpointTest_UnauthorizedRequest_0_5lhn3b"
I0909 20:17:20.999127 29432 credentials.hpp:86] Loading credential for authentication from
'/tmp/Endpoint_SlaveEndpointTest_UnauthorizedRequest_0_IQd7tY/credential'
I0909 20:17:20.999353 29432 slave.cpp:283] Agent using credential for: test-principal
I0909 20:17:20.999380 29432 credentials.hpp:37] Loading credentials for authentication from
'/tmp/Endpoint_SlaveEndpointTest_UnauthorizedRequest_0_IQd7tY/http_credentials'
I0909 20:17:20.999784 29432 http.cpp:1026] Creating default 'basic' HTTP authenticator for
realm 'mesos-agent-executor'
I0909 20:17:20.999932 29432 http.cpp:1047] Creating default 'jwt' HTTP authenticator for realm
'mesos-agent-executor'
I0909 20:17:21.000180 29432 http.cpp:1026] Creating default 'basic' HTTP authenticator for
realm 'mesos-agent-readonly'
I0909 20:17:21.000322 29432 http.cpp:1047] Creating default 'jwt' HTTP authenticator for realm
'mesos-agent-readonly'
I0909 20:17:21.000561 29432 http.cpp:1026] Creating default 'basic' HTTP authenticator for
realm 'mesos-agent-readwrite'
I0909 20:17:21.000694 29432 http.cpp:1047] Creating default 'jwt' HTTP authenticator for realm
'mesos-agent-readwrite'
I0909 20:17:21.002344 29432 slave.cpp:565] Agent resources: [{"name":"cpus","scalar":{"value":2.0},"type":"SCALAR"},{"name":"mem","scalar":{"value":1024.0},"type":"SCALAR"},{"name":"disk","scalar":{"value":1024.0},"type":"SCALAR"},{"name":"ports","ranges":{"range":[{"begin":31000,"end":32000}]},"type":"RANGES"}]
I0909 20:17:21.002583 29432 slave.cpp:573] Agent attributes: [  ]
I0909 20:17:21.002598 29432 slave.cpp:582] Agent hostname: 45d5ba030c22
I0909 20:17:21.002737 29417 status_update_manager.cpp:177] Pausing sending status updates
I0909 20:17:21.004386 29430 state.cpp:64] Recovering state from '/tmp/Endpoint_SlaveEndpointTest_UnauthorizedRequest_0_5lhn3b/meta'
I0909 20:17:21.004768 29411 status_update_manager.cpp:203] Recovering status update manager
I0909 20:17:21.005019 29414 containerizer.cpp:609] Recovering containerizer
I0909 20:17:21.006857 29418 provisioner.cpp:416] Provisioner recovery complete
I0909 20:17:21.007197 29418 slave.cpp:6295] Finished recovery
I0909 20:17:21.007619 29418 slave.cpp:6477] Querying resource estimator for oversubscribable
resources
I0909 20:17:21.007895 29416 slave.cpp:6491] Received oversubscribable resources {} from the
resource estimator
I0909 20:17:21.010202 29433 process.cpp:3927] Handling HTTP event for process 'slave(806)'
with path: '/slave(806)/monitor/statistics'
I0909 20:17:21.012490 29417 http.cpp:1166] HTTP GET for /slave(806)/monitor/statistics from
172.17.0.12:51908
I0909 20:17:21.012591 29417 http.cpp:957] Authorizing principal 'test-principal' to GET the
'/monitor/statistics' endpoint
I0909 20:17:21.015710 29419 slave.cpp:843] Agent terminating
[       OK ] Endpoint/SlaveEndpointTest.UnauthorizedRequest/0 (34 ms)
[ RUN      ] Endpoint/SlaveEndpointTest.UnauthorizedRequest/1
I0909 20:17:21.027660  8465 containerizer.cpp:246] Using isolation: posix/cpu,posix/mem,filesystem/posix,network/cni,environment_secret
W0909 20:17:21.028194  8465 backend.cpp:76] Failed to create 'aufs' backend: AufsBackend requires
root privileges
W0909 20:17:21.028304  8465 backend.cpp:76] Failed to create 'bind' backend: BindBackend requires
root privileges
I0909 20:17:21.028339  8465 provisioner.cpp:255] Using default backend 'copy'
I0909 20:17:21.031976 29433 slave.cpp:250] Mesos agent started on (807)@172.17.0.12:37082
I0909 20:17:21.032001 29433 slave.cpp:251] Flags at startup: --acls="" --appc_simple_discovery_uri_prefix="http://"
--appc_store_dir="/tmp/Endpoint_SlaveEndpointTest_UnauthorizedRequest_1_gp0Ou6/store/appc"
--authenticate_http_executors="true" --authenticate_http_readonly="true" --authenticate_http_readwrite="true"
--authenticatee="crammd5" --authentication_backoff_factor="1secs" --authorizer="local" --cgroups_cpu_enable_pids_and_tids_count="false"
--cgroups_enable_cfs="false" --cgroups_hierarchy="/sys/fs/cgroup" --cgroups_limit_swap="false"
--cgroups_root="mesos" --container_disk_watch_interval="15secs" --containerizers="mesos" --credential="/tmp/Endpoint_SlaveEndpointTest_UnauthorizedRequest_1_gp0Ou6/credential"
--default_role="*" --disallow_sharing_agent_pid_namespace="false" --disk_watch_interval="1mins"
--docker="docker" --docker_kill_orphans="true" --docker_registry="https://registry-1.docker.io"
--docker_remove_delay="6hrs" --docker_socket="/var/run/docker.sock" --docker_stop_timeout="0ns"
--docker_store_dir="/tmp/Endpoint_SlaveEndpointTest_UnauthorizedRequest_1_gp0Ou6/store/docker"
--docker_volume_checkpoint_dir="/var/run/mesos/isolators/docker/volume" --enforce_container_disk_quota="false"
--executor_registration_timeout="1mins" --executor_reregistration_timeout="2secs" --executor_secret_key="/tmp/Endpoint_SlaveEndpointTest_UnauthorizedRequest_1_gp0Ou6/executor_secret_key"
--executor_shutdown_grace_period="5secs" --fetcher_cache_dir="/tmp/Endpoint_SlaveEndpointTest_UnauthorizedRequest_1_gp0Ou6/fetch"
--fetcher_cache_size="2GB" --frameworks_home="" --gc_delay="1weeks" --gc_disk_headroom="0.1"
--hadoop_home="" --help="false" --hostname_lookup="true" --http_command_executor="false" --http_credentials="/tmp/Endpoint_SlaveEndpointTest_UnauthorizedRequest_1_gp0Ou6/http_credentials"
--http_heartbeat_interval="30secs" --initialize_driver_logging="true" --isolation="posix/cpu,posix/mem"
--launcher="posix" --launcher_dir="/mesos/mesos-1.4.0/_build/src" --logbufsecs="0" --logging_level="INFO"
--max_completed_executors_per_framework="150" --oversubscribed_resources_interval="15secs"
--perf_duration="10secs" --perf_interval="1mins" --port="5051" --qos_correction_interval_min="0ns"
--quiet="false" --recover="reconnect" --recovery_timeout="15mins" --registration_backoff_factor="10ms"
--resources="cpus:2;gpus:0;mem:1024;disk:1024;ports:[31000-32000]" --revocable_cpu_low_priority="true"
--runtime_dir="/tmp/Endpoint_SlaveEndpointTest_UnauthorizedRequest_1_gp0Ou6" --sandbox_directory="/mnt/mesos/sandbox"
--strict="true" --switch_user="true" --systemd_enable_support="true" --systemd_runtime_directory="/run/systemd/system"
--version="false" --work_dir="/tmp/Endpoint_SlaveEndpointTest_UnauthorizedRequest_1_pO3UYj"
I0909 20:17:21.032460 29433 credentials.hpp:86] Loading credential for authentication from
'/tmp/Endpoint_SlaveEndpointTest_UnauthorizedRequest_1_gp0Ou6/credential'
I0909 20:17:21.032624 29433 slave.cpp:283] Agent using credential for: test-principal
I0909 20:17:21.032647 29433 credentials.hpp:37] Loading credentials for authentication from
'/tmp/Endpoint_SlaveEndpointTest_UnauthorizedRequest_1_gp0Ou6/http_credentials'
I0909 20:17:21.032944 29433 http.cpp:1026] Creating default 'basic' HTTP authenticator for
realm 'mesos-agent-executor'
I0909 20:17:21.033061 29433 http.cpp:1047] Creating default 'jwt' HTTP authenticator for realm
'mesos-agent-executor'
I0909 20:17:21.033334 29433 http.cpp:1026] Creating default 'basic' HTTP authenticator for
realm 'mesos-agent-readonly'
I0909 20:17:21.033448 29433 http.cpp:1047] Creating default 'jwt' HTTP authenticator for realm
'mesos-agent-readonly'
I0909 20:17:21.033664 29433 http.cpp:1026] Creating default 'basic' HTTP authenticator for
realm 'mesos-agent-readwrite'
I0909 20:17:21.033774 29433 http.cpp:1047] Creating default 'jwt' HTTP authenticator for realm
'mesos-agent-readwrite'
I0909 20:17:21.035331 29433 slave.cpp:565] Agent resources: [{"name":"cpus","scalar":{"value":2.0},"type":"SCALAR"},{"name":"mem","scalar":{"value":1024.0},"type":"SCALAR"},{"name":"disk","scalar":{"value":1024.0},"type":"SCALAR"},{"name":"ports","ranges":{"range":[{"begin":31000,"end":32000}]},"type":"RANGES"}]
I0909 20:17:21.035573 29433 slave.cpp:573] Agent attributes: [  ]
I0909 20:17:21.035589 29433 slave.cpp:582] Agent hostname: 45d5ba030c22
I0909 20:17:21.035791 29419 status_update_manager.cpp:177] Pausing sending status updates
I0909 20:17:21.037641 29422 state.cpp:64] Recovering state from '/tmp/Endpoint_SlaveEndpointTest_UnauthorizedRequest_1_pO3UYj/meta'
I0909 20:17:21.037991 29414 status_update_manager.cpp:203] Recovering status update manager
I0909 20:17:21.038245 29426 containerizer.cpp:609] Recovering containerizer
I0909 20:17:21.040149 29429 provisioner.cpp:416] Provisioner recovery complete
I0909 20:17:21.040689 29419 slave.cpp:6295] Finished recovery
I0909 20:17:21.041234 29419 slave.cpp:6477] Querying resource estimator for oversubscribable
resources
I0909 20:17:21.041502 29420 slave.cpp:6491] Received oversubscribable resources {} from the
resource estimator
I0909 20:17:21.043938 29431 process.cpp:3927] Handling HTTP event for process 'slave(807)'
with path: '/slave(807)/monitor/statistics.json'
I0909 20:17:21.046005 29429 http.cpp:1166] HTTP GET for /slave(807)/monitor/statistics.json
from 172.17.0.12:51910
I0909 20:17:21.046072 29429 http.cpp:957] Authorizing principal 'test-principal' to GET the
'/monitor/statistics.json' endpoint
I0909 20:17:21.048010 29413 slave.cpp:843] Agent terminating
[       OK ] Endpoint/SlaveEndpointTest.UnauthorizedRequest/1 (31 ms)
[ RUN      ] Endpoint/SlaveEndpointTest.UnauthorizedRequest/2
I0909 20:17:21.059379  8465 containerizer.cpp:246] Using isolation: posix/cpu,posix/mem,filesystem/posix,network/cni,environment_secret
W0909 20:17:21.060061  8465 backend.cpp:76] Failed to create 'aufs' backend: AufsBackend requires
root privileges
W0909 20:17:21.060205  8465 backend.cpp:76] Failed to create 'bind' backend: BindBackend requires
root privileges
I0909 20:17:21.060241  8465 provisioner.cpp:255] Using default backend 'copy'
I0909 20:17:21.064646 29416 slave.cpp:250] Mesos agent started on (808)@172.17.0.12:37082
I0909 20:17:21.064677 29416 slave.cpp:251] Flags at startup: --acls="" --appc_simple_discovery_uri_prefix="http://"
--appc_store_dir="/tmp/Endpoint_SlaveEndpointTest_UnauthorizedRequest_2_I1IFOe/store/appc"
--authenticate_http_executors="true" --authenticate_http_readonly="true" --authenticate_http_readwrite="true"
--authenticatee="crammd5" --authentication_backoff_factor="1secs" --authorizer="local" --cgroups_cpu_enable_pids_and_tids_count="false"
--cgroups_enable_cfs="false" --cgroups_hierarchy="/sys/fs/cgroup" --cgroups_limit_swap="false"
--cgroups_root="mesos" --container_disk_watch_interval="15secs" --containerizers="mesos" --credential="/tmp/Endpoint_SlaveEndpointTest_UnauthorizedRequest_2_I1IFOe/credential"
--default_role="*" --disallow_sharing_agent_pid_namespace="false" --disk_watch_interval="1mins"
--docker="docker" --docker_kill_orphans="true" --docker_registry="https://registry-1.docker.io"
--docker_remove_delay="6hrs" --docker_socket="/var/run/docker.sock" --docker_stop_timeout="0ns"
--docker_store_dir="/tmp/Endpoint_SlaveEndpointTest_UnauthorizedRequest_2_I1IFOe/store/docker"
--docker_volume_checkpoint_dir="/var/run/mesos/isolators/docker/volume" --enforce_container_disk_quota="false"
--executor_registration_timeout="1mins" --executor_reregistration_timeout="2secs" --executor_secret_key="/tmp/Endpoint_SlaveEndpointTest_UnauthorizedRequest_2_I1IFOe/executor_secret_key"
--executor_shutdown_grace_period="5secs" --fetcher_cache_dir="/tmp/Endpoint_SlaveEndpointTest_UnauthorizedRequest_2_I1IFOe/fetch"
--fetcher_cache_size="2GB" --frameworks_home="" --gc_delay="1weeks" --gc_disk_headroom="0.1"
--hadoop_home="" --help="false" --hostname_lookup="true" --http_command_executor="false" --http_credentials="/tmp/Endpoint_SlaveEndpointTest_UnauthorizedRequest_2_I1IFOe/http_credentials"
--http_heartbeat_interval="30secs" --initialize_driver_logging="true" --isolation="posix/cpu,posix/mem"
--launcher="posix" --launcher_dir="/mesos/mesos-1.4.0/_build/src" --logbufsecs="0" --logging_level="INFO"
--max_completed_executors_per_framework="150" --oversubscribed_resources_interval="15secs"
--perf_duration="10secs" --perf_interval="1mins" --port="5051" --qos_correction_interval_min="0ns"
--quiet="false" --recover="reconnect" --recovery_timeout="15mins" --registration_backoff_factor="10ms"
--resources="cpus:2;gpus:0;mem:1024;disk:1024;ports:[31000-32000]" --revocable_cpu_low_priority="true"
--runtime_dir="/tmp/Endpoint_SlaveEndpointTest_UnauthorizedRequest_2_I1IFOe" --sandbox_directory="/mnt/mesos/sandbox"
--strict="true" --switch_user="true" --systemd_enable_support="true" --systemd_runtime_directory="/run/systemd/system"
--version="false" --work_dir="/tmp/Endpoint_SlaveEndpointTest_UnauthorizedRequest_2_dKg4ds"
I0909 20:17:21.065095 29416 credentials.hpp:86] Loading credential for authentication from
'/tmp/Endpoint_SlaveEndpointTest_UnauthorizedRequest_2_I1IFOe/credential'
I0909 20:17:21.065268 29416 slave.cpp:283] Agent using credential for: test-principal
I0909 20:17:21.065291 29416 credentials.hpp:37] Loading credentials for authentication from
'/tmp/Endpoint_SlaveEndpointTest_UnauthorizedRequest_2_I1IFOe/http_credentials'
I0909 20:17:21.065563 29416 http.cpp:1026] Creating default 'basic' HTTP authenticator for
realm 'mesos-agent-executor'
I0909 20:17:21.065678 29416 http.cpp:1047] Creating default 'jwt' HTTP authenticator for realm
'mesos-agent-executor'
I0909 20:17:21.065871 29416 http.cpp:1026] Creating default 'basic' HTTP authenticator for
realm 'mesos-agent-readonly'
I0909 20:17:21.065966 29416 http.cpp:1047] Creating default 'jwt' HTTP authenticator for realm
'mesos-agent-readonly'
I0909 20:17:21.066143 29416 http.cpp:1026] Creating default 'basic' HTTP authenticator for
realm 'mesos-agent-readwrite'
I0909 20:17:21.066239 29416 http.cpp:1047] Creating default 'jwt' HTTP authenticator for realm
'mesos-agent-readwrite'
I0909 20:17:21.067657 29416 slave.cpp:565] Agent resources: [{"name":"cpus","scalar":{"value":2.0},"type":"SCALAR"},{"name":"mem","scalar":{"value":1024.0},"type":"SCALAR"},{"name":"disk","scalar":{"value":1024.0},"type":"SCALAR"},{"name":"ports","ranges":{"range":[{"begin":31000,"end":32000}]},"type":"RANGES"}]
I0909 20:17:21.067879 29416 slave.cpp:573] Agent attributes: [  ]
I0909 20:17:21.067893 29416 slave.cpp:582] Agent hostname: 45d5ba030c22
I0909 20:17:21.068015 29422 status_update_manager.cpp:177] Pausing sending status updates
I0909 20:17:21.069403 29430 state.cpp:64] Recovering state from '/tmp/Endpoint_SlaveEndpointTest_UnauthorizedRequest_2_dKg4ds/meta'
I0909 20:17:21.069720 29420 status_update_manager.cpp:203] Recovering status update manager
I0909 20:17:21.069902 29434 containerizer.cpp:609] Recovering containerizer
I0909 20:17:21.071219 29418 provisioner.cpp:416] Provisioner recovery complete
I0909 20:17:21.071768 29421 slave.cpp:6295] Finished recovery
I0909 20:17:21.072190 29421 slave.cpp:6477] Querying resource estimator for oversubscribable
resources
I0909 20:17:21.072439 29414 slave.cpp:6491] Received oversubscribable resources {} from the
resource estimator
I0909 20:17:21.074862 29424 process.cpp:3927] Handling HTTP event for process 'slave(808)'
with path: '/slave(808)/containers'
I0909 20:17:21.076624 29418 http.cpp:1166] HTTP GET for /slave(808)/containers from 172.17.0.12:51914
I0909 20:17:21.076751 29418 http.cpp:957] Authorizing principal 'test-principal' to GET the
'/containers' endpoint
I0909 20:17:21.079336 29427 slave.cpp:843] Agent terminating
[       OK ] Endpoint/SlaveEndpointTest.UnauthorizedRequest/2 (31 ms)
[ RUN      ] Endpoint/SlaveEndpointTest.NoAuthorizer/0
I0909 20:17:21.091171  8465 containerizer.cpp:246] Using isolation: posix/cpu,posix/mem,filesystem/posix,network/cni,environment_secret
W0909 20:17:21.091691  8465 backend.cpp:76] Failed to create 'aufs' backend: AufsBackend requires
root privileges
W0909 20:17:21.091799  8465 backend.cpp:76] Failed to create 'bind' backend: BindBackend requires
root privileges
I0909 20:17:21.091836  8465 provisioner.cpp:255] Using default backend 'copy'
I0909 20:17:21.093894  8465 cluster.cpp:448] Creating default 'local' authorizer
I0909 20:17:21.096329 29434 slave.cpp:250] Mesos agent started on (809)@172.17.0.12:37082
I0909 20:17:21.096355 29434 slave.cpp:251] Flags at startup: --acls="" --appc_simple_discovery_uri_prefix="http://"
--appc_store_dir="/tmp/Endpoint_SlaveEndpointTest_NoAuthorizer_0_kp9nrn/store/appc" --authenticate_http_executors="true"
--authenticate_http_readonly="true" --authenticate_http_readwrite="true" --authenticatee="crammd5"
--authentication_backoff_factor="1secs" --authorizer="local" --cgroups_cpu_enable_pids_and_tids_count="false"
--cgroups_enable_cfs="false" --cgroups_hierarchy="/sys/fs/cgroup" --cgroups_limit_swap="false"
--cgroups_root="mesos" --container_disk_watch_interval="15secs" --containerizers="mesos" --credential="/tmp/Endpoint_SlaveEndpointTest_NoAuthorizer_0_kp9nrn/credential"
--default_role="*" --disallow_sharing_agent_pid_namespace="false" --disk_watch_interval="1mins"
--docker="docker" --docker_kill_orphans="true" --docker_registry="https://registry-1.docker.io"
--docker_remove_delay="6hrs" --docker_socket="/var/run/docker.sock" --docker_stop_timeout="0ns"
--docker_store_dir="/tmp/Endpoint_SlaveEndpointTest_NoAuthorizer_0_kp9nrn/store/docker" --docker_volume_checkpoint_dir="/var/run/mesos/isolators/docker/volume"
--enforce_container_disk_quota="false" --executor_registration_timeout="1mins" --executor_reregistration_timeout="2secs"
--executor_secret_key="/tmp/Endpoint_SlaveEndpointTest_NoAuthorizer_0_kp9nrn/executor_secret_key"
--executor_shutdown_grace_period="5secs" --fetcher_cache_dir="/tmp/Endpoint_SlaveEndpointTest_NoAuthorizer_0_kp9nrn/fetch"
--fetcher_cache_size="2GB" --frameworks_home="" --gc_delay="1weeks" --gc_disk_headroom="0.1"
--hadoop_home="" --help="false" --hostname_lookup="true" --http_command_executor="false" --http_credentials="/tmp/Endpoint_SlaveEndpointTest_NoAuthorizer_0_kp9nrn/http_credentials"
--http_heartbeat_interval="30secs" --initialize_driver_logging="true" --isolation="posix/cpu,posix/mem"
--launcher="posix" --launcher_dir="/mesos/mesos-1.4.0/_build/src" --logbufsecs="0" --logging_level="INFO"
--max_completed_executors_per_framework="150" --oversubscribed_resources_interval="15secs"
--perf_duration="10secs" --perf_interval="1mins" --port="5051" --qos_correction_interval_min="0ns"
--quiet="false" --recover="reconnect" --recovery_timeout="15mins" --registration_backoff_factor="10ms"
--resources="cpus:2;gpus:0;mem:1024;disk:1024;ports:[31000-32000]" --revocable_cpu_low_priority="true"
--runtime_dir="/tmp/Endpoint_SlaveEndpointTest_NoAuthorizer_0_kp9nrn" --sandbox_directory="/mnt/mesos/sandbox"
--strict="true" --switch_user="true" --systemd_enable_support="true" --systemd_runtime_directory="/run/systemd/system"
--version="false" --work_dir="/tmp/Endpoint_SlaveEndpointTest_NoAuthorizer_0_fn91LA"
I0909 20:17:21.096792 29434 credentials.hpp:86] Loading credential for authentication from
'/tmp/Endpoint_SlaveEndpointTest_NoAuthorizer_0_kp9nrn/credential'
I0909 20:17:21.096938 29434 slave.cpp:283] Agent using credential for: test-principal
I0909 20:17:21.096959 29434 credentials.hpp:37] Loading credentials for authentication from
'/tmp/Endpoint_SlaveEndpointTest_NoAuthorizer_0_kp9nrn/http_credentials'
I0909 20:17:21.097270 29434 http.cpp:1026] Creating default 'basic' HTTP authenticator for
realm 'mesos-agent-executor'
I0909 20:17:21.097381 29434 http.cpp:1047] Creating default 'jwt' HTTP authenticator for realm
'mesos-agent-executor'
I0909 20:17:21.097578 29434 http.cpp:1026] Creating default 'basic' HTTP authenticator for
realm 'mesos-agent-readonly'
I0909 20:17:21.097684 29434 http.cpp:1047] Creating default 'jwt' HTTP authenticator for realm
'mesos-agent-readonly'
I0909 20:17:21.097865 29434 http.cpp:1026] Creating default 'basic' HTTP authenticator for
realm 'mesos-agent-readwrite'
I0909 20:17:21.097960 29434 http.cpp:1047] Creating default 'jwt' HTTP authenticator for realm
'mesos-agent-readwrite'
I0909 20:17:21.099323 29434 slave.cpp:565] Agent resources: [{"name":"cpus","scalar":{"value":2.0},"type":"SCALAR"},{"name":"mem","scalar":{"value":1024.0},"type":"SCALAR"},{"name":"disk","scalar":{"value":1024.0},"type":"SCALAR"},{"name":"ports","ranges":{"range":[{"begin":31000,"end":32000}]},"type":"RANGES"}]
I0909 20:17:21.099539 29434 slave.cpp:573] Agent attributes: [  ]
I0909 20:17:21.099551 29434 slave.cpp:582] Agent hostname: 45d5ba030c22
I0909 20:17:21.099710 29414 status_update_manager.cpp:177] Pausing sending status updates
I0909 20:17:21.100947 29426 state.cpp:64] Recovering state from '/tmp/Endpoint_SlaveEndpointTest_NoAuthorizer_0_fn91LA/meta'
I0909 20:17:21.101317 29432 status_update_manager.cpp:203] Recovering status update manager
I0909 20:17:21.101620 29412 containerizer.cpp:609] Recovering containerizer
I0909 20:17:21.102908 29416 provisioner.cpp:416] Provisioner recovery complete
I0909 20:17:21.103332 29414 slave.cpp:6295] Finished recovery
I0909 20:17:21.103766 29414 slave.cpp:6477] Querying resource estimator for oversubscribable
resources
I0909 20:17:21.104022 29419 slave.cpp:6491] Received oversubscribable resources {} from the
resource estimator
I0909 20:17:21.106235 29413 process.cpp:3927] Handling HTTP event for process 'slave(809)'
with path: '/slave(809)/monitor/statistics'
I0909 20:17:21.108034 29416 http.cpp:1166] HTTP GET for /slave(809)/monitor/statistics from
172.17.0.12:51916
I0909 20:17:21.108121 29416 http.cpp:957] Authorizing principal 'test-principal' to GET the
'/monitor/statistics' endpoint
I0909 20:17:21.111939  8465 slave.cpp:843] Agent terminating
[       OK ] Endpoint/SlaveEndpointTest.NoAuthorizer/0 (31 ms)
[ RUN      ] Endpoint/SlaveEndpointTest.NoAuthorizer/1
I0909 20:17:21.123280  8465 containerizer.cpp:246] Using isolation: posix/cpu,posix/mem,filesystem/posix,network/cni,environment_secret
W0909 20:17:21.123791  8465 backend.cpp:76] Failed to create 'aufs' backend: AufsBackend requires
root privileges
W0909 20:17:21.123896  8465 backend.cpp:76] Failed to create 'bind' backend: BindBackend requires
root privileges
I0909 20:17:21.123925  8465 provisioner.cpp:255] Using default backend 'copy'
I0909 20:17:21.125675  8465 cluster.cpp:448] Creating default 'local' authorizer
I0909 20:17:21.127455 29418 slave.cpp:250] Mesos agent started on (810)@172.17.0.12:37082
I0909 20:17:21.127478 29418 slave.cpp:251] Flags at startup: --acls="" --appc_simple_discovery_uri_prefix="http://"
--appc_store_dir="/tmp/Endpoint_SlaveEndpointTest_NoAuthorizer_1_MJKUgv/store/appc" --authenticate_http_executors="true"
--authenticate_http_readonly="true" --authenticate_http_readwrite="true" --authenticatee="crammd5"
--authentication_backoff_factor="1secs" --authorizer="local" --cgroups_cpu_enable_pids_and_tids_count="false"
--cgroups_enable_cfs="false" --cgroups_hierarchy="/sys/fs/cgroup" --cgroups_limit_swap="false"
--cgroups_root="mesos" --container_disk_watch_interval="15secs" --containerizers="mesos" --credential="/tmp/Endpoint_SlaveEndpointTest_NoAuthorizer_1_MJKUgv/credential"
--default_role="*" --disallow_sharing_agent_pid_namespace="false" --disk_watch_interval="1mins"
--docker="docker" --docker_kill_orphans="true" --docker_registry="https://registry-1.docker.io"
--docker_remove_delay="6hrs" --docker_socket="/var/run/docker.sock" --docker_stop_timeout="0ns"
--docker_store_dir="/tmp/Endpoint_SlaveEndpointTest_NoAuthorizer_1_MJKUgv/store/docker" --docker_volume_checkpoint_dir="/var/run/mesos/isolators/docker/volume"
--enforce_container_disk_quota="false" --executor_registration_timeout="1mins" --executor_reregistration_timeout="2secs"
--executor_secret_key="/tmp/Endpoint_SlaveEndpointTest_NoAuthorizer_1_MJKUgv/executor_secret_key"
--executor_shutdown_grace_period="5secs" --fetcher_cache_dir="/tmp/Endpoint_SlaveEndpointTest_NoAuthorizer_1_MJKUgv/fetch"
--fetcher_cache_size="2GB" --frameworks_home="" --gc_delay="1weeks" --gc_disk_headroom="0.1"
--hadoop_home="" --help="false" --hostname_lookup="true" --http_command_executor="false" --http_credentials="/tmp/Endpoint_SlaveEndpointTest_NoAuthorizer_1_MJKUgv/http_credentials"
--http_heartbeat_interval="30secs" --initialize_driver_logging="true" --isolation="posix/cpu,posix/mem"
--launcher="posix" --launcher_dir="/mesos/mesos-1.4.0/_build/src" --logbufsecs="0" --logging_level="INFO"
--max_completed_executors_per_framework="150" --oversubscribed_resources_interval="15secs"
--perf_duration="10secs" --perf_interval="1mins" --port="5051" --qos_correction_interval_min="0ns"
--quiet="false" --recover="reconnect" --recovery_timeout="15mins" --registration_backoff_factor="10ms"
--resources="cpus:2;gpus:0;mem:1024;disk:1024;ports:[31000-32000]" --revocable_cpu_low_priority="true"
--runtime_dir="/tmp/Endpoint_SlaveEndpointTest_NoAuthorizer_1_MJKUgv" --sandbox_directory="/mnt/mesos/sandbox"
--strict="true" --switch_user="true" --systemd_enable_support="true" --systemd_runtime_directory="/run/systemd/system"
--version="false" --work_dir="/tmp/Endpoint_SlaveEndpointTest_NoAuthorizer_1_d3XXCJ"
I0909 20:17:21.127977 29418 credentials.hpp:86] Loading credential for authentication from
'/tmp/Endpoint_SlaveEndpointTest_NoAuthorizer_1_MJKUgv/credential'
I0909 20:17:21.128203 29418 slave.cpp:283] Agent using credential for: test-principal
I0909 20:17:21.128235 29418 credentials.hpp:37] Loading credentials for authentication from
'/tmp/Endpoint_SlaveEndpointTest_NoAuthorizer_1_MJKUgv/http_credentials'
I0909 20:17:21.128597 29418 http.cpp:1026] Creating default 'basic' HTTP authenticator for
realm 'mesos-agent-executor'
I0909 20:17:21.128732 29418 http.cpp:1047] Creating default 'jwt' HTTP authenticator for realm
'mesos-agent-executor'
I0909 20:17:21.128974 29418 http.cpp:1026] Creating default 'basic' HTTP authenticator for
realm 'mesos-agent-readonly'
I0909 20:17:21.129098 29418 http.cpp:1047] Creating default 'jwt' HTTP authenticator for realm
'mesos-agent-readonly'
I0909 20:17:21.129355 29418 http.cpp:1026] Creating default 'basic' HTTP authenticator for
realm 'mesos-agent-readwrite'
I0909 20:17:21.129454 29418 http.cpp:1047] Creating default 'jwt' HTTP authenticator for realm
'mesos-agent-readwrite'
I0909 20:17:21.131140 29418 slave.cpp:565] Agent resources: [{"name":"cpus","scalar":{"value":2.0},"type":"SCALAR"},{"name":"mem","scalar":{"value":1024.0},"type":"SCALAR"},{"name":"disk","scalar":{"value":1024.0},"type":"SCALAR"},{"name":"ports","ranges":{"range":[{"begin":31000,"end":32000}]},"type":"RANGES"}]
I0909 20:17:21.131408 29418 slave.cpp:573] Agent attributes: [  ]
I0909 20:17:21.131425 29418 slave.cpp:582] Agent hostname: 45d5ba030c22
I0909 20:17:21.131597 29432 status_update_manager.cpp:177] Pausing sending status updates
I0909 20:17:21.132892 29415 state.cpp:64] Recovering state from '/tmp/Endpoint_SlaveEndpointTest_NoAuthorizer_1_d3XXCJ/meta'
I0909 20:17:21.133167 29427 status_update_manager.cpp:203] Recovering status update manager
I0909 20:17:21.133373 29412 containerizer.cpp:609] Recovering containerizer
I0909 20:17:21.134651 29424 provisioner.cpp:416] Provisioner recovery complete
I0909 20:17:21.134992 29419 slave.cpp:6295] Finished recovery
I0909 20:17:21.135499 29419 slave.cpp:6477] Querying resource estimator for oversubscribable
resources
I0909 20:17:21.135761 29411 slave.cpp:6491] Received oversubscribable resources {} from the
resource estimator
I0909 20:17:21.137493 29429 process.cpp:3927] Handling HTTP event for process 'slave(810)'
with path: '/slave(810)/monitor/statistics.json'
I0909 20:17:21.139510 29426 http.cpp:1166] HTTP GET for /slave(810)/monitor/statistics.json
from 172.17.0.12:51918
I0909 20:17:21.139580 29426 http.cpp:957] Authorizing principal 'test-principal' to GET the
'/monitor/statistics.json' endpoint
I0909 20:17:21.143059  8465 slave.cpp:843] Agent terminating
[       OK ] Endpoint/SlaveEndpointTest.NoAuthorizer/1 (30 ms)
[ RUN      ] Endpoint/SlaveEndpointTest.NoAuthorizer/2
I0909 20:17:21.157832  8465 containerizer.cpp:246] Using isolation: posix/cpu,posix/mem,filesystem/posix,network/cni,environment_secret
W0909 20:17:21.158519  8465 backend.cpp:76] Failed to create 'aufs' backend: AufsBackend requires
root privileges
W0909 20:17:21.158694  8465 backend.cpp:76] Failed to create 'bind' backend: BindBackend requires
root privileges
I0909 20:17:21.158738  8465 provisioner.cpp:255] Using default backend 'copy'
I0909 20:17:21.161911  8465 cluster.cpp:448] Creating default 'local' authorizer
I0909 20:17:21.165379 29434 slave.cpp:250] Mesos agent started on (811)@172.17.0.12:37082
I0909 20:17:21.165405 29434 slave.cpp:251] Flags at startup: --acls="" --appc_simple_discovery_uri_prefix="http://"
--appc_store_dir="/tmp/Endpoint_SlaveEndpointTest_NoAuthorizer_2_MUquvE/store/appc" --authenticate_http_executors="true"
--authenticate_http_readonly="true" --authenticate_http_readwrite="true" --authenticatee="crammd5"
--authentication_backoff_factor="1secs" --authorizer="local" --cgroups_cpu_enable_pids_and_tids_count="false"
--cgroups_enable_cfs="false" --cgroups_hierarchy="/sys/fs/cgroup" --cgroups_limit_swap="false"
--cgroups_root="mesos" --container_disk_watch_interval="15secs" --containerizers="mesos" --credential="/tmp/Endpoint_SlaveEndpointTest_NoAuthorizer_2_MUquvE/credential"
--default_role="*" --disallow_sharing_agent_pid_namespace="false" --disk_watch_interval="1mins"
--docker="docker" --docker_kill_orphans="true" --docker_registry="https://registry-1.docker.io"
--docker_remove_delay="6hrs" --docker_socket="/var/run/docker.sock" --docker_stop_timeout="0ns"
--docker_store_dir="/tmp/Endpoint_SlaveEndpointTest_NoAuthorizer_2_MUquvE/store/docker" --docker_volume_checkpoint_dir="/var/run/mesos/isolators/docker/volume"
--enforce_container_disk_quota="false" --executor_registration_timeout="1mins" --executor_reregistration_timeout="2secs"
--executor_secret_key="/tmp/Endpoint_SlaveEndpointTest_NoAuthorizer_2_MUquvE/executor_secret_key"
--executor_shutdown_grace_period="5secs" --fetcher_cache_dir="/tmp/Endpoint_SlaveEndpointTest_NoAuthorizer_2_MUquvE/fetch"
--fetcher_cache_size="2GB" --frameworks_home="" --gc_delay="1weeks" --gc_disk_headroom="0.1"
--hadoop_home="" --help="false" --hostname_lookup="true" --http_command_executor="false" --http_credentials="/tmp/Endpoint_SlaveEndpointTest_NoAuthorizer_2_MUquvE/http_credentials"
--http_heartbeat_interval="30secs" --initialize_driver_logging="true" --isolation="posix/cpu,posix/mem"
--launcher="posix" --launcher_dir="/mesos/mesos-1.4.0/_build/src" --logbufsecs="0" --logging_level="INFO"
--max_completed_executors_per_framework="150" --oversubscribed_resources_interval="15secs"
--perf_duration="10secs" --perf_interval="1mins" --port="5051" --qos_correction_interval_min="0ns"
--quiet="false" --recover="reconnect" --recovery_timeout="15mins" --registration_backoff_factor="10ms"
--resources="cpus:2;gpus:0;mem:1024;disk:1024;ports:[31000-32000]" --revocable_cpu_low_priority="true"
--runtime_dir="/tmp/Endpoint_SlaveEndpointTest_NoAuthorizer_2_MUquvE" --sandbox_directory="/mnt/mesos/sandbox"
--strict="true" --switch_user="true" --systemd_enable_support="true" --systemd_runtime_directory="/run/systemd/system"
--version="false" --work_dir="/tmp/Endpoint_SlaveEndpointTest_NoAuthorizer_2_RZczGR"
I0909 20:17:21.165813 29434 credentials.hpp:86] Loading credential for authentication from
'/tmp/Endpoint_SlaveEndpointTest_NoAuthorizer_2_MUquvE/credential'
I0909 20:17:21.165963 29434 slave.cpp:283] Agent using credential for: test-principal
I0909 20:17:21.165983 29434 credentials.hpp:37] Loading credentials for authentication from
'/tmp/Endpoint_SlaveEndpointTest_NoAuthorizer_2_MUquvE/http_credentials'
I0909 20:17:21.166270 29434 http.cpp:1026] Creating default 'basic' HTTP authenticator for
realm 'mesos-agent-executor'
I0909 20:17:21.166393 29434 http.cpp:1047] Creating default 'jwt' HTTP authenticator for realm
'mesos-agent-executor'
I0909 20:17:21.166604 29434 http.cpp:1026] Creating default 'basic' HTTP authenticator for
realm 'mesos-agent-readonly'
I0909 20:17:21.166704 29434 http.cpp:1047] Creating default 'jwt' HTTP authenticator for realm
'mesos-agent-readonly'
I0909 20:17:21.166883 29434 http.cpp:1026] Creating default 'basic' HTTP authenticator for
realm 'mesos-agent-readwrite'
I0909 20:17:21.166981 29434 http.cpp:1047] Creating default 'jwt' HTTP authenticator for realm
'mesos-agent-readwrite'
I0909 20:17:21.168368 29434 slave.cpp:565] Agent resources: [{"name":"cpus","scalar":{"value":2.0},"type":"SCALAR"},{"name":"mem","scalar":{"value":1024.0},"type":"SCALAR"},{"name":"disk","scalar":{"value":1024.0},"type":"SCALAR"},{"name":"ports","ranges":{"range":[{"begin":31000,"end":32000}]},"type":"RANGES"}]
I0909 20:17:21.168606 29434 slave.cpp:573] Agent attributes: [  ]
I0909 20:17:21.168619 29434 slave.cpp:582] Agent hostname: 45d5ba030c22
I0909 20:17:21.168733 29424 status_update_manager.cpp:177] Pausing sending status updates
I0909 20:17:21.170769 29425 state.cpp:64] Recovering state from '/tmp/Endpoint_SlaveEndpointTest_NoAuthorizer_2_RZczGR/meta'
I0909 20:17:21.171099 29425 status_update_manager.cpp:203] Recovering status update manager
I0909 20:17:21.171427 29426 containerizer.cpp:609] Recovering containerizer
I0909 20:17:21.173355 29422 provisioner.cpp:416] Provisioner recovery complete
I0909 20:17:21.173806 29424 slave.cpp:6295] Finished recovery
I0909 20:17:21.174459 29424 slave.cpp:6477] Querying resource estimator for oversubscribable
resources
I0909 20:17:21.174823 29420 slave.cpp:6491] Received oversubscribable resources {} from the
resource estimator
I0909 20:17:21.177718 29427 process.cpp:3927] Handling HTTP event for process 'slave(811)'
with path: '/slave(811)/containers'
I0909 20:17:21.180480 29429 http.cpp:1166] HTTP GET for /slave(811)/containers from 172.17.0.12:51922
I0909 20:17:21.180608 29429 http.cpp:957] Authorizing principal 'test-principal' to GET the
'/containers' endpoint
I0909 20:17:21.185227 29433 slave.cpp:843] Agent terminating
[       OK ] Endpoint/SlaveEndpointTest.NoAuthorizer/2 (44 ms)
[----------] 9 tests from Endpoint/SlaveEndpointTest (314 ms total)

[----------] 2 tests from ContainerizerType/DefaultContainerDNSFlagTest
[ RUN      ] ContainerizerType/DefaultContainerDNSFlagTest.ValidateFlag/0
[       OK ] ContainerizerType/DefaultContainerDNSFlagTest.ValidateFlag/0 (16 ms)
[ RUN      ] ContainerizerType/DefaultContainerDNSFlagTest.ValidateFlag/1
[       OK ] ContainerizerType/DefaultContainerDNSFlagTest.ValidateFlag/1 (14 ms)
[----------] 2 tests from ContainerizerType/DefaultContainerDNSFlagTest (30 ms total)

[----------] Global test environment tear-down
[==========] 1663 tests from 184 test cases ran. (658789 ms total)
[  PASSED  ] 1657 tests.
[  FAILED  ] 6 tests, listed below:
[  FAILED  ] CommandExecutorCheckTest.CommandCheckDeliveredAndReconciled
[  FAILED  ] DefaultExecutorCheckTest.CommandCheckDeliveredAndReconciled
[  FAILED  ] DefaultExecutorCheckTest.CommandCheckStatusChange
[  FAILED  ] DefaultExecutorCheckTest.CommandCheckSeesParentsEnv
[  FAILED  ] DefaultExecutorCheckTest.CommandCheckSharesWorkDirWithTask
[  FAILED  ] ExamplesTest.DynamicReservationFramework

 6 FAILED TESTS
  YOU HAVE 20 DISABLED TESTS

I0909 20:17:21.297721 29435 process.cpp:1068] Failed to accept socket: future discarded
make[4]: *** [check-local] Error 1
make[4]: Leaving directory `/mesos/mesos-1.4.0/_build/src'
make[3]: *** [check-am] Error 2
make[3]: Leaving directory `/mesos/mesos-1.4.0/_build/src'
make[2]: *** [check] Error 2
make[2]: Leaving directory `/mesos/mesos-1.4.0/_build/src'
make[1]: *** [check-recursive] Error 1
make[1]: Leaving directory `/mesos/mesos-1.4.0/_build'
make: *** [distcheck] Error 1
+ docker rmi mesos-1504984674-29606
Untagged: mesos-1504984674-29606:latest
Deleted: sha256:e5d25e9db1bdf16639079adda0843c1c1b6fe0e02f11269e3675a53550b12f3d
Deleted: sha256:d4b0de0a6b38514c28502a0d58a8f07947ab2c7ea9f1295aa77876519c89d40a
Deleted: sha256:35da91a9952fc0999d704b8d8734543d621bda64fe086ffb9e5421ef6bea932b
Deleted: sha256:9be3aef9892fe6c68a43ed840ec9d26eb79d33fa96e1738265ea470160508d1f
Deleted: sha256:7733d00cbb4d9acd6428ed63bc999f6c0d53b40c2d5a31c1adb9071912884911
Deleted: sha256:6fdd97c9338af4b5a5bf8de18bd490a620ce780bd7462cf6adbef2ec4f003011
Deleted: sha256:94ac1de8f4629c50366c9a1c5e4fc1e9da14eee6e0944a0acf75e43cd11ab3c2
Deleted: sha256:e62a7a913165d37cc41befb9f3752237c40e7ddb2c64fff792a113076f9e9cbc
Deleted: sha256:f908db0ecf718cd3366308979e6a6affc4e20bf879fb75675a56be36df0e30fb
Deleted: sha256:849cb7bb012a81e321beb6ea7ea2117c1226ba43f6fe9f0db427683464726c36
Deleted: sha256:706bc0762c9fec264baa171397be2e66fb1f4c1e43e75b5a744ee0c9ab252172
Deleted: sha256:8e5cf6a2457c9e39e5a8539f49767ec1506074ee66beb9c7015a6fefa2adead7
Deleted: sha256:dfa8aaceaddba93c27a7fda5665028cf0552b47f434f3f30afaee3ddadaab793
Deleted: sha256:4cf6c16ad5d7df87b572db880a97fc52e8975d25c605de6131f4fa639a0a6ac8
Deleted: sha256:3d0845083440b3f57f18294084eb077cf0fe74b0e793218d172c7f62fbbf7ec7
Deleted: sha256:4c2f013439a57b0425fb1c45b280c1206f4853af62fe268bc94787a4f083887e
Deleted: sha256:ef4a74b979d2906e92841df997ff517226a6138210012db3cdc0e3b5c7818794
Deleted: sha256:1e176c6ea8455a4c5e65b9a6d5d1e8e20158dbe3d50b2cd9891e8397ce32236a
Deleted: sha256:ed42a7847c212b785c63e6f876e3491c502f80143c984a31c2692393eefe385f
Deleted: sha256:0afd73c27eb614176e6d2b64d09c4d74d36689757c87e1d311b146afd49ef8c6
Deleted: sha256:6625f31e672651f8d61b641c29ee243a95832e20e09931d2f1a06aa6408a0b72
Deleted: sha256:3b2c36df284edab466ba2e8518f5c563b53184003243323d18823feda51cde5c
Deleted: sha256:4a5261e8034a9193a9d12fb8dc02d77753a2f613e66e769c030a0a55abc135fb
Deleted: sha256:cd0ffe05d0e99ce7bf439f519bfc1bad15612671e2a51e67eb2afe750074fdce
Build step 'Execute shell' marked build as failure

Mime
View raw message