mesos-builds mailing list archives

Site index · List index
Message view « Date » · « Thread »
Top « Date » · « Thread »
From Apache Jenkins Server <jenk...@builds.apache.org>
Subject Build failed in Jenkins: Mesos-Buildbot » autotools,gcc,--verbose,GLOG_v=1 MESOS_VERBOSE=1,ubuntu:14.04,(ubuntu)&&(!ubuntu-us1)&&(!ubuntu-eu2)&&(!qnode3)&&(!H23) #4226
Date Fri, 15 Sep 2017 12:01:25 GMT
See <https://builds.apache.org/job/Mesos-Buildbot/BUILDTOOL=autotools,COMPILER=gcc,CONFIGURATION=--verbose,ENVIRONMENT=GLOG_v=1%20MESOS_VERBOSE=1,OS=ubuntu%3A14.04,label_exp=(ubuntu)&&(!ubuntu-us1)&&(!ubuntu-eu2)&&(!qnode3)&&(!H23)/4226/display/redirect?page=changes>

Changes:

[alexr] Added workaround for a docker bug in docker build helper.

------------------------------------------
[...truncated 31.36 MB...]
I0915 12:01:06.957823  5636 slave.cpp:583] Agent resources: [{"name":"cpus","scalar":{"value":2.0},"type":"SCALAR"},{"name":"mem","scalar":{"value":1024.0},"type":"SCALAR"},{"name":"disk","scalar":{"value":1024.0},"type":"SCALAR"},{"name":"ports","ranges":{"range":[{"begin":31000,"end":32000}]},"type":"RANGES"}]
I0915 12:01:06.958053  5636 slave.cpp:591] Agent attributes: [  ]
I0915 12:01:06.958072  5636 slave.cpp:600] Agent hostname: 664a1f1d6938
I0915 12:01:06.958227  5648 status_update_manager.cpp:177] Pausing sending status updates
I0915 12:01:06.959581  5635 state.cpp:64] Recovering state from '/tmp/Endpoint_SlaveEndpointTest_AuthorizedRequest_2_90UQJo/meta'
I0915 12:01:06.959942  5633 status_update_manager.cpp:203] Recovering status update manager
I0915 12:01:06.960175  5644 containerizer.cpp:648] Recovering containerizer
I0915 12:01:06.961602  5635 provisioner.cpp:416] Provisioner recovery complete
I0915 12:01:06.962015  5641 slave.cpp:6298] Finished recovery
I0915 12:01:06.962538  5641 slave.cpp:6480] Querying resource estimator for oversubscribable
resources
I0915 12:01:06.962810  5644 slave.cpp:6494] Received oversubscribable resources {} from the
resource estimator
I0915 12:01:06.965479  5648 process.cpp:3929] Handling HTTP event for process 'slave(810)'
with path: '/slave(810)/containers'
I0915 12:01:06.966909  5634 http.cpp:1185] HTTP GET for /slave(810)/containers from 172.17.0.8:34181
I0915 12:01:06.966986  5634 http.cpp:976] Authorizing principal 'test-principal' to GET the
'/containers' endpoint
I0915 12:01:06.971280  5614 slave.cpp:861] Agent terminating
[       OK ] Endpoint/SlaveEndpointTest.AuthorizedRequest/2 (31 ms)
[ RUN      ] Endpoint/SlaveEndpointTest.UnauthorizedRequest/0
I0915 12:01:06.983214  5614 containerizer.cpp:292] Using isolation { environment_secret, posix/cpu,
posix/mem, filesystem/posix, network/cni }
W0915 12:01:06.983692  5614 backend.cpp:76] Failed to create 'aufs' backend: AufsBackend requires
root privileges
W0915 12:01:06.983811  5614 backend.cpp:76] Failed to create 'bind' backend: BindBackend requires
root privileges
I0915 12:01:06.983855  5614 provisioner.cpp:255] Using default backend 'copy'
I0915 12:01:06.987498  5637 slave.cpp:252] Mesos agent started on (811)@172.17.0.8:56202
I0915 12:01:06.987524  5637 slave.cpp:253] Flags at startup: --acls="" --appc_simple_discovery_uri_prefix="http://"
--appc_store_dir="/tmp/Endpoint_SlaveEndpointTest_UnauthorizedRequest_0_BIYWcw/store/appc"
--authenticate_http_readonly="true" --authenticate_http_readwrite="true" --authenticatee="crammd5"
--authentication_backoff_factor="1secs" --authorizer="local" --cgroups_cpu_enable_pids_and_tids_count="false"
--cgroups_enable_cfs="false" --cgroups_hierarchy="/sys/fs/cgroup" --cgroups_limit_swap="false"
--cgroups_root="mesos" --container_disk_watch_interval="15secs" --containerizers="mesos" --credential="/tmp/Endpoint_SlaveEndpointTest_UnauthorizedRequest_0_BIYWcw/credential"
--default_role="*" --disallow_sharing_agent_pid_namespace="false" --disk_watch_interval="1mins"
--docker="docker" --docker_kill_orphans="true" --docker_registry="https://registry-1.docker.io"
--docker_remove_delay="6hrs" --docker_socket="/var/run/docker.sock" --docker_stop_timeout="0ns"
--docker_store_dir="/tmp/Endpoint_SlaveEndpointTest_UnauthorizedRequest_0_BIYWcw/store/docker"
--docker_volume_checkpoint_dir="/var/run/mesos/isolators/docker/volume" --enforce_container_disk_quota="false"
--executor_registration_timeout="1mins" --executor_reregistration_timeout="2secs" --executor_shutdown_grace_period="5secs"
--fetcher_cache_dir="/tmp/Endpoint_SlaveEndpointTest_UnauthorizedRequest_0_BIYWcw/fetch" --fetcher_cache_size="2GB"
--frameworks_home="" --gc_delay="1weeks" --gc_disk_headroom="0.1" --hadoop_home="" --help="false"
--hostname_lookup="true" --http_command_executor="false" --http_credentials="/tmp/Endpoint_SlaveEndpointTest_UnauthorizedRequest_0_BIYWcw/http_credentials"
--http_heartbeat_interval="30secs" --initialize_driver_logging="true" --isolation="posix/cpu,posix/mem"
--launcher="posix" --launcher_dir="/mesos/mesos-1.5.0/_build/src" --logbufsecs="0" --logging_level="INFO"
--max_completed_executors_per_framework="150" --oversubscribed_resources_interval="15secs"
--perf_duration="10secs" --perf_interval="1mins" --port="5051" --qos_correction_interval_min="0ns"
--quiet="false" --recover="reconnect" --recovery_timeout="15mins" --registration_backoff_factor="10ms"
--resources="cpus:2;gpus:0;mem:1024;disk:1024;ports:[31000-32000]" --revocable_cpu_low_priority="true"
--runtime_dir="/tmp/Endpoint_SlaveEndpointTest_UnauthorizedRequest_0_BIYWcw" --sandbox_directory="/mnt/mesos/sandbox"
--strict="true" --switch_user="true" --systemd_enable_support="true" --systemd_runtime_directory="/run/systemd/system"
--version="false" --work_dir="/tmp/Endpoint_SlaveEndpointTest_UnauthorizedRequest_0_bMmduT"
--zk_session_timeout="10secs"
I0915 12:01:06.987980  5637 credentials.hpp:86] Loading credential for authentication from
'/tmp/Endpoint_SlaveEndpointTest_UnauthorizedRequest_0_BIYWcw/credential'
I0915 12:01:06.988195  5637 slave.cpp:285] Agent using credential for: test-principal
I0915 12:01:06.988217  5637 credentials.hpp:37] Loading credentials for authentication from
'/tmp/Endpoint_SlaveEndpointTest_UnauthorizedRequest_0_BIYWcw/http_credentials'
I0915 12:01:06.988459  5637 http.cpp:1045] Creating default 'basic' HTTP authenticator for
realm 'mesos-agent-readonly'
I0915 12:01:06.988634  5637 http.cpp:1045] Creating default 'basic' HTTP authenticator for
realm 'mesos-agent-readwrite'
I0915 12:01:06.990000  5637 slave.cpp:583] Agent resources: [{"name":"cpus","scalar":{"value":2.0},"type":"SCALAR"},{"name":"mem","scalar":{"value":1024.0},"type":"SCALAR"},{"name":"disk","scalar":{"value":1024.0},"type":"SCALAR"},{"name":"ports","ranges":{"range":[{"begin":31000,"end":32000}]},"type":"RANGES"}]
I0915 12:01:06.990229  5637 slave.cpp:591] Agent attributes: [  ]
I0915 12:01:06.990244  5637 slave.cpp:600] Agent hostname: 664a1f1d6938
I0915 12:01:06.990387  5642 status_update_manager.cpp:177] Pausing sending status updates
I0915 12:01:06.991865  5641 state.cpp:64] Recovering state from '/tmp/Endpoint_SlaveEndpointTest_UnauthorizedRequest_0_bMmduT/meta'
I0915 12:01:06.992208  5636 status_update_manager.cpp:203] Recovering status update manager
I0915 12:01:06.992409  5645 containerizer.cpp:648] Recovering containerizer
I0915 12:01:06.993805  5640 provisioner.cpp:416] Provisioner recovery complete
I0915 12:01:06.994263  5636 slave.cpp:6298] Finished recovery
I0915 12:01:06.994721  5636 slave.cpp:6480] Querying resource estimator for oversubscribable
resources
I0915 12:01:06.995002  5638 slave.cpp:6494] Received oversubscribable resources {} from the
resource estimator
I0915 12:01:06.997784  5648 process.cpp:3929] Handling HTTP event for process 'slave(811)'
with path: '/slave(811)/monitor/statistics'
I0915 12:01:06.999284  5634 http.cpp:1185] HTTP GET for /slave(811)/monitor/statistics from
172.17.0.8:34182
I0915 12:01:06.999361  5634 http.cpp:976] Authorizing principal 'test-principal' to GET the
'/monitor/statistics' endpoint
I0915 12:01:07.001818  5614 slave.cpp:861] Agent terminating
[       OK ] Endpoint/SlaveEndpointTest.UnauthorizedRequest/0 (30 ms)
[ RUN      ] Endpoint/SlaveEndpointTest.UnauthorizedRequest/1
I0915 12:01:07.014029  5614 containerizer.cpp:292] Using isolation { environment_secret, posix/cpu,
posix/mem, filesystem/posix, network/cni }
W0915 12:01:07.014514  5614 backend.cpp:76] Failed to create 'aufs' backend: AufsBackend requires
root privileges
W0915 12:01:07.014641  5614 backend.cpp:76] Failed to create 'bind' backend: BindBackend requires
root privileges
I0915 12:01:07.014683  5614 provisioner.cpp:255] Using default backend 'copy'
I0915 12:01:07.018332  5638 slave.cpp:252] Mesos agent started on (812)@172.17.0.8:56202
I0915 12:01:07.018358  5638 slave.cpp:253] Flags at startup: --acls="" --appc_simple_discovery_uri_prefix="http://"
--appc_store_dir="/tmp/Endpoint_SlaveEndpointTest_UnauthorizedRequest_1_hz1Im1/store/appc"
--authenticate_http_readonly="true" --authenticate_http_readwrite="true" --authenticatee="crammd5"
--authentication_backoff_factor="1secs" --authorizer="local" --cgroups_cpu_enable_pids_and_tids_count="false"
--cgroups_enable_cfs="false" --cgroups_hierarchy="/sys/fs/cgroup" --cgroups_limit_swap="false"
--cgroups_root="mesos" --container_disk_watch_interval="15secs" --containerizers="mesos" --credential="/tmp/Endpoint_SlaveEndpointTest_UnauthorizedRequest_1_hz1Im1/credential"
--default_role="*" --disallow_sharing_agent_pid_namespace="false" --disk_watch_interval="1mins"
--docker="docker" --docker_kill_orphans="true" --docker_registry="https://registry-1.docker.io"
--docker_remove_delay="6hrs" --docker_socket="/var/run/docker.sock" --docker_stop_timeout="0ns"
--docker_store_dir="/tmp/Endpoint_SlaveEndpointTest_UnauthorizedRequest_1_hz1Im1/store/docker"
--docker_volume_checkpoint_dir="/var/run/mesos/isolators/docker/volume" --enforce_container_disk_quota="false"
--executor_registration_timeout="1mins" --executor_reregistration_timeout="2secs" --executor_shutdown_grace_period="5secs"
--fetcher_cache_dir="/tmp/Endpoint_SlaveEndpointTest_UnauthorizedRequest_1_hz1Im1/fetch" --fetcher_cache_size="2GB"
--frameworks_home="" --gc_delay="1weeks" --gc_disk_headroom="0.1" --hadoop_home="" --help="false"
--hostname_lookup="true" --http_command_executor="false" --http_credentials="/tmp/Endpoint_SlaveEndpointTest_UnauthorizedRequest_1_hz1Im1/http_credentials"
--http_heartbeat_interval="30secs" --initialize_driver_logging="true" --isolation="posix/cpu,posix/mem"
--launcher="posix" --launcher_dir="/mesos/mesos-1.5.0/_build/src" --logbufsecs="0" --logging_level="INFO"
--max_completed_executors_per_framework="150" --oversubscribed_resources_interval="15secs"
--perf_duration="10secs" --perf_interval="1mins" --port="5051" --qos_correction_interval_min="0ns"
--quiet="false" --recover="reconnect" --recovery_timeout="15mins" --registration_backoff_factor="10ms"
--resources="cpus:2;gpus:0;mem:1024;disk:1024;ports:[31000-32000]" --revocable_cpu_low_priority="true"
--runtime_dir="/tmp/Endpoint_SlaveEndpointTest_UnauthorizedRequest_1_hz1Im1" --sandbox_directory="/mnt/mesos/sandbox"
--strict="true" --switch_user="true" --systemd_enable_support="true" --systemd_runtime_directory="/run/systemd/system"
--version="false" --work_dir="/tmp/Endpoint_SlaveEndpointTest_UnauthorizedRequest_1_vUv0yo"
--zk_session_timeout="10secs"
I0915 12:01:07.018821  5638 credentials.hpp:86] Loading credential for authentication from
'/tmp/Endpoint_SlaveEndpointTest_UnauthorizedRequest_1_hz1Im1/credential'
I0915 12:01:07.019047  5638 slave.cpp:285] Agent using credential for: test-principal
I0915 12:01:07.019071  5638 credentials.hpp:37] Loading credentials for authentication from
'/tmp/Endpoint_SlaveEndpointTest_UnauthorizedRequest_1_hz1Im1/http_credentials'
I0915 12:01:07.019359  5638 http.cpp:1045] Creating default 'basic' HTTP authenticator for
realm 'mesos-agent-readonly'
I0915 12:01:07.019556  5638 http.cpp:1045] Creating default 'basic' HTTP authenticator for
realm 'mesos-agent-readwrite'
I0915 12:01:07.020990  5638 slave.cpp:583] Agent resources: [{"name":"cpus","scalar":{"value":2.0},"type":"SCALAR"},{"name":"mem","scalar":{"value":1024.0},"type":"SCALAR"},{"name":"disk","scalar":{"value":1024.0},"type":"SCALAR"},{"name":"ports","ranges":{"range":[{"begin":31000,"end":32000}]},"type":"RANGES"}]
I0915 12:01:07.021224  5638 slave.cpp:591] Agent attributes: [  ]
I0915 12:01:07.021250  5638 slave.cpp:600] Agent hostname: 664a1f1d6938
I0915 12:01:07.021402  5642 status_update_manager.cpp:177] Pausing sending status updates
I0915 12:01:07.022959  5647 state.cpp:64] Recovering state from '/tmp/Endpoint_SlaveEndpointTest_UnauthorizedRequest_1_vUv0yo/meta'
I0915 12:01:07.023303  5645 status_update_manager.cpp:203] Recovering status update manager
I0915 12:01:07.023524  5646 containerizer.cpp:648] Recovering containerizer
I0915 12:01:07.025091  5648 provisioner.cpp:416] Provisioner recovery complete
I0915 12:01:07.025423  5635 slave.cpp:6298] Finished recovery
I0915 12:01:07.025969  5635 slave.cpp:6480] Querying resource estimator for oversubscribable
resources
I0915 12:01:07.026221  5642 slave.cpp:6494] Received oversubscribable resources {} from the
resource estimator
I0915 12:01:07.028899  5645 process.cpp:3929] Handling HTTP event for process 'slave(812)'
with path: '/slave(812)/monitor/statistics.json'
I0915 12:01:07.030427  5635 http.cpp:1185] HTTP GET for /slave(812)/monitor/statistics.json
from 172.17.0.8:34183
I0915 12:01:07.030510  5635 http.cpp:976] Authorizing principal 'test-principal' to GET the
'/monitor/statistics.json' endpoint
I0915 12:01:07.033021  5646 slave.cpp:861] Agent terminating
[       OK ] Endpoint/SlaveEndpointTest.UnauthorizedRequest/1 (31 ms)
[ RUN      ] Endpoint/SlaveEndpointTest.UnauthorizedRequest/2
I0915 12:01:07.047153  5614 containerizer.cpp:292] Using isolation { environment_secret, posix/cpu,
posix/mem, filesystem/posix, network/cni }
W0915 12:01:07.047744  5614 backend.cpp:76] Failed to create 'aufs' backend: AufsBackend requires
root privileges
W0915 12:01:07.047876  5614 backend.cpp:76] Failed to create 'bind' backend: BindBackend requires
root privileges
I0915 12:01:07.047920  5614 provisioner.cpp:255] Using default backend 'copy'
I0915 12:01:07.051441  5645 slave.cpp:252] Mesos agent started on (813)@172.17.0.8:56202
I0915 12:01:07.051491  5645 slave.cpp:253] Flags at startup: --acls="" --appc_simple_discovery_uri_prefix="http://"
--appc_store_dir="/tmp/Endpoint_SlaveEndpointTest_UnauthorizedRequest_2_DhP6Qw/store/appc"
--authenticate_http_readonly="true" --authenticate_http_readwrite="true" --authenticatee="crammd5"
--authentication_backoff_factor="1secs" --authorizer="local" --cgroups_cpu_enable_pids_and_tids_count="false"
--cgroups_enable_cfs="false" --cgroups_hierarchy="/sys/fs/cgroup" --cgroups_limit_swap="false"
--cgroups_root="mesos" --container_disk_watch_interval="15secs" --containerizers="mesos" --credential="/tmp/Endpoint_SlaveEndpointTest_UnauthorizedRequest_2_DhP6Qw/credential"
--default_role="*" --disallow_sharing_agent_pid_namespace="false" --disk_watch_interval="1mins"
--docker="docker" --docker_kill_orphans="true" --docker_registry="https://registry-1.docker.io"
--docker_remove_delay="6hrs" --docker_socket="/var/run/docker.sock" --docker_stop_timeout="0ns"
--docker_store_dir="/tmp/Endpoint_SlaveEndpointTest_UnauthorizedRequest_2_DhP6Qw/store/docker"
--docker_volume_checkpoint_dir="/var/run/mesos/isolators/docker/volume" --enforce_container_disk_quota="false"
--executor_registration_timeout="1mins" --executor_reregistration_timeout="2secs" --executor_shutdown_grace_period="5secs"
--fetcher_cache_dir="/tmp/Endpoint_SlaveEndpointTest_UnauthorizedRequest_2_DhP6Qw/fetch" --fetcher_cache_size="2GB"
--frameworks_home="" --gc_delay="1weeks" --gc_disk_headroom="0.1" --hadoop_home="" --help="false"
--hostname_lookup="true" --http_command_executor="false" --http_credentials="/tmp/Endpoint_SlaveEndpointTest_UnauthorizedRequest_2_DhP6Qw/http_credentials"
--http_heartbeat_interval="30secs" --initialize_driver_logging="true" --isolation="posix/cpu,posix/mem"
--launcher="posix" --launcher_dir="/mesos/mesos-1.5.0/_build/src" --logbufsecs="0" --logging_level="INFO"
--max_completed_executors_per_framework="150" --oversubscribed_resources_interval="15secs"
--perf_duration="10secs" --perf_interval="1mins" --port="5051" --qos_correction_interval_min="0ns"
--quiet="false" --recover="reconnect" --recovery_timeout="15mins" --registration_backoff_factor="10ms"
--resources="cpus:2;gpus:0;mem:1024;disk:1024;ports:[31000-32000]" --revocable_cpu_low_priority="true"
--runtime_dir="/tmp/Endpoint_SlaveEndpointTest_UnauthorizedRequest_2_DhP6Qw" --sandbox_directory="/mnt/mesos/sandbox"
--strict="true" --switch_user="true" --systemd_enable_support="true" --systemd_runtime_directory="/run/systemd/system"
--version="false" --work_dir="/tmp/Endpoint_SlaveEndpointTest_UnauthorizedRequest_2_tBFbYT"
--zk_session_timeout="10secs"
I0915 12:01:07.052243  5645 credentials.hpp:86] Loading credential for authentication from
'/tmp/Endpoint_SlaveEndpointTest_UnauthorizedRequest_2_DhP6Qw/credential'
I0915 12:01:07.052530  5645 slave.cpp:285] Agent using credential for: test-principal
I0915 12:01:07.052574  5645 credentials.hpp:37] Loading credentials for authentication from
'/tmp/Endpoint_SlaveEndpointTest_UnauthorizedRequest_2_DhP6Qw/http_credentials'
I0915 12:01:07.052850  5645 http.cpp:1045] Creating default 'basic' HTTP authenticator for
realm 'mesos-agent-readonly'
I0915 12:01:07.053102  5645 http.cpp:1045] Creating default 'basic' HTTP authenticator for
realm 'mesos-agent-readwrite'
I0915 12:01:07.054496  5645 slave.cpp:583] Agent resources: [{"name":"cpus","scalar":{"value":2.0},"type":"SCALAR"},{"name":"mem","scalar":{"value":1024.0},"type":"SCALAR"},{"name":"disk","scalar":{"value":1024.0},"type":"SCALAR"},{"name":"ports","ranges":{"range":[{"begin":31000,"end":32000}]},"type":"RANGES"}]
I0915 12:01:07.054724  5645 slave.cpp:591] Agent attributes: [  ]
I0915 12:01:07.054739  5645 slave.cpp:600] Agent hostname: 664a1f1d6938
I0915 12:01:07.054947  5640 status_update_manager.cpp:177] Pausing sending status updates
I0915 12:01:07.056438  5644 state.cpp:64] Recovering state from '/tmp/Endpoint_SlaveEndpointTest_UnauthorizedRequest_2_tBFbYT/meta'
I0915 12:01:07.056799  5648 status_update_manager.cpp:203] Recovering status update manager
I0915 12:01:07.057039  5638 containerizer.cpp:648] Recovering containerizer
I0915 12:01:07.058528  5647 provisioner.cpp:416] Provisioner recovery complete
I0915 12:01:07.058907  5648 slave.cpp:6298] Finished recovery
I0915 12:01:07.059468  5648 slave.cpp:6480] Querying resource estimator for oversubscribable
resources
I0915 12:01:07.059763  5639 slave.cpp:6494] Received oversubscribable resources {} from the
resource estimator
I0915 12:01:07.062796  5645 process.cpp:3929] Handling HTTP event for process 'slave(813)'
with path: '/slave(813)/containers'
I0915 12:01:07.064196  5636 http.cpp:1185] HTTP GET for /slave(813)/containers from 172.17.0.8:34184
I0915 12:01:07.064277  5636 http.cpp:976] Authorizing principal 'test-principal' to GET the
'/containers' endpoint
I0915 12:01:07.066697  5614 slave.cpp:861] Agent terminating
[       OK ] Endpoint/SlaveEndpointTest.UnauthorizedRequest/2 (32 ms)
[ RUN      ] Endpoint/SlaveEndpointTest.NoAuthorizer/0
I0915 12:01:07.077970  5614 containerizer.cpp:292] Using isolation { environment_secret, posix/cpu,
posix/mem, filesystem/posix, network/cni }
W0915 12:01:07.078466  5614 backend.cpp:76] Failed to create 'aufs' backend: AufsBackend requires
root privileges
W0915 12:01:07.078578  5614 backend.cpp:76] Failed to create 'bind' backend: BindBackend requires
root privileges
I0915 12:01:07.078613  5614 provisioner.cpp:255] Using default backend 'copy'
I0915 12:01:07.080394  5614 cluster.cpp:448] Creating default 'local' authorizer
I0915 12:01:07.082357  5647 slave.cpp:252] Mesos agent started on (814)@172.17.0.8:56202
I0915 12:01:07.082381  5647 slave.cpp:253] Flags at startup: --acls="" --appc_simple_discovery_uri_prefix="http://"
--appc_store_dir="/tmp/Endpoint_SlaveEndpointTest_NoAuthorizer_0_NcmqG2/store/appc" --authenticate_http_readonly="true"
--authenticate_http_readwrite="true" --authenticatee="crammd5" --authentication_backoff_factor="1secs"
--authorizer="local" --cgroups_cpu_enable_pids_and_tids_count="false" --cgroups_enable_cfs="false"
--cgroups_hierarchy="/sys/fs/cgroup" --cgroups_limit_swap="false" --cgroups_root="mesos" --container_disk_watch_interval="15secs"
--containerizers="mesos" --credential="/tmp/Endpoint_SlaveEndpointTest_NoAuthorizer_0_NcmqG2/credential"
--default_role="*" --disallow_sharing_agent_pid_namespace="false" --disk_watch_interval="1mins"
--docker="docker" --docker_kill_orphans="true" --docker_registry="https://registry-1.docker.io"
--docker_remove_delay="6hrs" --docker_socket="/var/run/docker.sock" --docker_stop_timeout="0ns"
--docker_store_dir="/tmp/Endpoint_SlaveEndpointTest_NoAuthorizer_0_NcmqG2/store/docker" --docker_volume_checkpoint_dir="/var/run/mesos/isolators/docker/volume"
--enforce_container_disk_quota="false" --executor_registration_timeout="1mins" --executor_reregistration_timeout="2secs"
--executor_shutdown_grace_period="5secs" --fetcher_cache_dir="/tmp/Endpoint_SlaveEndpointTest_NoAuthorizer_0_NcmqG2/fetch"
--fetcher_cache_size="2GB" --frameworks_home="" --gc_delay="1weeks" --gc_disk_headroom="0.1"
--hadoop_home="" --help="false" --hostname_lookup="true" --http_command_executor="false" --http_credentials="/tmp/Endpoint_SlaveEndpointTest_NoAuthorizer_0_NcmqG2/http_credentials"
--http_heartbeat_interval="30secs" --initialize_driver_logging="true" --isolation="posix/cpu,posix/mem"
--launcher="posix" --launcher_dir="/mesos/mesos-1.5.0/_build/src" --logbufsecs="0" --logging_level="INFO"
--max_completed_executors_per_framework="150" --oversubscribed_resources_interval="15secs"
--perf_duration="10secs" --perf_interval="1mins" --port="5051" --qos_correction_interval_min="0ns"
--quiet="false" --recover="reconnect" --recovery_timeout="15mins" --registration_backoff_factor="10ms"
--resources="cpus:2;gpus:0;mem:1024;disk:1024;ports:[31000-32000]" --revocable_cpu_low_priority="true"
--runtime_dir="/tmp/Endpoint_SlaveEndpointTest_NoAuthorizer_0_NcmqG2" --sandbox_directory="/mnt/mesos/sandbox"
--strict="true" --switch_user="true" --systemd_enable_support="true" --systemd_runtime_directory="/run/systemd/system"
--version="false" --work_dir="/tmp/Endpoint_SlaveEndpointTest_NoAuthorizer_0_bAQmIp" --zk_session_timeout="10secs"
I0915 12:01:07.082957  5647 credentials.hpp:86] Loading credential for authentication from
'/tmp/Endpoint_SlaveEndpointTest_NoAuthorizer_0_NcmqG2/credential'
I0915 12:01:07.083164  5647 slave.cpp:285] Agent using credential for: test-principal
I0915 12:01:07.083187  5647 credentials.hpp:37] Loading credentials for authentication from
'/tmp/Endpoint_SlaveEndpointTest_NoAuthorizer_0_NcmqG2/http_credentials'
I0915 12:01:07.083431  5647 http.cpp:1045] Creating default 'basic' HTTP authenticator for
realm 'mesos-agent-readonly'
I0915 12:01:07.083608  5647 http.cpp:1045] Creating default 'basic' HTTP authenticator for
realm 'mesos-agent-readwrite'
I0915 12:01:07.085036  5647 slave.cpp:583] Agent resources: [{"name":"cpus","scalar":{"value":2.0},"type":"SCALAR"},{"name":"mem","scalar":{"value":1024.0},"type":"SCALAR"},{"name":"disk","scalar":{"value":1024.0},"type":"SCALAR"},{"name":"ports","ranges":{"range":[{"begin":31000,"end":32000}]},"type":"RANGES"}]
I0915 12:01:07.085273  5647 slave.cpp:591] Agent attributes: [  ]
I0915 12:01:07.085294  5647 slave.cpp:600] Agent hostname: 664a1f1d6938
I0915 12:01:07.085464  5639 status_update_manager.cpp:177] Pausing sending status updates
I0915 12:01:07.086975  5646 state.cpp:64] Recovering state from '/tmp/Endpoint_SlaveEndpointTest_NoAuthorizer_0_bAQmIp/meta'
I0915 12:01:07.087266  5640 status_update_manager.cpp:203] Recovering status update manager
I0915 12:01:07.087462  5633 containerizer.cpp:648] Recovering containerizer
I0915 12:01:07.088825  5641 provisioner.cpp:416] Provisioner recovery complete
I0915 12:01:07.089179  5637 slave.cpp:6298] Finished recovery
I0915 12:01:07.089686  5637 slave.cpp:6480] Querying resource estimator for oversubscribable
resources
I0915 12:01:07.089992  5644 slave.cpp:6494] Received oversubscribable resources {} from the
resource estimator
I0915 12:01:07.092769  5646 process.cpp:3929] Handling HTTP event for process 'slave(814)'
with path: '/slave(814)/monitor/statistics'
I0915 12:01:07.094164  5642 http.cpp:1185] HTTP GET for /slave(814)/monitor/statistics from
172.17.0.8:34185
I0915 12:01:07.094243  5642 http.cpp:976] Authorizing principal 'test-principal' to GET the
'/monitor/statistics' endpoint
I0915 12:01:07.097472  5614 slave.cpp:861] Agent terminating
[       OK ] Endpoint/SlaveEndpointTest.NoAuthorizer/0 (31 ms)
[ RUN      ] Endpoint/SlaveEndpointTest.NoAuthorizer/1
I0915 12:01:07.108887  5614 containerizer.cpp:292] Using isolation { environment_secret, posix/cpu,
posix/mem, filesystem/posix, network/cni }
W0915 12:01:07.109411  5614 backend.cpp:76] Failed to create 'aufs' backend: AufsBackend requires
root privileges
W0915 12:01:07.109544  5614 backend.cpp:76] Failed to create 'bind' backend: BindBackend requires
root privileges
I0915 12:01:07.109587  5614 provisioner.cpp:255] Using default backend 'copy'
I0915 12:01:07.111347  5614 cluster.cpp:448] Creating default 'local' authorizer
I0915 12:01:07.113329  5637 slave.cpp:252] Mesos agent started on (815)@172.17.0.8:56202
I0915 12:01:07.113353  5637 slave.cpp:253] Flags at startup: --acls="" --appc_simple_discovery_uri_prefix="http://"
--appc_store_dir="/tmp/Endpoint_SlaveEndpointTest_NoAuthorizer_1_PxhHPy/store/appc" --authenticate_http_readonly="true"
--authenticate_http_readwrite="true" --authenticatee="crammd5" --authentication_backoff_factor="1secs"
--authorizer="local" --cgroups_cpu_enable_pids_and_tids_count="false" --cgroups_enable_cfs="false"
--cgroups_hierarchy="/sys/fs/cgroup" --cgroups_limit_swap="false" --cgroups_root="mesos" --container_disk_watch_interval="15secs"
--containerizers="mesos" --credential="/tmp/Endpoint_SlaveEndpointTest_NoAuthorizer_1_PxhHPy/credential"
--default_role="*" --disallow_sharing_agent_pid_namespace="false" --disk_watch_interval="1mins"
--docker="docker" --docker_kill_orphans="true" --docker_registry="https://registry-1.docker.io"
--docker_remove_delay="6hrs" --docker_socket="/var/run/docker.sock" --docker_stop_timeout="0ns"
--docker_store_dir="/tmp/Endpoint_SlaveEndpointTest_NoAuthorizer_1_PxhHPy/store/docker" --docker_volume_checkpoint_dir="/var/run/mesos/isolators/docker/volume"
--enforce_container_disk_quota="false" --executor_registration_timeout="1mins" --executor_reregistration_timeout="2secs"
--executor_shutdown_grace_period="5secs" --fetcher_cache_dir="/tmp/Endpoint_SlaveEndpointTest_NoAuthorizer_1_PxhHPy/fetch"
--fetcher_cache_size="2GB" --frameworks_home="" --gc_delay="1weeks" --gc_disk_headroom="0.1"
--hadoop_home="" --help="false" --hostname_lookup="true" --http_command_executor="false" --http_credentials="/tmp/Endpoint_SlaveEndpointTest_NoAuthorizer_1_PxhHPy/http_credentials"
--http_heartbeat_interval="30secs" --initialize_driver_logging="true" --isolation="posix/cpu,posix/mem"
--launcher="posix" --launcher_dir="/mesos/mesos-1.5.0/_build/src" --logbufsecs="0" --logging_level="INFO"
--max_completed_executors_per_framework="150" --oversubscribed_resources_interval="15secs"
--perf_duration="10secs" --perf_interval="1mins" --port="5051" --qos_correction_interval_min="0ns"
--quiet="false" --recover="reconnect" --recovery_timeout="15mins" --registration_backoff_factor="10ms"
--resources="cpus:2;gpus:0;mem:1024;disk:1024;ports:[31000-32000]" --revocable_cpu_low_priority="true"
--runtime_dir="/tmp/Endpoint_SlaveEndpointTest_NoAuthorizer_1_PxhHPy" --sandbox_directory="/mnt/mesos/sandbox"
--strict="true" --switch_user="true" --systemd_enable_support="true" --systemd_runtime_directory="/run/systemd/system"
--version="false" --work_dir="/tmp/Endpoint_SlaveEndpointTest_NoAuthorizer_1_HhqCMV" --zk_session_timeout="10secs"
I0915 12:01:07.113817  5637 credentials.hpp:86] Loading credential for authentication from
'/tmp/Endpoint_SlaveEndpointTest_NoAuthorizer_1_PxhHPy/credential'
I0915 12:01:07.114049  5637 slave.cpp:285] Agent using credential for: test-principal
I0915 12:01:07.114073  5637 credentials.hpp:37] Loading credentials for authentication from
'/tmp/Endpoint_SlaveEndpointTest_NoAuthorizer_1_PxhHPy/http_credentials'
I0915 12:01:07.114351  5637 http.cpp:1045] Creating default 'basic' HTTP authenticator for
realm 'mesos-agent-readonly'
I0915 12:01:07.114542  5637 http.cpp:1045] Creating default 'basic' HTTP authenticator for
realm 'mesos-agent-readwrite'
I0915 12:01:07.115947  5637 slave.cpp:583] Agent resources: [{"name":"cpus","scalar":{"value":2.0},"type":"SCALAR"},{"name":"mem","scalar":{"value":1024.0},"type":"SCALAR"},{"name":"disk","scalar":{"value":1024.0},"type":"SCALAR"},{"name":"ports","ranges":{"range":[{"begin":31000,"end":32000}]},"type":"RANGES"}]
I0915 12:01:07.116204  5637 slave.cpp:591] Agent attributes: [  ]
I0915 12:01:07.116219  5637 slave.cpp:600] Agent hostname: 664a1f1d6938
I0915 12:01:07.116365  5640 status_update_manager.cpp:177] Pausing sending status updates
I0915 12:01:07.118142  5646 state.cpp:64] Recovering state from '/tmp/Endpoint_SlaveEndpointTest_NoAuthorizer_1_HhqCMV/meta'
I0915 12:01:07.118441  5644 status_update_manager.cpp:203] Recovering status update manager
I0915 12:01:07.118651  5638 containerizer.cpp:648] Recovering containerizer
I0915 12:01:07.119900  5642 provisioner.cpp:416] Provisioner recovery complete
I0915 12:01:07.120227  5643 slave.cpp:6298] Finished recovery
I0915 12:01:07.120761  5643 slave.cpp:6480] Querying resource estimator for oversubscribable
resources
I0915 12:01:07.121109  5647 slave.cpp:6494] Received oversubscribable resources {} from the
resource estimator
I0915 12:01:07.124166  5637 process.cpp:3929] Handling HTTP event for process 'slave(815)'
with path: '/slave(815)/monitor/statistics.json'
I0915 12:01:07.125459  5636 http.cpp:1185] HTTP GET for /slave(815)/monitor/statistics.json
from 172.17.0.8:34186
I0915 12:01:07.125531  5636 http.cpp:976] Authorizing principal 'test-principal' to GET the
'/monitor/statistics.json' endpoint
I0915 12:01:07.129143  5614 slave.cpp:861] Agent terminating
[       OK ] Endpoint/SlaveEndpointTest.NoAuthorizer/1 (32 ms)
[ RUN      ] Endpoint/SlaveEndpointTest.NoAuthorizer/2
I0915 12:01:07.141036  5614 containerizer.cpp:292] Using isolation { environment_secret, posix/cpu,
posix/mem, filesystem/posix, network/cni }
W0915 12:01:07.141515  5614 backend.cpp:76] Failed to create 'aufs' backend: AufsBackend requires
root privileges
W0915 12:01:07.141633  5614 backend.cpp:76] Failed to create 'bind' backend: BindBackend requires
root privileges
I0915 12:01:07.141666  5614 provisioner.cpp:255] Using default backend 'copy'
I0915 12:01:07.143398  5614 cluster.cpp:448] Creating default 'local' authorizer
I0915 12:01:07.145298  5646 slave.cpp:252] Mesos agent started on (816)@172.17.0.8:56202
I0915 12:01:07.145324  5646 slave.cpp:253] Flags at startup: --acls="" --appc_simple_discovery_uri_prefix="http://"
--appc_store_dir="/tmp/Endpoint_SlaveEndpointTest_NoAuthorizer_2_hkfFj5/store/appc" --authenticate_http_readonly="true"
--authenticate_http_readwrite="true" --authenticatee="crammd5" --authentication_backoff_factor="1secs"
--authorizer="local" --cgroups_cpu_enable_pids_and_tids_count="false" --cgroups_enable_cfs="false"
--cgroups_hierarchy="/sys/fs/cgroup" --cgroups_limit_swap="false" --cgroups_root="mesos" --container_disk_watch_interval="15secs"
--containerizers="mesos" --credential="/tmp/Endpoint_SlaveEndpointTest_NoAuthorizer_2_hkfFj5/credential"
--default_role="*" --disallow_sharing_agent_pid_namespace="false" --disk_watch_interval="1mins"
--docker="docker" --docker_kill_orphans="true" --docker_registry="https://registry-1.docker.io"
--docker_remove_delay="6hrs" --docker_socket="/var/run/docker.sock" --docker_stop_timeout="0ns"
--docker_store_dir="/tmp/Endpoint_SlaveEndpointTest_NoAuthorizer_2_hkfFj5/store/docker" --docker_volume_checkpoint_dir="/var/run/mesos/isolators/docker/volume"
--enforce_container_disk_quota="false" --executor_registration_timeout="1mins" --executor_reregistration_timeout="2secs"
--executor_shutdown_grace_period="5secs" --fetcher_cache_dir="/tmp/Endpoint_SlaveEndpointTest_NoAuthorizer_2_hkfFj5/fetch"
--fetcher_cache_size="2GB" --frameworks_home="" --gc_delay="1weeks" --gc_disk_headroom="0.1"
--hadoop_home="" --help="false" --hostname_lookup="true" --http_command_executor="false" --http_credentials="/tmp/Endpoint_SlaveEndpointTest_NoAuthorizer_2_hkfFj5/http_credentials"
--http_heartbeat_interval="30secs" --initialize_driver_logging="true" --isolation="posix/cpu,posix/mem"
--launcher="posix" --launcher_dir="/mesos/mesos-1.5.0/_build/src" --logbufsecs="0" --logging_level="INFO"
--max_completed_executors_per_framework="150" --oversubscribed_resources_interval="15secs"
--perf_duration="10secs" --perf_interval="1mins" --port="5051" --qos_correction_interval_min="0ns"
--quiet="false" --recover="reconnect" --recovery_timeout="15mins" --registration_backoff_factor="10ms"
--resources="cpus:2;gpus:0;mem:1024;disk:1024;ports:[31000-32000]" --revocable_cpu_low_priority="true"
--runtime_dir="/tmp/Endpoint_SlaveEndpointTest_NoAuthorizer_2_hkfFj5" --sandbox_directory="/mnt/mesos/sandbox"
--strict="true" --switch_user="true" --systemd_enable_support="true" --systemd_runtime_directory="/run/systemd/system"
--version="false" --work_dir="/tmp/Endpoint_SlaveEndpointTest_NoAuthorizer_2_H90mbs" --zk_session_timeout="10secs"
I0915 12:01:07.145949  5646 credentials.hpp:86] Loading credential for authentication from
'/tmp/Endpoint_SlaveEndpointTest_NoAuthorizer_2_hkfFj5/credential'
I0915 12:01:07.146173  5646 slave.cpp:285] Agent using credential for: test-principal
I0915 12:01:07.146200  5646 credentials.hpp:37] Loading credentials for authentication from
'/tmp/Endpoint_SlaveEndpointTest_NoAuthorizer_2_hkfFj5/http_credentials'
I0915 12:01:07.146507  5646 http.cpp:1045] Creating default 'basic' HTTP authenticator for
realm 'mesos-agent-readonly'
I0915 12:01:07.146692  5646 http.cpp:1045] Creating default 'basic' HTTP authenticator for
realm 'mesos-agent-readwrite'
I0915 12:01:07.148080  5646 slave.cpp:583] Agent resources: [{"name":"cpus","scalar":{"value":2.0},"type":"SCALAR"},{"name":"mem","scalar":{"value":1024.0},"type":"SCALAR"},{"name":"disk","scalar":{"value":1024.0},"type":"SCALAR"},{"name":"ports","ranges":{"range":[{"begin":31000,"end":32000}]},"type":"RANGES"}]
I0915 12:01:07.148313  5646 slave.cpp:591] Agent attributes: [  ]
I0915 12:01:07.148327  5646 slave.cpp:600] Agent hostname: 664a1f1d6938
I0915 12:01:07.148517  5648 status_update_manager.cpp:177] Pausing sending status updates
I0915 12:01:07.150126  5633 state.cpp:64] Recovering state from '/tmp/Endpoint_SlaveEndpointTest_NoAuthorizer_2_H90mbs/meta'
I0915 12:01:07.150450  5633 status_update_manager.cpp:203] Recovering status update manager
I0915 12:01:07.150667  5634 containerizer.cpp:648] Recovering containerizer
I0915 12:01:07.152112  5636 provisioner.cpp:416] Provisioner recovery complete
I0915 12:01:07.152670  5636 slave.cpp:6298] Finished recovery
I0915 12:01:07.153188  5636 slave.cpp:6480] Querying resource estimator for oversubscribable
resources
I0915 12:01:07.153504  5644 slave.cpp:6494] Received oversubscribable resources {} from the
resource estimator
I0915 12:01:07.156447  5648 process.cpp:3929] Handling HTTP event for process 'slave(816)'
with path: '/slave(816)/containers'
I0915 12:01:07.158042  5635 http.cpp:1185] HTTP GET for /slave(816)/containers from 172.17.0.8:34187
I0915 12:01:07.158133  5635 http.cpp:976] Authorizing principal 'test-principal' to GET the
'/containers' endpoint
I0915 12:01:07.162973  5614 slave.cpp:861] Agent terminating
[       OK ] Endpoint/SlaveEndpointTest.NoAuthorizer/2 (35 ms)
[----------] 9 tests from Endpoint/SlaveEndpointTest (290 ms total)

[----------] 2 tests from ContainerizerType/DefaultContainerDNSFlagTest
[ RUN      ] ContainerizerType/DefaultContainerDNSFlagTest.ValidateFlag/0
[       OK ] ContainerizerType/DefaultContainerDNSFlagTest.ValidateFlag/0 (11 ms)
[ RUN      ] ContainerizerType/DefaultContainerDNSFlagTest.ValidateFlag/1
[       OK ] ContainerizerType/DefaultContainerDNSFlagTest.ValidateFlag/1 (9 ms)
[----------] 2 tests from ContainerizerType/DefaultContainerDNSFlagTest (20 ms total)

[----------] Global test environment tear-down
[==========] 1667 tests from 183 test cases ran. (508547 ms total)
[  PASSED  ] 1666 tests.
[  FAILED  ] 1 test, listed below:
[  FAILED  ] MasterTest.IgnoreOldAgentReregistration

 1 FAILED TEST
  YOU HAVE 20 DISABLED TESTS

I0915 12:01:07.251297  5649 process.cpp:1068] Failed to accept socket: future discarded
make[4]: *** [check-local] Error 1
make[4]: Leaving directory `/mesos/mesos-1.5.0/_build/src'
make[3]: *** [check-am] Error 2
make[3]: Leaving directory `/mesos/mesos-1.5.0/_build/src'
make[2]: *** [check] Error 2
make[2]: Leaving directory `/mesos/mesos-1.5.0/_build/src'
make[1]: *** [check-recursive] Error 1
make[1]: Leaving directory `/mesos/mesos-1.5.0/_build'
make: *** [distcheck] Error 1
+ docker rmi mesos-1505473110-18964
Untagged: mesos-1505473110-18964:latest
Deleted: sha256:e53687aa2e7c8c3710a9b9343a4b9a8665df5b70f9a52c456c369528e14a03eb
Deleted: sha256:19a3487bc6d537e3969e10ef2bffcd4598bfb36adf6ebab594599154a68936b0
Deleted: sha256:4790dec01ee40ed9c438e5fd2987b6a33ff0f4c16a107fc36d59cb7eb6272c12
Deleted: sha256:603f2596500bad543e1675bb9021316eae91620d2e634e9ced37d8d397a6d57a
Deleted: sha256:220bd76afe6014ea0259b818b21ad46713deea2e833bc866938727679d2726af
Deleted: sha256:176a375d899974dd8f01377abbb72212b94678a6186813fb2ef47d397c0ad75d
Deleted: sha256:4f9b6543f0fb347a3b6b2e2e1ac6fadfb3126dc4d7f737d3844bce137a9dad94
Deleted: sha256:5ce3a496b5f8094e00a36181eaf1409a49f43ef1e763580f2e21bff84c5604f2
Deleted: sha256:7fa819fb15eb3e2e85ce065c1c9d92bbab1a89406a71e0bf836b6aced5b3aa5a
Deleted: sha256:060c82ab70a89eba829e89594fd4b0549cad606adf19fa374b1c1acc78351552
Deleted: sha256:987aa63b223ac371eac03357712c024b5b2cc2ea59047101582f9d06db8a2c23
Deleted: sha256:6b93b29ae095e1c0fd4ad7ada6f2c20c3c62868b98746646d447dc14f59ba6d0
Deleted: sha256:0e259d43b3dbaad63cfa3a111a10dbf14dcc2e070c52a23615804d66efcdd1e7
Deleted: sha256:6d892baacca468497a862d9d043247057d1cb3cfda5e18ca5c74b7bc8640723d
Deleted: sha256:5c6e1d313484a82c11cf9865779f62976db6f23da24a9b3e2d8bda63d78a26a4
Deleted: sha256:2c89596ceac4c732df58bc44f7bc3abce7bd75757ca3bcdc74044f30a2f3c505
Deleted: sha256:20da9aa25dd853e82ade439eb06ab5a51c5ff263015d5de8053847d62b65ce4a
Deleted: sha256:b89cf39f2b2a733e6b1632782e4992c0723615a59715eab8f76499f949db3c54
Deleted: sha256:c9fe1505bafbda1a88bbf7631ba8b0a083028aa8f3597d585edc87446e3929f0
Deleted: sha256:c17fba8b576277efc1d5149c7432d0f5ce00668390ac0931388c2ceacb57b308
Deleted: sha256:140f392a8baabb173956788ff897ca92f5f1b7e4d9f3db0588b08c426689ccaf
Deleted: sha256:076a2d90cd6374ba00a05083b754fc3b437d61ad758ca744be8fe702017ec358
Deleted: sha256:34eef3ad72755e872fc963e34ae2a1feb69e7cc070d55fb70d4dcd6a06f33d94
Deleted: sha256:181df4d9f358d45095a848ca774aece489931759ecc1bba3c1bdae323d9d08da
Deleted: sha256:0e2e5b95c28079d43e9c1703e8b2449ec7bd652ae40a068e7fad03c4a883c93b
Deleted: sha256:f9247d85c25063e223170d53fd81938dc4bc0b6d5a864a74294533f5f745841c
Deleted: sha256:30605309ddc43d377306e26516dd2cd8f80c72896143241ccebe98ab7159ad21
Deleted: sha256:9afea0d460e8ad4e719e59c2221a32984f3d4d02df1d251c4c200fd7970e5438
Build step 'Execute shell' marked build as failure
Not sending mail to unregistered user zhq527725@gmail.com
Not sending mail to unregistered user benjamin.bannier@mesosphere.io
Not sending mail to unregistered user gregorywmann@gmail.com

Mime
View raw message