mesos-builds mailing list archives

Site index · List index
Message view « Date » · « Thread »
Top « Date » · « Thread »
From Apache Jenkins Server <jenk...@builds.apache.org>
Subject Build failed in Jenkins: Mesos-Buildbot » autotools,gcc,--verbose --enable-libevent --enable-ssl,GLOG_v=1 MESOS_VERBOSE=1,ubuntu:14.04,(ubuntu)&&(!ubuntu-us1)&&(!ubuntu-eu2)&&(!qnode3)&&(!H23) #4260
Date Mon, 25 Sep 2017 22:33:51 GMT
See <https://builds.apache.org/job/Mesos-Buildbot/BUILDTOOL=autotools,COMPILER=gcc,CONFIGURATION=--verbose%20--enable-libevent%20--enable-ssl,ENVIRONMENT=GLOG_v=1%20MESOS_VERBOSE=1,OS=ubuntu%3A14.04,label_exp=(ubuntu)&&(!ubuntu-us1)&&(!ubuntu-eu2)&&(!qnode3)&&(!H23)/4260/display/redirect?page=changes>

Changes:

[benjamin.hindman] Added `process::Executor::execute()`.

------------------------------------------
[...truncated 33.16 MB...]
I0925 22:33:40.809736 30245 http.cpp:1066] Creating default 'jwt' HTTP authenticator for realm
'mesos-agent-executor'
I0925 22:33:40.809973 30245 http.cpp:1045] Creating default 'basic' HTTP authenticator for
realm 'mesos-agent-readonly'
I0925 22:33:40.810101 30245 http.cpp:1066] Creating default 'jwt' HTTP authenticator for realm
'mesos-agent-readonly'
I0925 22:33:40.810286 30245 http.cpp:1045] Creating default 'basic' HTTP authenticator for
realm 'mesos-agent-readwrite'
I0925 22:33:40.810374 30245 http.cpp:1066] Creating default 'jwt' HTTP authenticator for realm
'mesos-agent-readwrite'
I0925 22:33:40.811949 30245 slave.cpp:585] Agent resources: [{"name":"cpus","scalar":{"value":2.0},"type":"SCALAR"},{"name":"mem","scalar":{"value":1024.0},"type":"SCALAR"},{"name":"disk","scalar":{"value":1024.0},"type":"SCALAR"},{"name":"ports","ranges":{"range":[{"begin":31000,"end":32000}]},"type":"RANGES"}]
I0925 22:33:40.812288 30245 slave.cpp:593] Agent attributes: [  ]
I0925 22:33:40.812304 30245 slave.cpp:602] Agent hostname: b71ed6b2c547
I0925 22:33:40.812458 30242 status_update_manager.cpp:177] Pausing sending status updates
I0925 22:33:40.814054 30227 state.cpp:64] Recovering state from '/tmp/Endpoint_SlaveEndpointTest_UnauthorizedRequest_0_9A7XXV/meta'
I0925 22:33:40.814404 30231 status_update_manager.cpp:203] Recovering status update manager
I0925 22:33:40.814630 30226 containerizer.cpp:648] Recovering containerizer
I0925 22:33:40.815950 30237 provisioner.cpp:416] Provisioner recovery complete
I0925 22:33:40.816351 30234 slave.cpp:6322] Finished recovery
I0925 22:33:40.817004 30234 slave.cpp:6504] Querying resource estimator for oversubscribable
resources
I0925 22:33:40.817239 30242 slave.cpp:6518] Received oversubscribable resources {} from the
resource estimator
I0925 22:33:40.820008 30239 process.cpp:3929] Handling HTTP event for process 'slave(818)'
with path: '/slave(818)/monitor/statistics'
I0925 22:33:40.821957 30238 http.cpp:1185] HTTP GET for /slave(818)/monitor/statistics from
172.17.0.2:33126
I0925 22:33:40.822036 30238 http.cpp:976] Authorizing principal 'test-principal' to GET the
'/monitor/statistics' endpoint
I0925 22:33:40.823649  8668 slave.cpp:869] Agent terminating
[       OK ] Endpoint/SlaveEndpointTest.UnauthorizedRequest/0 (36 ms)
[ RUN      ] Endpoint/SlaveEndpointTest.UnauthorizedRequest/1
I0925 22:33:40.835836  8668 containerizer.cpp:292] Using isolation { environment_secret, posix/cpu,
posix/mem, filesystem/posix, network/cni }
W0925 22:33:40.836294  8668 backend.cpp:76] Failed to create 'aufs' backend: AufsBackend requires
root privileges
W0925 22:33:40.836411  8668 backend.cpp:76] Failed to create 'bind' backend: BindBackend requires
root privileges
I0925 22:33:40.836441  8668 provisioner.cpp:255] Using default backend 'copy'
I0925 22:33:40.840358 30231 slave.cpp:254] Mesos agent started on (819)@172.17.0.2:39453
I0925 22:33:40.840399 30231 slave.cpp:255] Flags at startup: --acls="" --appc_simple_discovery_uri_prefix="http://"
--appc_store_dir="/tmp/Endpoint_SlaveEndpointTest_UnauthorizedRequest_1_HyQpBA/store/appc"
--authenticate_http_executors="true" --authenticate_http_readonly="true" --authenticate_http_readwrite="true"
--authenticatee="crammd5" --authentication_backoff_factor="1secs" --authorizer="local" --cgroups_cpu_enable_pids_and_tids_count="false"
--cgroups_enable_cfs="false" --cgroups_hierarchy="/sys/fs/cgroup" --cgroups_limit_swap="false"
--cgroups_root="mesos" --container_disk_watch_interval="15secs" --containerizers="mesos" --credential="/tmp/Endpoint_SlaveEndpointTest_UnauthorizedRequest_1_HyQpBA/credential"
--default_role="*" --disallow_sharing_agent_pid_namespace="false" --disk_watch_interval="1mins"
--docker="docker" --docker_kill_orphans="true" --docker_registry="https://registry-1.docker.io"
--docker_remove_delay="6hrs" --docker_socket="/var/run/docker.sock" --docker_stop_timeout="0ns"
--docker_store_dir="/tmp/Endpoint_SlaveEndpointTest_UnauthorizedRequest_1_HyQpBA/store/docker"
--docker_volume_checkpoint_dir="/var/run/mesos/isolators/docker/volume" --enforce_container_disk_quota="false"
--executor_registration_timeout="1mins" --executor_reregistration_timeout="2secs" --executor_secret_key="/tmp/Endpoint_SlaveEndpointTest_UnauthorizedRequest_1_HyQpBA/executor_secret_key"
--executor_shutdown_grace_period="5secs" --fetcher_cache_dir="/tmp/Endpoint_SlaveEndpointTest_UnauthorizedRequest_1_HyQpBA/fetch"
--fetcher_cache_size="2GB" --frameworks_home="" --gc_delay="1weeks" --gc_disk_headroom="0.1"
--hadoop_home="" --help="false" --hostname_lookup="true" --http_command_executor="false" --http_credentials="/tmp/Endpoint_SlaveEndpointTest_UnauthorizedRequest_1_HyQpBA/http_credentials"
--http_heartbeat_interval="30secs" --initialize_driver_logging="true" --isolation="posix/cpu,posix/mem"
--launcher="posix" --launcher_dir="/mesos/mesos-1.5.0/_build/src" --logbufsecs="0" --logging_level="INFO"
--max_completed_executors_per_framework="150" --oversubscribed_resources_interval="15secs"
--perf_duration="10secs" --perf_interval="1mins" --port="5051" --qos_correction_interval_min="0ns"
--quiet="false" --recover="reconnect" --recovery_timeout="15mins" --registration_backoff_factor="10ms"
--resources="cpus:2;gpus:0;mem:1024;disk:1024;ports:[31000-32000]" --revocable_cpu_low_priority="true"
--runtime_dir="/tmp/Endpoint_SlaveEndpointTest_UnauthorizedRequest_1_HyQpBA" --sandbox_directory="/mnt/mesos/sandbox"
--strict="true" --switch_user="true" --systemd_enable_support="true" --systemd_runtime_directory="/run/systemd/system"
--version="false" --work_dir="/tmp/Endpoint_SlaveEndpointTest_UnauthorizedRequest_1_wPwMQE"
--zk_session_timeout="10secs"
I0925 22:33:40.840829 30231 credentials.hpp:86] Loading credential for authentication from
'/tmp/Endpoint_SlaveEndpointTest_UnauthorizedRequest_1_HyQpBA/credential'
I0925 22:33:40.841089 30231 slave.cpp:287] Agent using credential for: test-principal
I0925 22:33:40.841130 30231 credentials.hpp:37] Loading credentials for authentication from
'/tmp/Endpoint_SlaveEndpointTest_UnauthorizedRequest_1_HyQpBA/http_credentials'
I0925 22:33:40.841485 30231 http.cpp:1045] Creating default 'basic' HTTP authenticator for
realm 'mesos-agent-executor'
I0925 22:33:40.841656 30231 http.cpp:1066] Creating default 'jwt' HTTP authenticator for realm
'mesos-agent-executor'
I0925 22:33:40.841892 30231 http.cpp:1045] Creating default 'basic' HTTP authenticator for
realm 'mesos-agent-readonly'
I0925 22:33:40.842021 30231 http.cpp:1066] Creating default 'jwt' HTTP authenticator for realm
'mesos-agent-readonly'
I0925 22:33:40.842260 30231 http.cpp:1045] Creating default 'basic' HTTP authenticator for
realm 'mesos-agent-readwrite'
I0925 22:33:40.842365 30231 http.cpp:1066] Creating default 'jwt' HTTP authenticator for realm
'mesos-agent-readwrite'
I0925 22:33:40.843935 30231 slave.cpp:585] Agent resources: [{"name":"cpus","scalar":{"value":2.0},"type":"SCALAR"},{"name":"mem","scalar":{"value":1024.0},"type":"SCALAR"},{"name":"disk","scalar":{"value":1024.0},"type":"SCALAR"},{"name":"ports","ranges":{"range":[{"begin":31000,"end":32000}]},"type":"RANGES"}]
I0925 22:33:40.844207 30231 slave.cpp:593] Agent attributes: [  ]
I0925 22:33:40.844225 30231 slave.cpp:602] Agent hostname: b71ed6b2c547
I0925 22:33:40.844368 30242 status_update_manager.cpp:177] Pausing sending status updates
I0925 22:33:40.846165 30236 state.cpp:64] Recovering state from '/tmp/Endpoint_SlaveEndpointTest_UnauthorizedRequest_1_wPwMQE/meta'
I0925 22:33:40.846485 30236 status_update_manager.cpp:203] Recovering status update manager
I0925 22:33:40.846745 30241 containerizer.cpp:648] Recovering containerizer
I0925 22:33:40.848052 30223 provisioner.cpp:416] Provisioner recovery complete
I0925 22:33:40.848357 30242 slave.cpp:6322] Finished recovery
I0925 22:33:40.848958 30242 slave.cpp:6504] Querying resource estimator for oversubscribable
resources
I0925 22:33:40.849269 30233 slave.cpp:6518] Received oversubscribable resources {} from the
resource estimator
I0925 22:33:40.852022 30228 process.cpp:3929] Handling HTTP event for process 'slave(819)'
with path: '/slave(819)/monitor/statistics.json'
I0925 22:33:40.853822 30223 http.cpp:1185] HTTP GET for /slave(819)/monitor/statistics.json
from 172.17.0.2:33128
I0925 22:33:40.853895 30223 http.cpp:976] Authorizing principal 'test-principal' to GET the
'/monitor/statistics.json' endpoint
I0925 22:33:40.855736 30240 slave.cpp:869] Agent terminating
[       OK ] Endpoint/SlaveEndpointTest.UnauthorizedRequest/1 (32 ms)
[ RUN      ] Endpoint/SlaveEndpointTest.UnauthorizedRequest/2
I0925 22:33:40.867956  8668 containerizer.cpp:292] Using isolation { environment_secret, posix/cpu,
posix/mem, filesystem/posix, network/cni }
W0925 22:33:40.868403  8668 backend.cpp:76] Failed to create 'aufs' backend: AufsBackend requires
root privileges
W0925 22:33:40.868515  8668 backend.cpp:76] Failed to create 'bind' backend: BindBackend requires
root privileges
I0925 22:33:40.868557  8668 provisioner.cpp:255] Using default backend 'copy'
I0925 22:33:40.871870 30243 slave.cpp:254] Mesos agent started on (820)@172.17.0.2:39453
I0925 22:33:40.871892 30243 slave.cpp:255] Flags at startup: --acls="" --appc_simple_discovery_uri_prefix="http://"
--appc_store_dir="/tmp/Endpoint_SlaveEndpointTest_UnauthorizedRequest_2_ROJqSj/store/appc"
--authenticate_http_executors="true" --authenticate_http_readonly="true" --authenticate_http_readwrite="true"
--authenticatee="crammd5" --authentication_backoff_factor="1secs" --authorizer="local" --cgroups_cpu_enable_pids_and_tids_count="false"
--cgroups_enable_cfs="false" --cgroups_hierarchy="/sys/fs/cgroup" --cgroups_limit_swap="false"
--cgroups_root="mesos" --container_disk_watch_interval="15secs" --containerizers="mesos" --credential="/tmp/Endpoint_SlaveEndpointTest_UnauthorizedRequest_2_ROJqSj/credential"
--default_role="*" --disallow_sharing_agent_pid_namespace="false" --disk_watch_interval="1mins"
--docker="docker" --docker_kill_orphans="true" --docker_registry="https://registry-1.docker.io"
--docker_remove_delay="6hrs" --docker_socket="/var/run/docker.sock" --docker_stop_timeout="0ns"
--docker_store_dir="/tmp/Endpoint_SlaveEndpointTest_UnauthorizedRequest_2_ROJqSj/store/docker"
--docker_volume_checkpoint_dir="/var/run/mesos/isolators/docker/volume" --enforce_container_disk_quota="false"
--executor_registration_timeout="1mins" --executor_reregistration_timeout="2secs" --executor_secret_key="/tmp/Endpoint_SlaveEndpointTest_UnauthorizedRequest_2_ROJqSj/executor_secret_key"
--executor_shutdown_grace_period="5secs" --fetcher_cache_dir="/tmp/Endpoint_SlaveEndpointTest_UnauthorizedRequest_2_ROJqSj/fetch"
--fetcher_cache_size="2GB" --frameworks_home="" --gc_delay="1weeks" --gc_disk_headroom="0.1"
--hadoop_home="" --help="false" --hostname_lookup="true" --http_command_executor="false" --http_credentials="/tmp/Endpoint_SlaveEndpointTest_UnauthorizedRequest_2_ROJqSj/http_credentials"
--http_heartbeat_interval="30secs" --initialize_driver_logging="true" --isolation="posix/cpu,posix/mem"
--launcher="posix" --launcher_dir="/mesos/mesos-1.5.0/_build/src" --logbufsecs="0" --logging_level="INFO"
--max_completed_executors_per_framework="150" --oversubscribed_resources_interval="15secs"
--perf_duration="10secs" --perf_interval="1mins" --port="5051" --qos_correction_interval_min="0ns"
--quiet="false" --recover="reconnect" --recovery_timeout="15mins" --registration_backoff_factor="10ms"
--resources="cpus:2;gpus:0;mem:1024;disk:1024;ports:[31000-32000]" --revocable_cpu_low_priority="true"
--runtime_dir="/tmp/Endpoint_SlaveEndpointTest_UnauthorizedRequest_2_ROJqSj" --sandbox_directory="/mnt/mesos/sandbox"
--strict="true" --switch_user="true" --systemd_enable_support="true" --systemd_runtime_directory="/run/systemd/system"
--version="false" --work_dir="/tmp/Endpoint_SlaveEndpointTest_UnauthorizedRequest_2_MIRW2n"
--zk_session_timeout="10secs"
I0925 22:33:40.872334 30243 credentials.hpp:86] Loading credential for authentication from
'/tmp/Endpoint_SlaveEndpointTest_UnauthorizedRequest_2_ROJqSj/credential'
I0925 22:33:40.872498 30243 slave.cpp:287] Agent using credential for: test-principal
I0925 22:33:40.872525 30243 credentials.hpp:37] Loading credentials for authentication from
'/tmp/Endpoint_SlaveEndpointTest_UnauthorizedRequest_2_ROJqSj/http_credentials'
I0925 22:33:40.872854 30243 http.cpp:1045] Creating default 'basic' HTTP authenticator for
realm 'mesos-agent-executor'
I0925 22:33:40.873004 30243 http.cpp:1066] Creating default 'jwt' HTTP authenticator for realm
'mesos-agent-executor'
I0925 22:33:40.873271 30243 http.cpp:1045] Creating default 'basic' HTTP authenticator for
realm 'mesos-agent-readonly'
I0925 22:33:40.873390 30243 http.cpp:1066] Creating default 'jwt' HTTP authenticator for realm
'mesos-agent-readonly'
I0925 22:33:40.873571 30243 http.cpp:1045] Creating default 'basic' HTTP authenticator for
realm 'mesos-agent-readwrite'
I0925 22:33:40.873659 30243 http.cpp:1066] Creating default 'jwt' HTTP authenticator for realm
'mesos-agent-readwrite'
I0925 22:33:40.875401 30243 slave.cpp:585] Agent resources: [{"name":"cpus","scalar":{"value":2.0},"type":"SCALAR"},{"name":"mem","scalar":{"value":1024.0},"type":"SCALAR"},{"name":"disk","scalar":{"value":1024.0},"type":"SCALAR"},{"name":"ports","ranges":{"range":[{"begin":31000,"end":32000}]},"type":"RANGES"}]
I0925 22:33:40.875712 30243 slave.cpp:593] Agent attributes: [  ]
I0925 22:33:40.875735 30243 slave.cpp:602] Agent hostname: b71ed6b2c547
I0925 22:33:40.875880 30228 status_update_manager.cpp:177] Pausing sending status updates
I0925 22:33:40.877357 30230 state.cpp:64] Recovering state from '/tmp/Endpoint_SlaveEndpointTest_UnauthorizedRequest_2_MIRW2n/meta'
I0925 22:33:40.877636 30245 status_update_manager.cpp:203] Recovering status update manager
I0925 22:33:40.877818 30237 containerizer.cpp:648] Recovering containerizer
I0925 22:33:40.879084 30241 provisioner.cpp:416] Provisioner recovery complete
I0925 22:33:40.879382 30228 slave.cpp:6322] Finished recovery
I0925 22:33:40.879818 30228 slave.cpp:6504] Querying resource estimator for oversubscribable
resources
I0925 22:33:40.880056 30223 slave.cpp:6518] Received oversubscribable resources {} from the
resource estimator
I0925 22:33:40.882891 30227 process.cpp:3929] Handling HTTP event for process 'slave(820)'
with path: '/slave(820)/containers'
I0925 22:33:40.884493 30224 http.cpp:1185] HTTP GET for /slave(820)/containers from 172.17.0.2:33132
I0925 22:33:40.884574 30224 http.cpp:976] Authorizing principal 'test-principal' to GET the
'/containers' endpoint
I0925 22:33:40.886359 30237 slave.cpp:869] Agent terminating
[       OK ] Endpoint/SlaveEndpointTest.UnauthorizedRequest/2 (30 ms)
[ RUN      ] Endpoint/SlaveEndpointTest.NoAuthorizer/0
I0925 22:33:40.899730  8668 containerizer.cpp:292] Using isolation { environment_secret, posix/cpu,
posix/mem, filesystem/posix, network/cni }
W0925 22:33:40.900374  8668 backend.cpp:76] Failed to create 'aufs' backend: AufsBackend requires
root privileges
W0925 22:33:40.900523  8668 backend.cpp:76] Failed to create 'bind' backend: BindBackend requires
root privileges
I0925 22:33:40.900563  8668 provisioner.cpp:255] Using default backend 'copy'
I0925 22:33:40.902642  8668 cluster.cpp:448] Creating default 'local' authorizer
I0925 22:33:40.904861 30235 slave.cpp:254] Mesos agent started on (821)@172.17.0.2:39453
I0925 22:33:40.904893 30235 slave.cpp:255] Flags at startup: --acls="" --appc_simple_discovery_uri_prefix="http://"
--appc_store_dir="/tmp/Endpoint_SlaveEndpointTest_NoAuthorizer_0_ASfNr3/store/appc" --authenticate_http_executors="true"
--authenticate_http_readonly="true" --authenticate_http_readwrite="true" --authenticatee="crammd5"
--authentication_backoff_factor="1secs" --authorizer="local" --cgroups_cpu_enable_pids_and_tids_count="false"
--cgroups_enable_cfs="false" --cgroups_hierarchy="/sys/fs/cgroup" --cgroups_limit_swap="false"
--cgroups_root="mesos" --container_disk_watch_interval="15secs" --containerizers="mesos" --credential="/tmp/Endpoint_SlaveEndpointTest_NoAuthorizer_0_ASfNr3/credential"
--default_role="*" --disallow_sharing_agent_pid_namespace="false" --disk_watch_interval="1mins"
--docker="docker" --docker_kill_orphans="true" --docker_registry="https://registry-1.docker.io"
--docker_remove_delay="6hrs" --docker_socket="/var/run/docker.sock" --docker_stop_timeout="0ns"
--docker_store_dir="/tmp/Endpoint_SlaveEndpointTest_NoAuthorizer_0_ASfNr3/store/docker" --docker_volume_checkpoint_dir="/var/run/mesos/isolators/docker/volume"
--enforce_container_disk_quota="false" --executor_registration_timeout="1mins" --executor_reregistration_timeout="2secs"
--executor_secret_key="/tmp/Endpoint_SlaveEndpointTest_NoAuthorizer_0_ASfNr3/executor_secret_key"
--executor_shutdown_grace_period="5secs" --fetcher_cache_dir="/tmp/Endpoint_SlaveEndpointTest_NoAuthorizer_0_ASfNr3/fetch"
--fetcher_cache_size="2GB" --frameworks_home="" --gc_delay="1weeks" --gc_disk_headroom="0.1"
--hadoop_home="" --help="false" --hostname_lookup="true" --http_command_executor="false" --http_credentials="/tmp/Endpoint_SlaveEndpointTest_NoAuthorizer_0_ASfNr3/http_credentials"
--http_heartbeat_interval="30secs" --initialize_driver_logging="true" --isolation="posix/cpu,posix/mem"
--launcher="posix" --launcher_dir="/mesos/mesos-1.5.0/_build/src" --logbufsecs="0" --logging_level="INFO"
--max_completed_executors_per_framework="150" --oversubscribed_resources_interval="15secs"
--perf_duration="10secs" --perf_interval="1mins" --port="5051" --qos_correction_interval_min="0ns"
--quiet="false" --recover="reconnect" --recovery_timeout="15mins" --registration_backoff_factor="10ms"
--resources="cpus:2;gpus:0;mem:1024;disk:1024;ports:[31000-32000]" --revocable_cpu_low_priority="true"
--runtime_dir="/tmp/Endpoint_SlaveEndpointTest_NoAuthorizer_0_ASfNr3" --sandbox_directory="/mnt/mesos/sandbox"
--strict="true" --switch_user="true" --systemd_enable_support="true" --systemd_runtime_directory="/run/systemd/system"
--version="false" --work_dir="/tmp/Endpoint_SlaveEndpointTest_NoAuthorizer_0_cdKGx7" --zk_session_timeout="10secs"
I0925 22:33:40.905366 30235 credentials.hpp:86] Loading credential for authentication from
'/tmp/Endpoint_SlaveEndpointTest_NoAuthorizer_0_ASfNr3/credential'
I0925 22:33:40.905532 30235 slave.cpp:287] Agent using credential for: test-principal
I0925 22:33:40.905555 30235 credentials.hpp:37] Loading credentials for authentication from
'/tmp/Endpoint_SlaveEndpointTest_NoAuthorizer_0_ASfNr3/http_credentials'
I0925 22:33:40.905843 30235 http.cpp:1045] Creating default 'basic' HTTP authenticator for
realm 'mesos-agent-executor'
I0925 22:33:40.905980 30235 http.cpp:1066] Creating default 'jwt' HTTP authenticator for realm
'mesos-agent-executor'
I0925 22:33:40.906195 30235 http.cpp:1045] Creating default 'basic' HTTP authenticator for
realm 'mesos-agent-readonly'
I0925 22:33:40.906291 30235 http.cpp:1066] Creating default 'jwt' HTTP authenticator for realm
'mesos-agent-readonly'
I0925 22:33:40.906487 30235 http.cpp:1045] Creating default 'basic' HTTP authenticator for
realm 'mesos-agent-readwrite'
I0925 22:33:40.906582 30235 http.cpp:1066] Creating default 'jwt' HTTP authenticator for realm
'mesos-agent-readwrite'
I0925 22:33:40.907907 30235 slave.cpp:585] Agent resources: [{"name":"cpus","scalar":{"value":2.0},"type":"SCALAR"},{"name":"mem","scalar":{"value":1024.0},"type":"SCALAR"},{"name":"disk","scalar":{"value":1024.0},"type":"SCALAR"},{"name":"ports","ranges":{"range":[{"begin":31000,"end":32000}]},"type":"RANGES"}]
I0925 22:33:40.908156 30235 slave.cpp:593] Agent attributes: [  ]
I0925 22:33:40.908171 30235 slave.cpp:602] Agent hostname: b71ed6b2c547
I0925 22:33:40.908319 30229 status_update_manager.cpp:177] Pausing sending status updates
I0925 22:33:40.909837 30234 state.cpp:64] Recovering state from '/tmp/Endpoint_SlaveEndpointTest_NoAuthorizer_0_cdKGx7/meta'
I0925 22:33:40.910090 30236 status_update_manager.cpp:203] Recovering status update manager
I0925 22:33:40.910331 30227 containerizer.cpp:648] Recovering containerizer
I0925 22:33:40.911919 30244 provisioner.cpp:416] Provisioner recovery complete
I0925 22:33:40.912237 30223 slave.cpp:6322] Finished recovery
I0925 22:33:40.912878 30223 slave.cpp:6504] Querying resource estimator for oversubscribable
resources
I0925 22:33:40.913180 30239 slave.cpp:6518] Received oversubscribable resources {} from the
resource estimator
I0925 22:33:40.915618 30224 process.cpp:3929] Handling HTTP event for process 'slave(821)'
with path: '/slave(821)/monitor/statistics'
I0925 22:33:40.917585 30244 http.cpp:1185] HTTP GET for /slave(821)/monitor/statistics from
172.17.0.2:33134
I0925 22:33:40.917675 30244 http.cpp:976] Authorizing principal 'test-principal' to GET the
'/monitor/statistics' endpoint
I0925 22:33:40.920691 30245 slave.cpp:869] Agent terminating
[       OK ] Endpoint/SlaveEndpointTest.NoAuthorizer/0 (33 ms)
[ RUN      ] Endpoint/SlaveEndpointTest.NoAuthorizer/1
I0925 22:33:40.932487  8668 containerizer.cpp:292] Using isolation { environment_secret, posix/cpu,
posix/mem, filesystem/posix, network/cni }
W0925 22:33:40.933018  8668 backend.cpp:76] Failed to create 'aufs' backend: AufsBackend requires
root privileges
W0925 22:33:40.933156  8668 backend.cpp:76] Failed to create 'bind' backend: BindBackend requires
root privileges
I0925 22:33:40.933190  8668 provisioner.cpp:255] Using default backend 'copy'
I0925 22:33:40.934795  8668 cluster.cpp:448] Creating default 'local' authorizer
I0925 22:33:40.936800 30235 slave.cpp:254] Mesos agent started on (822)@172.17.0.2:39453
I0925 22:33:40.936828 30235 slave.cpp:255] Flags at startup: --acls="" --appc_simple_discovery_uri_prefix="http://"
--appc_store_dir="/tmp/Endpoint_SlaveEndpointTest_NoAuthorizer_1_WL40kN/store/appc" --authenticate_http_executors="true"
--authenticate_http_readonly="true" --authenticate_http_readwrite="true" --authenticatee="crammd5"
--authentication_backoff_factor="1secs" --authorizer="local" --cgroups_cpu_enable_pids_and_tids_count="false"
--cgroups_enable_cfs="false" --cgroups_hierarchy="/sys/fs/cgroup" --cgroups_limit_swap="false"
--cgroups_root="mesos" --container_disk_watch_interval="15secs" --containerizers="mesos" --credential="/tmp/Endpoint_SlaveEndpointTest_NoAuthorizer_1_WL40kN/credential"
--default_role="*" --disallow_sharing_agent_pid_namespace="false" --disk_watch_interval="1mins"
--docker="docker" --docker_kill_orphans="true" --docker_registry="https://registry-1.docker.io"
--docker_remove_delay="6hrs" --docker_socket="/var/run/docker.sock" --docker_stop_timeout="0ns"
--docker_store_dir="/tmp/Endpoint_SlaveEndpointTest_NoAuthorizer_1_WL40kN/store/docker" --docker_volume_checkpoint_dir="/var/run/mesos/isolators/docker/volume"
--enforce_container_disk_quota="false" --executor_registration_timeout="1mins" --executor_reregistration_timeout="2secs"
--executor_secret_key="/tmp/Endpoint_SlaveEndpointTest_NoAuthorizer_1_WL40kN/executor_secret_key"
--executor_shutdown_grace_period="5secs" --fetcher_cache_dir="/tmp/Endpoint_SlaveEndpointTest_NoAuthorizer_1_WL40kN/fetch"
--fetcher_cache_size="2GB" --frameworks_home="" --gc_delay="1weeks" --gc_disk_headroom="0.1"
--hadoop_home="" --help="false" --hostname_lookup="true" --http_command_executor="false" --http_credentials="/tmp/Endpoint_SlaveEndpointTest_NoAuthorizer_1_WL40kN/http_credentials"
--http_heartbeat_interval="30secs" --initialize_driver_logging="true" --isolation="posix/cpu,posix/mem"
--launcher="posix" --launcher_dir="/mesos/mesos-1.5.0/_build/src" --logbufsecs="0" --logging_level="INFO"
--max_completed_executors_per_framework="150" --oversubscribed_resources_interval="15secs"
--perf_duration="10secs" --perf_interval="1mins" --port="5051" --qos_correction_interval_min="0ns"
--quiet="false" --recover="reconnect" --recovery_timeout="15mins" --registration_backoff_factor="10ms"
--resources="cpus:2;gpus:0;mem:1024;disk:1024;ports:[31000-32000]" --revocable_cpu_low_priority="true"
--runtime_dir="/tmp/Endpoint_SlaveEndpointTest_NoAuthorizer_1_WL40kN" --sandbox_directory="/mnt/mesos/sandbox"
--strict="true" --switch_user="true" --systemd_enable_support="true" --systemd_runtime_directory="/run/systemd/system"
--version="false" --work_dir="/tmp/Endpoint_SlaveEndpointTest_NoAuthorizer_1_GlXZlR" --zk_session_timeout="10secs"
I0925 22:33:40.937225 30235 credentials.hpp:86] Loading credential for authentication from
'/tmp/Endpoint_SlaveEndpointTest_NoAuthorizer_1_WL40kN/credential'
I0925 22:33:40.937422 30235 slave.cpp:287] Agent using credential for: test-principal
I0925 22:33:40.937449 30235 credentials.hpp:37] Loading credentials for authentication from
'/tmp/Endpoint_SlaveEndpointTest_NoAuthorizer_1_WL40kN/http_credentials'
I0925 22:33:40.938024 30235 http.cpp:1045] Creating default 'basic' HTTP authenticator for
realm 'mesos-agent-executor'
I0925 22:33:40.938148 30235 http.cpp:1066] Creating default 'jwt' HTTP authenticator for realm
'mesos-agent-executor'
I0925 22:33:40.938382 30235 http.cpp:1045] Creating default 'basic' HTTP authenticator for
realm 'mesos-agent-readonly'
I0925 22:33:40.938474 30235 http.cpp:1066] Creating default 'jwt' HTTP authenticator for realm
'mesos-agent-readonly'
I0925 22:33:40.938674 30235 http.cpp:1045] Creating default 'basic' HTTP authenticator for
realm 'mesos-agent-readwrite'
I0925 22:33:40.938781 30235 http.cpp:1066] Creating default 'jwt' HTTP authenticator for realm
'mesos-agent-readwrite'
I0925 22:33:40.940227 30235 slave.cpp:585] Agent resources: [{"name":"cpus","scalar":{"value":2.0},"type":"SCALAR"},{"name":"mem","scalar":{"value":1024.0},"type":"SCALAR"},{"name":"disk","scalar":{"value":1024.0},"type":"SCALAR"},{"name":"ports","ranges":{"range":[{"begin":31000,"end":32000}]},"type":"RANGES"}]
I0925 22:33:40.940445 30235 slave.cpp:593] Agent attributes: [  ]
I0925 22:33:40.940464 30235 slave.cpp:602] Agent hostname: b71ed6b2c547
I0925 22:33:40.940601 30225 status_update_manager.cpp:177] Pausing sending status updates
I0925 22:33:40.942103 30243 state.cpp:64] Recovering state from '/tmp/Endpoint_SlaveEndpointTest_NoAuthorizer_1_GlXZlR/meta'
I0925 22:33:40.942471 30226 status_update_manager.cpp:203] Recovering status update manager
I0925 22:33:40.942679 30244 containerizer.cpp:648] Recovering containerizer
I0925 22:33:40.944190 30224 provisioner.cpp:416] Provisioner recovery complete
I0925 22:33:40.944536 30227 slave.cpp:6322] Finished recovery
I0925 22:33:40.945071 30227 slave.cpp:6504] Querying resource estimator for oversubscribable
resources
I0925 22:33:40.945370 30228 slave.cpp:6518] Received oversubscribable resources {} from the
resource estimator
I0925 22:33:40.947916 30239 process.cpp:3929] Handling HTTP event for process 'slave(822)'
with path: '/slave(822)/monitor/statistics.json'
I0925 22:33:40.949863 30224 http.cpp:1185] HTTP GET for /slave(822)/monitor/statistics.json
from 172.17.0.2:33136
I0925 22:33:40.949975 30224 http.cpp:976] Authorizing principal 'test-principal' to GET the
'/monitor/statistics.json' endpoint
I0925 22:33:40.952934 30225 slave.cpp:869] Agent terminating
[       OK ] Endpoint/SlaveEndpointTest.NoAuthorizer/1 (32 ms)
[ RUN      ] Endpoint/SlaveEndpointTest.NoAuthorizer/2
I0925 22:33:40.965536  8668 containerizer.cpp:292] Using isolation { environment_secret, posix/cpu,
posix/mem, filesystem/posix, network/cni }
W0925 22:33:40.966029  8668 backend.cpp:76] Failed to create 'aufs' backend: AufsBackend requires
root privileges
W0925 22:33:40.966141  8668 backend.cpp:76] Failed to create 'bind' backend: BindBackend requires
root privileges
I0925 22:33:40.966176  8668 provisioner.cpp:255] Using default backend 'copy'
I0925 22:33:40.967777  8668 cluster.cpp:448] Creating default 'local' authorizer
I0925 22:33:40.970001 30234 slave.cpp:254] Mesos agent started on (823)@172.17.0.2:39453
I0925 22:33:40.970024 30234 slave.cpp:255] Flags at startup: --acls="" --appc_simple_discovery_uri_prefix="http://"
--appc_store_dir="/tmp/Endpoint_SlaveEndpointTest_NoAuthorizer_2_Y6oSxx/store/appc" --authenticate_http_executors="true"
--authenticate_http_readonly="true" --authenticate_http_readwrite="true" --authenticatee="crammd5"
--authentication_backoff_factor="1secs" --authorizer="local" --cgroups_cpu_enable_pids_and_tids_count="false"
--cgroups_enable_cfs="false" --cgroups_hierarchy="/sys/fs/cgroup" --cgroups_limit_swap="false"
--cgroups_root="mesos" --container_disk_watch_interval="15secs" --containerizers="mesos" --credential="/tmp/Endpoint_SlaveEndpointTest_NoAuthorizer_2_Y6oSxx/credential"
--default_role="*" --disallow_sharing_agent_pid_namespace="false" --disk_watch_interval="1mins"
--docker="docker" --docker_kill_orphans="true" --docker_registry="https://registry-1.docker.io"
--docker_remove_delay="6hrs" --docker_socket="/var/run/docker.sock" --docker_stop_timeout="0ns"
--docker_store_dir="/tmp/Endpoint_SlaveEndpointTest_NoAuthorizer_2_Y6oSxx/store/docker" --docker_volume_checkpoint_dir="/var/run/mesos/isolators/docker/volume"
--enforce_container_disk_quota="false" --executor_registration_timeout="1mins" --executor_reregistration_timeout="2secs"
--executor_secret_key="/tmp/Endpoint_SlaveEndpointTest_NoAuthorizer_2_Y6oSxx/executor_secret_key"
--executor_shutdown_grace_period="5secs" --fetcher_cache_dir="/tmp/Endpoint_SlaveEndpointTest_NoAuthorizer_2_Y6oSxx/fetch"
--fetcher_cache_size="2GB" --frameworks_home="" --gc_delay="1weeks" --gc_disk_headroom="0.1"
--hadoop_home="" --help="false" --hostname_lookup="true" --http_command_executor="false" --http_credentials="/tmp/Endpoint_SlaveEndpointTest_NoAuthorizer_2_Y6oSxx/http_credentials"
--http_heartbeat_interval="30secs" --initialize_driver_logging="true" --isolation="posix/cpu,posix/mem"
--launcher="posix" --launcher_dir="/mesos/mesos-1.5.0/_build/src" --logbufsecs="0" --logging_level="INFO"
--max_completed_executors_per_framework="150" --oversubscribed_resources_interval="15secs"
--perf_duration="10secs" --perf_interval="1mins" --port="5051" --qos_correction_interval_min="0ns"
--quiet="false" --recover="reconnect" --recovery_timeout="15mins" --registration_backoff_factor="10ms"
--resources="cpus:2;gpus:0;mem:1024;disk:1024;ports:[31000-32000]" --revocable_cpu_low_priority="true"
--runtime_dir="/tmp/Endpoint_SlaveEndpointTest_NoAuthorizer_2_Y6oSxx" --sandbox_directory="/mnt/mesos/sandbox"
--strict="true" --switch_user="true" --systemd_enable_support="true" --systemd_runtime_directory="/run/systemd/system"
--version="false" --work_dir="/tmp/Endpoint_SlaveEndpointTest_NoAuthorizer_2_Bk0UtB" --zk_session_timeout="10secs"
I0925 22:33:40.970504 30234 credentials.hpp:86] Loading credential for authentication from
'/tmp/Endpoint_SlaveEndpointTest_NoAuthorizer_2_Y6oSxx/credential'
I0925 22:33:40.970676 30234 slave.cpp:287] Agent using credential for: test-principal
I0925 22:33:40.970702 30234 credentials.hpp:37] Loading credentials for authentication from
'/tmp/Endpoint_SlaveEndpointTest_NoAuthorizer_2_Y6oSxx/http_credentials'
I0925 22:33:40.971050 30234 http.cpp:1045] Creating default 'basic' HTTP authenticator for
realm 'mesos-agent-executor'
I0925 22:33:40.971181 30234 http.cpp:1066] Creating default 'jwt' HTTP authenticator for realm
'mesos-agent-executor'
I0925 22:33:40.971385 30234 http.cpp:1045] Creating default 'basic' HTTP authenticator for
realm 'mesos-agent-readonly'
I0925 22:33:40.971479 30234 http.cpp:1066] Creating default 'jwt' HTTP authenticator for realm
'mesos-agent-readonly'
I0925 22:33:40.971652 30234 http.cpp:1045] Creating default 'basic' HTTP authenticator for
realm 'mesos-agent-readwrite'
I0925 22:33:40.971747 30234 http.cpp:1066] Creating default 'jwt' HTTP authenticator for realm
'mesos-agent-readwrite'
I0925 22:33:40.973146 30234 slave.cpp:585] Agent resources: [{"name":"cpus","scalar":{"value":2.0},"type":"SCALAR"},{"name":"mem","scalar":{"value":1024.0},"type":"SCALAR"},{"name":"disk","scalar":{"value":1024.0},"type":"SCALAR"},{"name":"ports","ranges":{"range":[{"begin":31000,"end":32000}]},"type":"RANGES"}]
I0925 22:33:40.973364 30234 slave.cpp:593] Agent attributes: [  ]
I0925 22:33:40.973383 30234 slave.cpp:602] Agent hostname: b71ed6b2c547
I0925 22:33:40.973532 30243 status_update_manager.cpp:177] Pausing sending status updates
I0925 22:33:40.974998 30244 state.cpp:64] Recovering state from '/tmp/Endpoint_SlaveEndpointTest_NoAuthorizer_2_Bk0UtB/meta'
I0925 22:33:40.975316 30223 status_update_manager.cpp:203] Recovering status update manager
I0925 22:33:40.975512 30236 containerizer.cpp:648] Recovering containerizer
I0925 22:33:40.976778 30229 provisioner.cpp:416] Provisioner recovery complete
I0925 22:33:40.977198 30243 slave.cpp:6322] Finished recovery
I0925 22:33:40.977777 30243 slave.cpp:6504] Querying resource estimator for oversubscribable
resources
I0925 22:33:40.978058 30242 slave.cpp:6518] Received oversubscribable resources {} from the
resource estimator
I0925 22:33:40.980583 30238 process.cpp:3929] Handling HTTP event for process 'slave(823)'
with path: '/slave(823)/containers'
I0925 22:33:40.982514 30226 http.cpp:1185] HTTP GET for /slave(823)/containers from 172.17.0.2:33140
I0925 22:33:40.982604 30226 http.cpp:976] Authorizing principal 'test-principal' to GET the
'/containers' endpoint
I0925 22:33:40.986011 30243 slave.cpp:869] Agent terminating
[       OK ] Endpoint/SlaveEndpointTest.NoAuthorizer/2 (32 ms)
[----------] 9 tests from Endpoint/SlaveEndpointTest (314 ms total)

[----------] 2 tests from ContainerizerType/DefaultContainerDNSFlagTest
[ RUN      ] ContainerizerType/DefaultContainerDNSFlagTest.ValidateFlag/0
[       OK ] ContainerizerType/DefaultContainerDNSFlagTest.ValidateFlag/0 (11 ms)
[ RUN      ] ContainerizerType/DefaultContainerDNSFlagTest.ValidateFlag/1
[       OK ] ContainerizerType/DefaultContainerDNSFlagTest.ValidateFlag/1 (9 ms)
[----------] 2 tests from ContainerizerType/DefaultContainerDNSFlagTest (20 ms total)

[----------] Global test environment tear-down
[==========] 1684 tests from 186 test cases ran. (660897 ms total)
[  PASSED  ] 1679 tests.
[  FAILED  ] 5 tests, listed below:
[  FAILED  ] CommandExecutorCheckTest.CommandCheckDeliveredAndReconciled
[  FAILED  ] DefaultExecutorCheckTest.CommandCheckDeliveredAndReconciled
[  FAILED  ] DefaultExecutorCheckTest.CommandCheckStatusChange
[  FAILED  ] DefaultExecutorCheckTest.CommandCheckSeesParentsEnv
[  FAILED  ] DefaultExecutorCheckTest.CommandCheckSharesWorkDirWithTask

 5 FAILED TESTS
  YOU HAVE 20 DISABLED TESTS

I0925 22:33:41.073649 30247 process.cpp:1068] Failed to accept socket: future discarded
make[4]: *** [check-local] Error 1
make[4]: Leaving directory `/mesos/mesos-1.5.0/_build/src'
make[3]: *** [check-am] Error 2
make[3]: Leaving directory `/mesos/mesos-1.5.0/_build/src'
make[2]: *** [check] Error 2
make[2]: Leaving directory `/mesos/mesos-1.5.0/_build/src'
make[1]: *** [check-recursive] Error 1
make[1]: Leaving directory `/mesos/mesos-1.5.0/_build'
make: *** [distcheck] Error 1
+ docker rmi mesos-1506375260-19741
Untagged: mesos-1506375260-19741:latest
Deleted: sha256:df75ed03b30e630a2f1c8850bf1a6a078d7949713011aab1c251acb6914fb43b
Deleted: sha256:3fdbe2fe203a2efd333ea0f9255a014033dd04ae79ee0cfa6aa54e024455e0b5
Deleted: sha256:f881c54a5676487707efede3c89a869021d2d6f6c28ae09eafb0211222ff89d0
Deleted: sha256:5bcf250f31e04465f95c5043041fed712b8fbbc20b61018df1d5917fdb875b73
Deleted: sha256:d78225d148f1dde164e0f3d298167949536ee5d73799d13d66f06486b9eee34a
Deleted: sha256:7f2621522b1a3b13cc01d7744e451779bb3ba724da070001ac069debfb8afe0c
Deleted: sha256:208cdcb323183477b1977209066defa273199114ade6d9ef98ccc459ab327873
Deleted: sha256:761a1f9c3e0f475ab20f5431cb221ecd182403446d59caed2703a9fc8eba071f
Deleted: sha256:62813595f4a83597ac89cbb8060dc8a83ec8ab338e25d41f07c97e0f76ba1186
Deleted: sha256:d2620a5263541932a15537c668166b3aa089f669814c467e347312494a5567aa
Deleted: sha256:a2329a157234ebd9c7fa4a9b596a9f90af1ff41f68af95412626cd0ddd8de1ff
Deleted: sha256:a81c5b428ee57327dcd19dc210d842d16c461c75f057344fef270180577e06e2
Deleted: sha256:15ab52d9387a8f57acff7b2b1df51c5ac50e6eb38e03ac8d765e6ad18d0d277c
Deleted: sha256:3e3cf7774508127bf50eb49381582fc7b35bbc56ce34b86307845770cc64ced3
Deleted: sha256:687678f9dcf52d833bfc8552d278e41126cbb29c45294fba10f287a5b2a93d29
Deleted: sha256:23d7b0c9eb226726b5563bfdfc3b467517b4ab400368e5716ac248f6b2872be5
Deleted: sha256:09ebcddcdb9ca47ef4492807f313715ee943605bd5e32e7182218ec398f18cd1
Deleted: sha256:99c3efade144258ace9dee0e8330bb8b39f92929aec82db3db406f5d22cafb42
Deleted: sha256:0e1ff11eac1e10fce7e3a5fbdf1f402d1fca23f70a240400bbdb08cd25848bf7
Deleted: sha256:47b27a0eedf188f5e6f0beea3e7bbe88804326fa119e5e0787a6bec4a4ede3e2
Deleted: sha256:2d0f1c11711b1dd7a3f3527869c5895acb9824f79189f202dc65d27f942cc2cb
Deleted: sha256:38e1ffd228106afddeef84467676b77593e99fc3e078ddd0eb798758aedb31b7
Deleted: sha256:7d9312f5acb6400d723ac099aab5a5c970d4ab1f146bd1ca6ff1f54c8bdc1f6d
Deleted: sha256:5dc95da31787dc75d828cd2bd78178a86561fa2e64dee31f781511d3fb89ae23
Deleted: sha256:bbdb6c5af24928c6a6c207e2d4206f19b443409751902ac41a93099731106e48
Deleted: sha256:29ec8bbe910b1f2fa9768c2171f7ab7b6191a93d594d473992a585dad1680e89
Deleted: sha256:97102f05f94231a96eaf446187351e5984eb95e16c84cb4a81d9818619ead67a
Deleted: sha256:bff48171c021a5221aac7e28b4f9a83fb5d1552912a0c4236ad8a568628c86c8
Build step 'Execute shell' marked build as failure
Not sending mail to unregistered user songzihao1990@gmail.com
Not sending mail to unregistered user benjamin.hindman@gmail.com

Mime
View raw message