mesos-builds mailing list archives

Site index · List index
Message view « Date » · « Thread »
Top « Date » · « Thread »
From Apache Jenkins Server <jenk...@builds.apache.org>
Subject Build failed in Jenkins: Mesos-Buildbot » autotools,gcc,--verbose --enable-libevent --enable-ssl,GLOG_v=1 MESOS_VERBOSE=1,ubuntu:14.04,(ubuntu)&&(!ubuntu-us1)&&(!ubuntu-eu2)&&(!qnode3)&&(!H23) #4215
Date Sat, 09 Sep 2017 15:13:25 GMT
See <https://builds.apache.org/job/Mesos-Buildbot/BUILDTOOL=autotools,COMPILER=gcc,CONFIGURATION=--verbose%20--enable-libevent%20--enable-ssl,ENVIRONMENT=GLOG_v=1%20MESOS_VERBOSE=1,OS=ubuntu%3A14.04,label_exp=(ubuntu)&&(!ubuntu-us1)&&(!ubuntu-eu2)&&(!qnode3)&&(!H23)/4215/display/redirect>

------------------------------------------
[...truncated 32.29 MB...]
I0909 15:13:15.862850 29732 slave.cpp:250] Mesos agent started on (806)@172.17.0.12:41955
I0909 15:13:15.862875 29732 slave.cpp:251] Flags at startup: --acls="" --appc_simple_discovery_uri_prefix="http://"
--appc_store_dir="/tmp/Endpoint_SlaveEndpointTest_UnauthorizedRequest_0_RW2o9u/store/appc"
--authenticate_http_executors="true" --authenticate_http_readonly="true" --authenticate_http_readwrite="true"
--authenticatee="crammd5" --authentication_backoff_factor="1secs" --authorizer="local" --cgroups_cpu_enable_pids_and_tids_count="false"
--cgroups_enable_cfs="false" --cgroups_hierarchy="/sys/fs/cgroup" --cgroups_limit_swap="false"
--cgroups_root="mesos" --container_disk_watch_interval="15secs" --containerizers="mesos" --credential="/tmp/Endpoint_SlaveEndpointTest_UnauthorizedRequest_0_RW2o9u/credential"
--default_role="*" --disallow_sharing_agent_pid_namespace="false" --disk_watch_interval="1mins"
--docker="docker" --docker_kill_orphans="true" --docker_registry="https://registry-1.docker.io"
--docker_remove_delay="6hrs" --docker_socket="/var/run/docker.sock" --docker_stop_timeout="0ns"
--docker_store_dir="/tmp/Endpoint_SlaveEndpointTest_UnauthorizedRequest_0_RW2o9u/store/docker"
--docker_volume_checkpoint_dir="/var/run/mesos/isolators/docker/volume" --enforce_container_disk_quota="false"
--executor_registration_timeout="1mins" --executor_reregistration_timeout="2secs" --executor_secret_key="/tmp/Endpoint_SlaveEndpointTest_UnauthorizedRequest_0_RW2o9u/executor_secret_key"
--executor_shutdown_grace_period="5secs" --fetcher_cache_dir="/tmp/Endpoint_SlaveEndpointTest_UnauthorizedRequest_0_RW2o9u/fetch"
--fetcher_cache_size="2GB" --frameworks_home="" --gc_delay="1weeks" --gc_disk_headroom="0.1"
--hadoop_home="" --help="false" --hostname_lookup="true" --http_command_executor="false" --http_credentials="/tmp/Endpoint_SlaveEndpointTest_UnauthorizedRequest_0_RW2o9u/http_credentials"
--http_heartbeat_interval="30secs" --initialize_driver_logging="true" --isolation="posix/cpu,posix/mem"
--launcher="posix" --launcher_dir="/mesos/mesos-1.4.0/_build/src" --logbufsecs="0" --logging_level="INFO"
--max_completed_executors_per_framework="150" --oversubscribed_resources_interval="15secs"
--perf_duration="10secs" --perf_interval="1mins" --port="5051" --qos_correction_interval_min="0ns"
--quiet="false" --recover="reconnect" --recovery_timeout="15mins" --registration_backoff_factor="10ms"
--resources="cpus:2;gpus:0;mem:1024;disk:1024;ports:[31000-32000]" --revocable_cpu_low_priority="true"
--runtime_dir="/tmp/Endpoint_SlaveEndpointTest_UnauthorizedRequest_0_RW2o9u" --sandbox_directory="/mnt/mesos/sandbox"
--strict="true" --switch_user="true" --systemd_enable_support="true" --systemd_runtime_directory="/run/systemd/system"
--version="false" --work_dir="/tmp/Endpoint_SlaveEndpointTest_UnauthorizedRequest_0_1asWqo"
I0909 15:13:15.863256 29732 credentials.hpp:86] Loading credential for authentication from
'/tmp/Endpoint_SlaveEndpointTest_UnauthorizedRequest_0_RW2o9u/credential'
I0909 15:13:15.863400 29732 slave.cpp:283] Agent using credential for: test-principal
I0909 15:13:15.863422 29732 credentials.hpp:37] Loading credentials for authentication from
'/tmp/Endpoint_SlaveEndpointTest_UnauthorizedRequest_0_RW2o9u/http_credentials'
I0909 15:13:15.863708 29732 http.cpp:1026] Creating default 'basic' HTTP authenticator for
realm 'mesos-agent-executor'
I0909 15:13:15.863819 29732 http.cpp:1047] Creating default 'jwt' HTTP authenticator for realm
'mesos-agent-executor'
I0909 15:13:15.864075 29732 http.cpp:1026] Creating default 'basic' HTTP authenticator for
realm 'mesos-agent-readonly'
I0909 15:13:15.864171 29732 http.cpp:1047] Creating default 'jwt' HTTP authenticator for realm
'mesos-agent-readonly'
I0909 15:13:15.864400 29732 http.cpp:1026] Creating default 'basic' HTTP authenticator for
realm 'mesos-agent-readwrite'
I0909 15:13:15.864495 29732 http.cpp:1047] Creating default 'jwt' HTTP authenticator for realm
'mesos-agent-readwrite'
I0909 15:13:15.865903 29732 slave.cpp:565] Agent resources: [{"name":"cpus","scalar":{"value":2.0},"type":"SCALAR"},{"name":"mem","scalar":{"value":1024.0},"type":"SCALAR"},{"name":"disk","scalar":{"value":1024.0},"type":"SCALAR"},{"name":"ports","ranges":{"range":[{"begin":31000,"end":32000}]},"type":"RANGES"}]
I0909 15:13:15.866125 29732 slave.cpp:573] Agent attributes: [  ]
I0909 15:13:15.866139 29732 slave.cpp:582] Agent hostname: 2ae3fd26abcc
I0909 15:13:15.866259 29725 status_update_manager.cpp:177] Pausing sending status updates
I0909 15:13:15.867533 29717 state.cpp:64] Recovering state from '/tmp/Endpoint_SlaveEndpointTest_UnauthorizedRequest_0_1asWqo/meta'
I0909 15:13:15.867799 29733 status_update_manager.cpp:203] Recovering status update manager
I0909 15:13:15.867980 29721 containerizer.cpp:609] Recovering containerizer
I0909 15:13:15.869432 29730 provisioner.cpp:416] Provisioner recovery complete
I0909 15:13:15.869798 29725 slave.cpp:6295] Finished recovery
I0909 15:13:15.870230 29725 slave.cpp:6477] Querying resource estimator for oversubscribable
resources
I0909 15:13:15.870471 29731 slave.cpp:6491] Received oversubscribable resources {} from the
resource estimator
I0909 15:13:15.872365 29722 process.cpp:3927] Handling HTTP event for process 'slave(806)'
with path: '/slave(806)/monitor/statistics'
I0909 15:13:15.874176 29730 http.cpp:1166] HTTP GET for /slave(806)/monitor/statistics from
172.17.0.12:58634
I0909 15:13:15.874240 29730 http.cpp:957] Authorizing principal 'test-principal' to GET the
'/monitor/statistics' endpoint
I0909 15:13:15.875954  8466 slave.cpp:843] Agent terminating
[       OK ] Endpoint/SlaveEndpointTest.UnauthorizedRequest/0 (27 ms)
[ RUN      ] Endpoint/SlaveEndpointTest.UnauthorizedRequest/1
I0909 15:13:15.886091  8466 containerizer.cpp:246] Using isolation: posix/cpu,posix/mem,filesystem/posix,network/cni,environment_secret
W0909 15:13:15.886591  8466 backend.cpp:76] Failed to create 'aufs' backend: AufsBackend requires
root privileges
W0909 15:13:15.886699  8466 backend.cpp:76] Failed to create 'bind' backend: BindBackend requires
root privileges
I0909 15:13:15.886739  8466 provisioner.cpp:255] Using default backend 'copy'
I0909 15:13:15.890053 29737 slave.cpp:250] Mesos agent started on (807)@172.17.0.12:41955
I0909 15:13:15.890074 29737 slave.cpp:251] Flags at startup: --acls="" --appc_simple_discovery_uri_prefix="http://"
--appc_store_dir="/tmp/Endpoint_SlaveEndpointTest_UnauthorizedRequest_1_TL78eW/store/appc"
--authenticate_http_executors="true" --authenticate_http_readonly="true" --authenticate_http_readwrite="true"
--authenticatee="crammd5" --authentication_backoff_factor="1secs" --authorizer="local" --cgroups_cpu_enable_pids_and_tids_count="false"
--cgroups_enable_cfs="false" --cgroups_hierarchy="/sys/fs/cgroup" --cgroups_limit_swap="false"
--cgroups_root="mesos" --container_disk_watch_interval="15secs" --containerizers="mesos" --credential="/tmp/Endpoint_SlaveEndpointTest_UnauthorizedRequest_1_TL78eW/credential"
--default_role="*" --disallow_sharing_agent_pid_namespace="false" --disk_watch_interval="1mins"
--docker="docker" --docker_kill_orphans="true" --docker_registry="https://registry-1.docker.io"
--docker_remove_delay="6hrs" --docker_socket="/var/run/docker.sock" --docker_stop_timeout="0ns"
--docker_store_dir="/tmp/Endpoint_SlaveEndpointTest_UnauthorizedRequest_1_TL78eW/store/docker"
--docker_volume_checkpoint_dir="/var/run/mesos/isolators/docker/volume" --enforce_container_disk_quota="false"
--executor_registration_timeout="1mins" --executor_reregistration_timeout="2secs" --executor_secret_key="/tmp/Endpoint_SlaveEndpointTest_UnauthorizedRequest_1_TL78eW/executor_secret_key"
--executor_shutdown_grace_period="5secs" --fetcher_cache_dir="/tmp/Endpoint_SlaveEndpointTest_UnauthorizedRequest_1_TL78eW/fetch"
--fetcher_cache_size="2GB" --frameworks_home="" --gc_delay="1weeks" --gc_disk_headroom="0.1"
--hadoop_home="" --help="false" --hostname_lookup="true" --http_command_executor="false" --http_credentials="/tmp/Endpoint_SlaveEndpointTest_UnauthorizedRequest_1_TL78eW/http_credentials"
--http_heartbeat_interval="30secs" --initialize_driver_logging="true" --isolation="posix/cpu,posix/mem"
--launcher="posix" --launcher_dir="/mesos/mesos-1.4.0/_build/src" --logbufsecs="0" --logging_level="INFO"
--max_completed_executors_per_framework="150" --oversubscribed_resources_interval="15secs"
--perf_duration="10secs" --perf_interval="1mins" --port="5051" --qos_correction_interval_min="0ns"
--quiet="false" --recover="reconnect" --recovery_timeout="15mins" --registration_backoff_factor="10ms"
--resources="cpus:2;gpus:0;mem:1024;disk:1024;ports:[31000-32000]" --revocable_cpu_low_priority="true"
--runtime_dir="/tmp/Endpoint_SlaveEndpointTest_UnauthorizedRequest_1_TL78eW" --sandbox_directory="/mnt/mesos/sandbox"
--strict="true" --switch_user="true" --systemd_enable_support="true" --systemd_runtime_directory="/run/systemd/system"
--version="false" --work_dir="/tmp/Endpoint_SlaveEndpointTest_UnauthorizedRequest_1_djaDsP"
I0909 15:13:15.890462 29737 credentials.hpp:86] Loading credential for authentication from
'/tmp/Endpoint_SlaveEndpointTest_UnauthorizedRequest_1_TL78eW/credential'
I0909 15:13:15.890605 29737 slave.cpp:283] Agent using credential for: test-principal
I0909 15:13:15.890626 29737 credentials.hpp:37] Loading credentials for authentication from
'/tmp/Endpoint_SlaveEndpointTest_UnauthorizedRequest_1_TL78eW/http_credentials'
I0909 15:13:15.890889 29737 http.cpp:1026] Creating default 'basic' HTTP authenticator for
realm 'mesos-agent-executor'
I0909 15:13:15.891003 29737 http.cpp:1047] Creating default 'jwt' HTTP authenticator for realm
'mesos-agent-executor'
I0909 15:13:15.891208 29737 http.cpp:1026] Creating default 'basic' HTTP authenticator for
realm 'mesos-agent-readonly'
I0909 15:13:15.891304 29737 http.cpp:1047] Creating default 'jwt' HTTP authenticator for realm
'mesos-agent-readonly'
I0909 15:13:15.891481 29737 http.cpp:1026] Creating default 'basic' HTTP authenticator for
realm 'mesos-agent-readwrite'
I0909 15:13:15.891577 29737 http.cpp:1047] Creating default 'jwt' HTTP authenticator for realm
'mesos-agent-readwrite'
I0909 15:13:15.892957 29737 slave.cpp:565] Agent resources: [{"name":"cpus","scalar":{"value":2.0},"type":"SCALAR"},{"name":"mem","scalar":{"value":1024.0},"type":"SCALAR"},{"name":"disk","scalar":{"value":1024.0},"type":"SCALAR"},{"name":"ports","ranges":{"range":[{"begin":31000,"end":32000}]},"type":"RANGES"}]
I0909 15:13:15.893203 29737 slave.cpp:573] Agent attributes: [  ]
I0909 15:13:15.893216 29737 slave.cpp:582] Agent hostname: 2ae3fd26abcc
I0909 15:13:15.893334 29733 status_update_manager.cpp:177] Pausing sending status updates
I0909 15:13:15.894701 29734 state.cpp:64] Recovering state from '/tmp/Endpoint_SlaveEndpointTest_UnauthorizedRequest_1_djaDsP/meta'
I0909 15:13:15.894942 29734 status_update_manager.cpp:203] Recovering status update manager
I0909 15:13:15.895131 29730 containerizer.cpp:609] Recovering containerizer
I0909 15:13:15.896311 29717 provisioner.cpp:416] Provisioner recovery complete
I0909 15:13:15.896611 29733 slave.cpp:6295] Finished recovery
I0909 15:13:15.897091 29733 slave.cpp:6477] Querying resource estimator for oversubscribable
resources
I0909 15:13:15.897413 29735 slave.cpp:6491] Received oversubscribable resources {} from the
resource estimator
I0909 15:13:15.899602 29736 process.cpp:3927] Handling HTTP event for process 'slave(807)'
with path: '/slave(807)/monitor/statistics.json'
I0909 15:13:15.901296 29731 http.cpp:1166] HTTP GET for /slave(807)/monitor/statistics.json
from 172.17.0.12:58636
I0909 15:13:15.901376 29731 http.cpp:957] Authorizing principal 'test-principal' to GET the
'/monitor/statistics.json' endpoint
I0909 15:13:15.903116 29732 slave.cpp:843] Agent terminating
[       OK ] Endpoint/SlaveEndpointTest.UnauthorizedRequest/1 (27 ms)
[ RUN      ] Endpoint/SlaveEndpointTest.UnauthorizedRequest/2
I0909 15:13:15.913336  8466 containerizer.cpp:246] Using isolation: posix/cpu,posix/mem,filesystem/posix,network/cni,environment_secret
W0909 15:13:15.913811  8466 backend.cpp:76] Failed to create 'aufs' backend: AufsBackend requires
root privileges
W0909 15:13:15.913918  8466 backend.cpp:76] Failed to create 'bind' backend: BindBackend requires
root privileges
I0909 15:13:15.913950  8466 provisioner.cpp:255] Using default backend 'copy'
I0909 15:13:15.917263 29728 slave.cpp:250] Mesos agent started on (808)@172.17.0.12:41955
I0909 15:13:15.917284 29728 slave.cpp:251] Flags at startup: --acls="" --appc_simple_discovery_uri_prefix="http://"
--appc_store_dir="/tmp/Endpoint_SlaveEndpointTest_UnauthorizedRequest_2_vOv6An/store/appc"
--authenticate_http_executors="true" --authenticate_http_readonly="true" --authenticate_http_readwrite="true"
--authenticatee="crammd5" --authentication_backoff_factor="1secs" --authorizer="local" --cgroups_cpu_enable_pids_and_tids_count="false"
--cgroups_enable_cfs="false" --cgroups_hierarchy="/sys/fs/cgroup" --cgroups_limit_swap="false"
--cgroups_root="mesos" --container_disk_watch_interval="15secs" --containerizers="mesos" --credential="/tmp/Endpoint_SlaveEndpointTest_UnauthorizedRequest_2_vOv6An/credential"
--default_role="*" --disallow_sharing_agent_pid_namespace="false" --disk_watch_interval="1mins"
--docker="docker" --docker_kill_orphans="true" --docker_registry="https://registry-1.docker.io"
--docker_remove_delay="6hrs" --docker_socket="/var/run/docker.sock" --docker_stop_timeout="0ns"
--docker_store_dir="/tmp/Endpoint_SlaveEndpointTest_UnauthorizedRequest_2_vOv6An/store/docker"
--docker_volume_checkpoint_dir="/var/run/mesos/isolators/docker/volume" --enforce_container_disk_quota="false"
--executor_registration_timeout="1mins" --executor_reregistration_timeout="2secs" --executor_secret_key="/tmp/Endpoint_SlaveEndpointTest_UnauthorizedRequest_2_vOv6An/executor_secret_key"
--executor_shutdown_grace_period="5secs" --fetcher_cache_dir="/tmp/Endpoint_SlaveEndpointTest_UnauthorizedRequest_2_vOv6An/fetch"
--fetcher_cache_size="2GB" --frameworks_home="" --gc_delay="1weeks" --gc_disk_headroom="0.1"
--hadoop_home="" --help="false" --hostname_lookup="true" --http_command_executor="false" --http_credentials="/tmp/Endpoint_SlaveEndpointTest_UnauthorizedRequest_2_vOv6An/http_credentials"
--http_heartbeat_interval="30secs" --initialize_driver_logging="true" --isolation="posix/cpu,posix/mem"
--launcher="posix" --launcher_dir="/mesos/mesos-1.4.0/_build/src" --logbufsecs="0" --logging_level="INFO"
--max_completed_executors_per_framework="150" --oversubscribed_resources_interval="15secs"
--perf_duration="10secs" --perf_interval="1mins" --port="5051" --qos_correction_interval_min="0ns"
--quiet="false" --recover="reconnect" --recovery_timeout="15mins" --registration_backoff_factor="10ms"
--resources="cpus:2;gpus:0;mem:1024;disk:1024;ports:[31000-32000]" --revocable_cpu_low_priority="true"
--runtime_dir="/tmp/Endpoint_SlaveEndpointTest_UnauthorizedRequest_2_vOv6An" --sandbox_directory="/mnt/mesos/sandbox"
--strict="true" --switch_user="true" --systemd_enable_support="true" --systemd_runtime_directory="/run/systemd/system"
--version="false" --work_dir="/tmp/Endpoint_SlaveEndpointTest_UnauthorizedRequest_2_P7wwKg"
I0909 15:13:15.917656 29728 credentials.hpp:86] Loading credential for authentication from
'/tmp/Endpoint_SlaveEndpointTest_UnauthorizedRequest_2_vOv6An/credential'
I0909 15:13:15.917806 29728 slave.cpp:283] Agent using credential for: test-principal
I0909 15:13:15.917827 29728 credentials.hpp:37] Loading credentials for authentication from
'/tmp/Endpoint_SlaveEndpointTest_UnauthorizedRequest_2_vOv6An/http_credentials'
I0909 15:13:15.918098 29728 http.cpp:1026] Creating default 'basic' HTTP authenticator for
realm 'mesos-agent-executor'
I0909 15:13:15.918220 29728 http.cpp:1047] Creating default 'jwt' HTTP authenticator for realm
'mesos-agent-executor'
I0909 15:13:15.918417 29728 http.cpp:1026] Creating default 'basic' HTTP authenticator for
realm 'mesos-agent-readonly'
I0909 15:13:15.918515 29728 http.cpp:1047] Creating default 'jwt' HTTP authenticator for realm
'mesos-agent-readonly'
I0909 15:13:15.918696 29728 http.cpp:1026] Creating default 'basic' HTTP authenticator for
realm 'mesos-agent-readwrite'
I0909 15:13:15.918802 29728 http.cpp:1047] Creating default 'jwt' HTTP authenticator for realm
'mesos-agent-readwrite'
I0909 15:13:15.920197 29728 slave.cpp:565] Agent resources: [{"name":"cpus","scalar":{"value":2.0},"type":"SCALAR"},{"name":"mem","scalar":{"value":1024.0},"type":"SCALAR"},{"name":"disk","scalar":{"value":1024.0},"type":"SCALAR"},{"name":"ports","ranges":{"range":[{"begin":31000,"end":32000}]},"type":"RANGES"}]
I0909 15:13:15.920425 29728 slave.cpp:573] Agent attributes: [  ]
I0909 15:13:15.920437 29728 slave.cpp:582] Agent hostname: 2ae3fd26abcc
I0909 15:13:15.920563 29737 status_update_manager.cpp:177] Pausing sending status updates
I0909 15:13:15.921934 29730 state.cpp:64] Recovering state from '/tmp/Endpoint_SlaveEndpointTest_UnauthorizedRequest_2_P7wwKg/meta'
I0909 15:13:15.922215 29734 status_update_manager.cpp:203] Recovering status update manager
I0909 15:13:15.922406 29720 containerizer.cpp:609] Recovering containerizer
I0909 15:13:15.923717 29721 provisioner.cpp:416] Provisioner recovery complete
I0909 15:13:15.924393 29727 slave.cpp:6295] Finished recovery
I0909 15:13:15.925367 29727 slave.cpp:6477] Querying resource estimator for oversubscribable
resources
I0909 15:13:15.925680 29736 slave.cpp:6491] Received oversubscribable resources {} from the
resource estimator
I0909 15:13:15.929755 29717 process.cpp:3927] Handling HTTP event for process 'slave(808)'
with path: '/slave(808)/containers'
I0909 15:13:15.931666 29737 http.cpp:1166] HTTP GET for /slave(808)/containers from 172.17.0.12:58640
I0909 15:13:15.931732 29737 http.cpp:957] Authorizing principal 'test-principal' to GET the
'/containers' endpoint
I0909 15:13:15.934550  8466 slave.cpp:843] Agent terminating
[       OK ] Endpoint/SlaveEndpointTest.UnauthorizedRequest/2 (34 ms)
[ RUN      ] Endpoint/SlaveEndpointTest.NoAuthorizer/0
I0909 15:13:15.948715  8466 containerizer.cpp:246] Using isolation: posix/cpu,posix/mem,filesystem/posix,network/cni,environment_secret
W0909 15:13:15.949656  8466 backend.cpp:76] Failed to create 'aufs' backend: AufsBackend requires
root privileges
W0909 15:13:15.949858  8466 backend.cpp:76] Failed to create 'bind' backend: BindBackend requires
root privileges
I0909 15:13:15.949908  8466 provisioner.cpp:255] Using default backend 'copy'
I0909 15:13:15.952747  8466 cluster.cpp:448] Creating default 'local' authorizer
I0909 15:13:15.955667 29729 slave.cpp:250] Mesos agent started on (809)@172.17.0.12:41955
I0909 15:13:15.955698 29729 slave.cpp:251] Flags at startup: --acls="" --appc_simple_discovery_uri_prefix="http://"
--appc_store_dir="/tmp/Endpoint_SlaveEndpointTest_NoAuthorizer_0_4ZdJgP/store/appc" --authenticate_http_executors="true"
--authenticate_http_readonly="true" --authenticate_http_readwrite="true" --authenticatee="crammd5"
--authentication_backoff_factor="1secs" --authorizer="local" --cgroups_cpu_enable_pids_and_tids_count="false"
--cgroups_enable_cfs="false" --cgroups_hierarchy="/sys/fs/cgroup" --cgroups_limit_swap="false"
--cgroups_root="mesos" --container_disk_watch_interval="15secs" --containerizers="mesos" --credential="/tmp/Endpoint_SlaveEndpointTest_NoAuthorizer_0_4ZdJgP/credential"
--default_role="*" --disallow_sharing_agent_pid_namespace="false" --disk_watch_interval="1mins"
--docker="docker" --docker_kill_orphans="true" --docker_registry="https://registry-1.docker.io"
--docker_remove_delay="6hrs" --docker_socket="/var/run/docker.sock" --docker_stop_timeout="0ns"
--docker_store_dir="/tmp/Endpoint_SlaveEndpointTest_NoAuthorizer_0_4ZdJgP/store/docker" --docker_volume_checkpoint_dir="/var/run/mesos/isolators/docker/volume"
--enforce_container_disk_quota="false" --executor_registration_timeout="1mins" --executor_reregistration_timeout="2secs"
--executor_secret_key="/tmp/Endpoint_SlaveEndpointTest_NoAuthorizer_0_4ZdJgP/executor_secret_key"
--executor_shutdown_grace_period="5secs" --fetcher_cache_dir="/tmp/Endpoint_SlaveEndpointTest_NoAuthorizer_0_4ZdJgP/fetch"
--fetcher_cache_size="2GB" --frameworks_home="" --gc_delay="1weeks" --gc_disk_headroom="0.1"
--hadoop_home="" --help="false" --hostname_lookup="true" --http_command_executor="false" --http_credentials="/tmp/Endpoint_SlaveEndpointTest_NoAuthorizer_0_4ZdJgP/http_credentials"
--http_heartbeat_interval="30secs" --initialize_driver_logging="true" --isolation="posix/cpu,posix/mem"
--launcher="posix" --launcher_dir="/mesos/mesos-1.4.0/_build/src" --logbufsecs="0" --logging_level="INFO"
--max_completed_executors_per_framework="150" --oversubscribed_resources_interval="15secs"
--perf_duration="10secs" --perf_interval="1mins" --port="5051" --qos_correction_interval_min="0ns"
--quiet="false" --recover="reconnect" --recovery_timeout="15mins" --registration_backoff_factor="10ms"
--resources="cpus:2;gpus:0;mem:1024;disk:1024;ports:[31000-32000]" --revocable_cpu_low_priority="true"
--runtime_dir="/tmp/Endpoint_SlaveEndpointTest_NoAuthorizer_0_4ZdJgP" --sandbox_directory="/mnt/mesos/sandbox"
--strict="true" --switch_user="true" --systemd_enable_support="true" --systemd_runtime_directory="/run/systemd/system"
--version="false" --work_dir="/tmp/Endpoint_SlaveEndpointTest_NoAuthorizer_0_GVRYkI"
I0909 15:13:15.956265 29729 credentials.hpp:86] Loading credential for authentication from
'/tmp/Endpoint_SlaveEndpointTest_NoAuthorizer_0_4ZdJgP/credential'
I0909 15:13:15.956507 29729 slave.cpp:283] Agent using credential for: test-principal
I0909 15:13:15.956537 29729 credentials.hpp:37] Loading credentials for authentication from
'/tmp/Endpoint_SlaveEndpointTest_NoAuthorizer_0_4ZdJgP/http_credentials'
I0909 15:13:15.956934 29729 http.cpp:1026] Creating default 'basic' HTTP authenticator for
realm 'mesos-agent-executor'
I0909 15:13:15.957108 29729 http.cpp:1047] Creating default 'jwt' HTTP authenticator for realm
'mesos-agent-executor'
I0909 15:13:15.957412 29729 http.cpp:1026] Creating default 'basic' HTTP authenticator for
realm 'mesos-agent-readonly'
I0909 15:13:15.957550 29729 http.cpp:1047] Creating default 'jwt' HTTP authenticator for realm
'mesos-agent-readonly'
I0909 15:13:15.957803 29729 http.cpp:1026] Creating default 'basic' HTTP authenticator for
realm 'mesos-agent-readwrite'
I0909 15:13:15.957933 29729 http.cpp:1047] Creating default 'jwt' HTTP authenticator for realm
'mesos-agent-readwrite'
I0909 15:13:15.959929 29729 slave.cpp:565] Agent resources: [{"name":"cpus","scalar":{"value":2.0},"type":"SCALAR"},{"name":"mem","scalar":{"value":1024.0},"type":"SCALAR"},{"name":"disk","scalar":{"value":1024.0},"type":"SCALAR"},{"name":"ports","ranges":{"range":[{"begin":31000,"end":32000}]},"type":"RANGES"}]
I0909 15:13:15.960261 29729 slave.cpp:573] Agent attributes: [  ]
I0909 15:13:15.960280 29729 slave.cpp:582] Agent hostname: 2ae3fd26abcc
I0909 15:13:15.960505 29730 status_update_manager.cpp:177] Pausing sending status updates
I0909 15:13:15.962618 29738 state.cpp:64] Recovering state from '/tmp/Endpoint_SlaveEndpointTest_NoAuthorizer_0_GVRYkI/meta'
I0909 15:13:15.963023 29717 status_update_manager.cpp:203] Recovering status update manager
I0909 15:13:15.963222 29723 containerizer.cpp:609] Recovering containerizer
I0909 15:13:15.964889 29736 provisioner.cpp:416] Provisioner recovery complete
I0909 15:13:15.965423 29727 slave.cpp:6295] Finished recovery
I0909 15:13:15.965970 29727 slave.cpp:6477] Querying resource estimator for oversubscribable
resources
I0909 15:13:15.966234 29725 slave.cpp:6491] Received oversubscribable resources {} from the
resource estimator
I0909 15:13:15.968811 29737 process.cpp:3927] Handling HTTP event for process 'slave(809)'
with path: '/slave(809)/monitor/statistics'
I0909 15:13:15.970535 29730 http.cpp:1166] HTTP GET for /slave(809)/monitor/statistics from
172.17.0.12:58642
I0909 15:13:15.970595 29730 http.cpp:957] Authorizing principal 'test-principal' to GET the
'/monitor/statistics' endpoint
I0909 15:13:15.975574  8466 slave.cpp:843] Agent terminating
[       OK ] Endpoint/SlaveEndpointTest.NoAuthorizer/0 (39 ms)
[ RUN      ] Endpoint/SlaveEndpointTest.NoAuthorizer/1
I0909 15:13:15.988698  8466 containerizer.cpp:246] Using isolation: posix/cpu,posix/mem,filesystem/posix,network/cni,environment_secret
W0909 15:13:15.989234  8466 backend.cpp:76] Failed to create 'aufs' backend: AufsBackend requires
root privileges
W0909 15:13:15.989392  8466 backend.cpp:76] Failed to create 'bind' backend: BindBackend requires
root privileges
I0909 15:13:15.989435  8466 provisioner.cpp:255] Using default backend 'copy'
I0909 15:13:15.991359  8466 cluster.cpp:448] Creating default 'local' authorizer
I0909 15:13:15.993484 29718 slave.cpp:250] Mesos agent started on (810)@172.17.0.12:41955
I0909 15:13:15.993508 29718 slave.cpp:251] Flags at startup: --acls="" --appc_simple_discovery_uri_prefix="http://"
--appc_store_dir="/tmp/Endpoint_SlaveEndpointTest_NoAuthorizer_1_lAnfkh/store/appc" --authenticate_http_executors="true"
--authenticate_http_readonly="true" --authenticate_http_readwrite="true" --authenticatee="crammd5"
--authentication_backoff_factor="1secs" --authorizer="local" --cgroups_cpu_enable_pids_and_tids_count="false"
--cgroups_enable_cfs="false" --cgroups_hierarchy="/sys/fs/cgroup" --cgroups_limit_swap="false"
--cgroups_root="mesos" --container_disk_watch_interval="15secs" --containerizers="mesos" --credential="/tmp/Endpoint_SlaveEndpointTest_NoAuthorizer_1_lAnfkh/credential"
--default_role="*" --disallow_sharing_agent_pid_namespace="false" --disk_watch_interval="1mins"
--docker="docker" --docker_kill_orphans="true" --docker_registry="https://registry-1.docker.io"
--docker_remove_delay="6hrs" --docker_socket="/var/run/docker.sock" --docker_stop_timeout="0ns"
--docker_store_dir="/tmp/Endpoint_SlaveEndpointTest_NoAuthorizer_1_lAnfkh/store/docker" --docker_volume_checkpoint_dir="/var/run/mesos/isolators/docker/volume"
--enforce_container_disk_quota="false" --executor_registration_timeout="1mins" --executor_reregistration_timeout="2secs"
--executor_secret_key="/tmp/Endpoint_SlaveEndpointTest_NoAuthorizer_1_lAnfkh/executor_secret_key"
--executor_shutdown_grace_period="5secs" --fetcher_cache_dir="/tmp/Endpoint_SlaveEndpointTest_NoAuthorizer_1_lAnfkh/fetch"
--fetcher_cache_size="2GB" --frameworks_home="" --gc_delay="1weeks" --gc_disk_headroom="0.1"
--hadoop_home="" --help="false" --hostname_lookup="true" --http_command_executor="false" --http_credentials="/tmp/Endpoint_SlaveEndpointTest_NoAuthorizer_1_lAnfkh/http_credentials"
--http_heartbeat_interval="30secs" --initialize_driver_logging="true" --isolation="posix/cpu,posix/mem"
--launcher="posix" --launcher_dir="/mesos/mesos-1.4.0/_build/src" --logbufsecs="0" --logging_level="INFO"
--max_completed_executors_per_framework="150" --oversubscribed_resources_interval="15secs"
--perf_duration="10secs" --perf_interval="1mins" --port="5051" --qos_correction_interval_min="0ns"
--quiet="false" --recover="reconnect" --recovery_timeout="15mins" --registration_backoff_factor="10ms"
--resources="cpus:2;gpus:0;mem:1024;disk:1024;ports:[31000-32000]" --revocable_cpu_low_priority="true"
--runtime_dir="/tmp/Endpoint_SlaveEndpointTest_NoAuthorizer_1_lAnfkh" --sandbox_directory="/mnt/mesos/sandbox"
--strict="true" --switch_user="true" --systemd_enable_support="true" --systemd_runtime_directory="/run/systemd/system"
--version="false" --work_dir="/tmp/Endpoint_SlaveEndpointTest_NoAuthorizer_1_JHgyia"
I0909 15:13:15.993867 29718 credentials.hpp:86] Loading credential for authentication from
'/tmp/Endpoint_SlaveEndpointTest_NoAuthorizer_1_lAnfkh/credential'
I0909 15:13:15.994004 29718 slave.cpp:283] Agent using credential for: test-principal
I0909 15:13:15.994024 29718 credentials.hpp:37] Loading credentials for authentication from
'/tmp/Endpoint_SlaveEndpointTest_NoAuthorizer_1_lAnfkh/http_credentials'
I0909 15:13:15.994287 29718 http.cpp:1026] Creating default 'basic' HTTP authenticator for
realm 'mesos-agent-executor'
I0909 15:13:15.994400 29718 http.cpp:1047] Creating default 'jwt' HTTP authenticator for realm
'mesos-agent-executor'
I0909 15:13:15.994591 29718 http.cpp:1026] Creating default 'basic' HTTP authenticator for
realm 'mesos-agent-readonly'
I0909 15:13:15.994688 29718 http.cpp:1047] Creating default 'jwt' HTTP authenticator for realm
'mesos-agent-readonly'
I0909 15:13:15.994869 29718 http.cpp:1026] Creating default 'basic' HTTP authenticator for
realm 'mesos-agent-readwrite'
I0909 15:13:15.994968 29718 http.cpp:1047] Creating default 'jwt' HTTP authenticator for realm
'mesos-agent-readwrite'
I0909 15:13:15.996306 29718 slave.cpp:565] Agent resources: [{"name":"cpus","scalar":{"value":2.0},"type":"SCALAR"},{"name":"mem","scalar":{"value":1024.0},"type":"SCALAR"},{"name":"disk","scalar":{"value":1024.0},"type":"SCALAR"},{"name":"ports","ranges":{"range":[{"begin":31000,"end":32000}]},"type":"RANGES"}]
I0909 15:13:15.996536 29718 slave.cpp:573] Agent attributes: [  ]
I0909 15:13:15.996548 29718 slave.cpp:582] Agent hostname: 2ae3fd26abcc
I0909 15:13:15.996728 29721 status_update_manager.cpp:177] Pausing sending status updates
I0909 15:13:15.998564 29716 state.cpp:64] Recovering state from '/tmp/Endpoint_SlaveEndpointTest_NoAuthorizer_1_JHgyia/meta'
I0909 15:13:15.998953 29732 status_update_manager.cpp:203] Recovering status update manager
I0909 15:13:15.999294 29729 containerizer.cpp:609] Recovering containerizer
I0909 15:13:16.000861 29728 provisioner.cpp:416] Provisioner recovery complete
I0909 15:13:16.001284 29721 slave.cpp:6295] Finished recovery
I0909 15:13:16.002096 29721 slave.cpp:6477] Querying resource estimator for oversubscribable
resources
I0909 15:13:16.002460 29735 slave.cpp:6491] Received oversubscribable resources {} from the
resource estimator
I0909 15:13:16.004962 29736 process.cpp:3927] Handling HTTP event for process 'slave(810)'
with path: '/slave(810)/monitor/statistics.json'
I0909 15:13:16.007366 29728 http.cpp:1166] HTTP GET for /slave(810)/monitor/statistics.json
from 172.17.0.12:58644
I0909 15:13:16.007436 29728 http.cpp:957] Authorizing principal 'test-principal' to GET the
'/monitor/statistics.json' endpoint
I0909 15:13:16.011711 29719 slave.cpp:843] Agent terminating
[       OK ] Endpoint/SlaveEndpointTest.NoAuthorizer/1 (36 ms)
[ RUN      ] Endpoint/SlaveEndpointTest.NoAuthorizer/2
I0909 15:13:16.024698  8466 containerizer.cpp:246] Using isolation: posix/cpu,posix/mem,filesystem/posix,network/cni,environment_secret
W0909 15:13:16.025283  8466 backend.cpp:76] Failed to create 'aufs' backend: AufsBackend requires
root privileges
W0909 15:13:16.025398  8466 backend.cpp:76] Failed to create 'bind' backend: BindBackend requires
root privileges
I0909 15:13:16.025439  8466 provisioner.cpp:255] Using default backend 'copy'
I0909 15:13:16.027312  8466 cluster.cpp:448] Creating default 'local' authorizer
I0909 15:13:16.029289 29722 slave.cpp:250] Mesos agent started on (811)@172.17.0.12:41955
I0909 15:13:16.029314 29722 slave.cpp:251] Flags at startup: --acls="" --appc_simple_discovery_uri_prefix="http://"
--appc_store_dir="/tmp/Endpoint_SlaveEndpointTest_NoAuthorizer_2_zH30CI/store/appc" --authenticate_http_executors="true"
--authenticate_http_readonly="true" --authenticate_http_readwrite="true" --authenticatee="crammd5"
--authentication_backoff_factor="1secs" --authorizer="local" --cgroups_cpu_enable_pids_and_tids_count="false"
--cgroups_enable_cfs="false" --cgroups_hierarchy="/sys/fs/cgroup" --cgroups_limit_swap="false"
--cgroups_root="mesos" --container_disk_watch_interval="15secs" --containerizers="mesos" --credential="/tmp/Endpoint_SlaveEndpointTest_NoAuthorizer_2_zH30CI/credential"
--default_role="*" --disallow_sharing_agent_pid_namespace="false" --disk_watch_interval="1mins"
--docker="docker" --docker_kill_orphans="true" --docker_registry="https://registry-1.docker.io"
--docker_remove_delay="6hrs" --docker_socket="/var/run/docker.sock" --docker_stop_timeout="0ns"
--docker_store_dir="/tmp/Endpoint_SlaveEndpointTest_NoAuthorizer_2_zH30CI/store/docker" --docker_volume_checkpoint_dir="/var/run/mesos/isolators/docker/volume"
--enforce_container_disk_quota="false" --executor_registration_timeout="1mins" --executor_reregistration_timeout="2secs"
--executor_secret_key="/tmp/Endpoint_SlaveEndpointTest_NoAuthorizer_2_zH30CI/executor_secret_key"
--executor_shutdown_grace_period="5secs" --fetcher_cache_dir="/tmp/Endpoint_SlaveEndpointTest_NoAuthorizer_2_zH30CI/fetch"
--fetcher_cache_size="2GB" --frameworks_home="" --gc_delay="1weeks" --gc_disk_headroom="0.1"
--hadoop_home="" --help="false" --hostname_lookup="true" --http_command_executor="false" --http_credentials="/tmp/Endpoint_SlaveEndpointTest_NoAuthorizer_2_zH30CI/http_credentials"
--http_heartbeat_interval="30secs" --initialize_driver_logging="true" --isolation="posix/cpu,posix/mem"
--launcher="posix" --launcher_dir="/mesos/mesos-1.4.0/_build/src" --logbufsecs="0" --logging_level="INFO"
--max_completed_executors_per_framework="150" --oversubscribed_resources_interval="15secs"
--perf_duration="10secs" --perf_interval="1mins" --port="5051" --qos_correction_interval_min="0ns"
--quiet="false" --recover="reconnect" --recovery_timeout="15mins" --registration_backoff_factor="10ms"
--resources="cpus:2;gpus:0;mem:1024;disk:1024;ports:[31000-32000]" --revocable_cpu_low_priority="true"
--runtime_dir="/tmp/Endpoint_SlaveEndpointTest_NoAuthorizer_2_zH30CI" --sandbox_directory="/mnt/mesos/sandbox"
--strict="true" --switch_user="true" --systemd_enable_support="true" --systemd_runtime_directory="/run/systemd/system"
--version="false" --work_dir="/tmp/Endpoint_SlaveEndpointTest_NoAuthorizer_2_JSX7BC"
I0909 15:13:16.029747 29722 credentials.hpp:86] Loading credential for authentication from
'/tmp/Endpoint_SlaveEndpointTest_NoAuthorizer_2_zH30CI/credential'
I0909 15:13:16.029886 29722 slave.cpp:283] Agent using credential for: test-principal
I0909 15:13:16.029907 29722 credentials.hpp:37] Loading credentials for authentication from
'/tmp/Endpoint_SlaveEndpointTest_NoAuthorizer_2_zH30CI/http_credentials'
I0909 15:13:16.030169 29722 http.cpp:1026] Creating default 'basic' HTTP authenticator for
realm 'mesos-agent-executor'
I0909 15:13:16.030288 29722 http.cpp:1047] Creating default 'jwt' HTTP authenticator for realm
'mesos-agent-executor'
I0909 15:13:16.030488 29722 http.cpp:1026] Creating default 'basic' HTTP authenticator for
realm 'mesos-agent-readonly'
I0909 15:13:16.030601 29722 http.cpp:1047] Creating default 'jwt' HTTP authenticator for realm
'mesos-agent-readonly'
I0909 15:13:16.030791 29722 http.cpp:1026] Creating default 'basic' HTTP authenticator for
realm 'mesos-agent-readwrite'
I0909 15:13:16.030890 29722 http.cpp:1047] Creating default 'jwt' HTTP authenticator for realm
'mesos-agent-readwrite'
I0909 15:13:16.032223 29722 slave.cpp:565] Agent resources: [{"name":"cpus","scalar":{"value":2.0},"type":"SCALAR"},{"name":"mem","scalar":{"value":1024.0},"type":"SCALAR"},{"name":"disk","scalar":{"value":1024.0},"type":"SCALAR"},{"name":"ports","ranges":{"range":[{"begin":31000,"end":32000}]},"type":"RANGES"}]
I0909 15:13:16.032440 29722 slave.cpp:573] Agent attributes: [  ]
I0909 15:13:16.032454 29722 slave.cpp:582] Agent hostname: 2ae3fd26abcc
I0909 15:13:16.032570 29730 status_update_manager.cpp:177] Pausing sending status updates
I0909 15:13:16.034400 29725 state.cpp:64] Recovering state from '/tmp/Endpoint_SlaveEndpointTest_NoAuthorizer_2_JSX7BC/meta'
I0909 15:13:16.034798 29716 status_update_manager.cpp:203] Recovering status update manager
I0909 15:13:16.035141 29734 containerizer.cpp:609] Recovering containerizer
I0909 15:13:16.036634 29732 provisioner.cpp:416] Provisioner recovery complete
I0909 15:13:16.037083 29732 slave.cpp:6295] Finished recovery
I0909 15:13:16.037653 29732 slave.cpp:6477] Querying resource estimator for oversubscribable
resources
I0909 15:13:16.038005 29727 slave.cpp:6491] Received oversubscribable resources {} from the
resource estimator
I0909 15:13:16.040563 29723 process.cpp:3927] Handling HTTP event for process 'slave(811)'
with path: '/slave(811)/containers'
I0909 15:13:16.042646 29730 http.cpp:1166] HTTP GET for /slave(811)/containers from 172.17.0.12:58648
I0909 15:13:16.042767 29730 http.cpp:957] Authorizing principal 'test-principal' to GET the
'/containers' endpoint
I0909 15:13:16.048168 29724 slave.cpp:843] Agent terminating
[       OK ] Endpoint/SlaveEndpointTest.NoAuthorizer/2 (36 ms)
[----------] 9 tests from Endpoint/SlaveEndpointTest (292 ms total)

[----------] 2 tests from ContainerizerType/DefaultContainerDNSFlagTest
[ RUN      ] ContainerizerType/DefaultContainerDNSFlagTest.ValidateFlag/0
[       OK ] ContainerizerType/DefaultContainerDNSFlagTest.ValidateFlag/0 (12 ms)
[ RUN      ] ContainerizerType/DefaultContainerDNSFlagTest.ValidateFlag/1
[       OK ] ContainerizerType/DefaultContainerDNSFlagTest.ValidateFlag/1 (10 ms)
[----------] 2 tests from ContainerizerType/DefaultContainerDNSFlagTest (22 ms total)

[----------] Global test environment tear-down
[==========] 1663 tests from 184 test cases ran. (651748 ms total)
[  PASSED  ] 1658 tests.
[  FAILED  ] 5 tests, listed below:
[  FAILED  ] CommandExecutorCheckTest.CommandCheckDeliveredAndReconciled
[  FAILED  ] DefaultExecutorCheckTest.CommandCheckDeliveredAndReconciled
[  FAILED  ] DefaultExecutorCheckTest.CommandCheckStatusChange
[  FAILED  ] DefaultExecutorCheckTest.CommandCheckSeesParentsEnv
[  FAILED  ] DefaultExecutorCheckTest.CommandCheckSharesWorkDirWithTask

 5 FAILED TESTS
  YOU HAVE 20 DISABLED TESTS

I0909 15:13:16.143515 29739 process.cpp:1068] Failed to accept socket: future discarded
make[4]: *** [check-local] Error 1
make[4]: Leaving directory `/mesos/mesos-1.4.0/_build/src'
make[3]: *** [check-am] Error 2
make[3]: Leaving directory `/mesos/mesos-1.4.0/_build/src'
make[2]: *** [check] Error 2
make[2]: Leaving directory `/mesos/mesos-1.4.0/_build/src'
make[1]: *** [check-recursive] Error 1
make[1]: Leaving directory `/mesos/mesos-1.4.0/_build'
make: *** [distcheck] Error 1
+ docker rmi mesos-1504966428-10301
Untagged: mesos-1504966428-10301:latest
Deleted: sha256:9c25704c3ebfadcc993827615c30174154589d795944601db5fa20b851c4aef2
Deleted: sha256:bf4f3e06a8022ef52128e3ac6a3c183d81097d0a9878122cd33462a67c168340
Deleted: sha256:0cd78caf587de945cfafffbfc6a8e295fefa8f5f3c633e1da85d7c245df1db8e
Deleted: sha256:2ce5d1ed93fceedaa153052f594959d273b9cc7fb28d38ba9f9c69536ce30803
Deleted: sha256:a6f15e2456d27016587891d9734ea776120c3b239dff228ff594f2d7f73a119f
Deleted: sha256:3e40ed250859e324c30082215228944184ca78a239ddbe03dc371fcf2be9dc5e
Deleted: sha256:473f832b80fa9a63c8c9972ea132831b925af19a17cf4953526982d5c2c4ab4a
Deleted: sha256:f42cbe00efbfadefc44d56d516650b5caa1ffaa9d5cf46c4821a54348c20cc32
Deleted: sha256:f85dc01b6f0c642171302fdf09b45855cb8a5d92e178fea869a0d900e7c81a7f
Deleted: sha256:56c0374e9c67ea9f570380ab5d6e834d9c0700b1fcb2dcdf6826b16d9042ecc8
Deleted: sha256:68832bb63c7ae66dad5673c40f31fd633cb7e2e1f077ce1c6b4b5241f367a49a
Deleted: sha256:b1d49b0f801c2bbab90285ad7906cd4f2d55cbfce8f8e978f8856137c72b8cce
Deleted: sha256:db92fb2a94c968b7399e5f51de1c7684d2bf8b7e0d33974cddb4cb422f79be03
Deleted: sha256:cb2cea08d1ce8026054442c19f2980b8bbd14a21a3413b9d673519c74201dc40
Deleted: sha256:3e7aa841175d9096d8eb17a06684bef44ccce96ceabcfe94c777eb8bac8be2cc
Deleted: sha256:f7893b88a81372c252b03d370dc7e629e37cebfed265d48dc5d68c68b6f0cacb
Deleted: sha256:dd81516517e66fb7106f0fcbc2aaa81229598bbeff5bba53d3cc3433a1722296
Deleted: sha256:b09091d90f360880185cdec34fe944e62a5ac38a472f85c8c907e8cb016999c4
Deleted: sha256:208e3a066f743ec2449534fd07ee4ca789e3a7bdd43f7829f3068179382fce7c
Deleted: sha256:27549a042a38b9ba900c0743003f05f1695def9feda82dbb871e842077fa9299
Deleted: sha256:e15a8caa23834d03338c274f79a3ced22e37638db77a397f94b8fa6cc761a80d
Deleted: sha256:92f81be51938f3fd6b180ebf5420226dbca0416497280bd20425cf3256f8fe41
Deleted: sha256:8a2883663a450e86638ad0568aee95b363231d5ca2d1bd8d79f2617abd923490
Deleted: sha256:8a4e18ef3556bcdc7f30d904a4e7343c4925df407c29e4f440e88b1a3be30edd
Build step 'Execute shell' marked build as failure

Mime
View raw message