mesos-builds mailing list archives

Site index · List index
Message view « Date » · « Thread »
Top « Date » · « Thread »
From Apache Jenkins Server <jenk...@builds.apache.org>
Subject Build failed in Jenkins: Mesos-Buildbot » autotools,clang,--verbose --enable-libevent --enable-ssl,GLOG_v=1 MESOS_VERBOSE=1,ubuntu:14.04,(ubuntu)&&(!ubuntu-us1)&&(!ubuntu-eu2)&&(!qnode3)&&(!H23) #4241
Date Tue, 19 Sep 2017 23:04:47 GMT
See <https://builds.apache.org/job/Mesos-Buildbot/BUILDTOOL=autotools,COMPILER=clang,CONFIGURATION=--verbose%20--enable-libevent%20--enable-ssl,ENVIRONMENT=GLOG_v=1%20MESOS_VERBOSE=1,OS=ubuntu%3A14.04,label_exp=(ubuntu)&&(!ubuntu-us1)&&(!ubuntu-eu2)&&(!qnode3)&&(!H23)/4241/display/redirect?page=changes>

Changes:

[yujie.jay] Added index in the container volume doc.

------------------------------------------
[...truncated 32.69 MB...]
I0919 23:04:34.535426 25270 slave.cpp:253] Flags at startup: --acls="" --appc_simple_discovery_uri_prefix="http://"
--appc_store_dir="/tmp/Endpoint_SlaveEndpointTest_UnauthorizedRequest_0_GIyiI2/store/appc"
--authenticate_http_executors="true" --authenticate_http_readonly="true" --authenticate_http_readwrite="true"
--authenticatee="crammd5" --authentication_backoff_factor="1secs" --authorizer="local" --cgroups_cpu_enable_pids_and_tids_count="false"
--cgroups_enable_cfs="false" --cgroups_hierarchy="/sys/fs/cgroup" --cgroups_limit_swap="false"
--cgroups_root="mesos" --container_disk_watch_interval="15secs" --containerizers="mesos" --credential="/tmp/Endpoint_SlaveEndpointTest_UnauthorizedRequest_0_GIyiI2/credential"
--default_role="*" --disallow_sharing_agent_pid_namespace="false" --disk_watch_interval="1mins"
--docker="docker" --docker_kill_orphans="true" --docker_registry="https://registry-1.docker.io"
--docker_remove_delay="6hrs" --docker_socket="/var/run/docker.sock" --docker_stop_timeout="0ns"
--docker_store_dir="/tmp/Endpoint_SlaveEndpointTest_UnauthorizedRequest_0_GIyiI2/store/docker"
--docker_volume_checkpoint_dir="/var/run/mesos/isolators/docker/volume" --enforce_container_disk_quota="false"
--executor_registration_timeout="1mins" --executor_reregistration_timeout="2secs" --executor_secret_key="/tmp/Endpoint_SlaveEndpointTest_UnauthorizedRequest_0_GIyiI2/executor_secret_key"
--executor_shutdown_grace_period="5secs" --fetcher_cache_dir="/tmp/Endpoint_SlaveEndpointTest_UnauthorizedRequest_0_GIyiI2/fetch"
--fetcher_cache_size="2GB" --frameworks_home="" --gc_delay="1weeks" --gc_disk_headroom="0.1"
--hadoop_home="" --help="false" --hostname_lookup="true" --http_command_executor="false" --http_credentials="/tmp/Endpoint_SlaveEndpointTest_UnauthorizedRequest_0_GIyiI2/http_credentials"
--http_heartbeat_interval="30secs" --initialize_driver_logging="true" --isolation="posix/cpu,posix/mem"
--launcher="posix" --launcher_dir="/mesos/mesos-1.5.0/_build/src" --logbufsecs="0" --logging_level="INFO"
--max_completed_executors_per_framework="150" --oversubscribed_resources_interval="15secs"
--perf_duration="10secs" --perf_interval="1mins" --port="5051" --qos_correction_interval_min="0ns"
--quiet="false" --recover="reconnect" --recovery_timeout="15mins" --registration_backoff_factor="10ms"
--resources="cpus:2;gpus:0;mem:1024;disk:1024;ports:[31000-32000]" --revocable_cpu_low_priority="true"
--runtime_dir="/tmp/Endpoint_SlaveEndpointTest_UnauthorizedRequest_0_GIyiI2" --sandbox_directory="/mnt/mesos/sandbox"
--strict="true" --switch_user="true" --systemd_enable_support="true" --systemd_runtime_directory="/run/systemd/system"
--version="false" --work_dir="/tmp/Endpoint_SlaveEndpointTest_UnauthorizedRequest_0_ewU6xb"
--zk_session_timeout="10secs"
I0919 23:04:34.535851 25270 credentials.hpp:86] Loading credential for authentication from
'/tmp/Endpoint_SlaveEndpointTest_UnauthorizedRequest_0_GIyiI2/credential'
I0919 23:04:34.536051 25270 slave.cpp:285] Agent using credential for: test-principal
I0919 23:04:34.536082 25270 credentials.hpp:37] Loading credentials for authentication from
'/tmp/Endpoint_SlaveEndpointTest_UnauthorizedRequest_0_GIyiI2/http_credentials'
I0919 23:04:34.536425 25270 http.cpp:1045] Creating default 'basic' HTTP authenticator for
realm 'mesos-agent-executor'
I0919 23:04:34.536579 25270 http.cpp:1066] Creating default 'jwt' HTTP authenticator for realm
'mesos-agent-executor'
I0919 23:04:34.536841 25270 http.cpp:1045] Creating default 'basic' HTTP authenticator for
realm 'mesos-agent-readonly'
I0919 23:04:34.536983 25270 http.cpp:1066] Creating default 'jwt' HTTP authenticator for realm
'mesos-agent-readonly'
I0919 23:04:34.537221 25270 http.cpp:1045] Creating default 'basic' HTTP authenticator for
realm 'mesos-agent-readwrite'
I0919 23:04:34.537364 25270 http.cpp:1066] Creating default 'jwt' HTTP authenticator for realm
'mesos-agent-readwrite'
I0919 23:04:34.538769 25270 slave.cpp:583] Agent resources: [{"name":"cpus","scalar":{"value":2.0},"type":"SCALAR"},{"name":"mem","scalar":{"value":1024.0},"type":"SCALAR"},{"name":"disk","scalar":{"value":1024.0},"type":"SCALAR"},{"name":"ports","ranges":{"range":[{"begin":31000,"end":32000}]},"type":"RANGES"}]
I0919 23:04:34.538966 25270 slave.cpp:591] Agent attributes: [  ]
I0919 23:04:34.538987 25270 slave.cpp:600] Agent hostname: 9dc4f3c7181b
I0919 23:04:34.539165 25275 status_update_manager.cpp:177] Pausing sending status updates
I0919 23:04:34.540565 25276 state.cpp:64] Recovering state from '/tmp/Endpoint_SlaveEndpointTest_UnauthorizedRequest_0_ewU6xb/meta'
I0919 23:04:34.541013 25278 status_update_manager.cpp:203] Recovering status update manager
I0919 23:04:34.541220 25278 containerizer.cpp:648] Recovering containerizer
I0919 23:04:34.542712 25276 provisioner.cpp:416] Provisioner recovery complete
I0919 23:04:34.543180 25273 slave.cpp:6298] Finished recovery
I0919 23:04:34.543697 25273 slave.cpp:6480] Querying resource estimator for oversubscribable
resources
I0919 23:04:34.543987 25275 slave.cpp:6494] Received oversubscribable resources {} from the
resource estimator
I0919 23:04:34.546270 25270 process.cpp:3929] Handling HTTP event for process 'slave(817)'
with path: '/slave(817)/monitor/statistics'
I0919 23:04:34.548579 25272 http.cpp:1185] HTTP GET for /slave(817)/monitor/statistics from
172.17.0.3:57467
I0919 23:04:34.548665 25272 http.cpp:976] Authorizing principal 'test-principal' to GET the
'/monitor/statistics' endpoint
I0919 23:04:34.551396 25274 slave.cpp:861] Agent terminating
[       OK ] Endpoint/SlaveEndpointTest.UnauthorizedRequest/0 (33 ms)
[ RUN      ] Endpoint/SlaveEndpointTest.UnauthorizedRequest/1
I0919 23:04:34.565837  6074 containerizer.cpp:292] Using isolation { environment_secret, posix/cpu,
posix/mem, filesystem/posix, network/cni }
W0919 23:04:34.566254  6074 backend.cpp:76] Failed to create 'aufs' backend: AufsBackend requires
root privileges
W0919 23:04:34.566354  6074 backend.cpp:76] Failed to create 'bind' backend: BindBackend requires
root privileges
I0919 23:04:34.566383  6074 provisioner.cpp:255] Using default backend 'copy'
I0919 23:04:34.569347 25275 slave.cpp:252] Mesos agent started on (818)@172.17.0.3:58041
I0919 23:04:34.569382 25275 slave.cpp:253] Flags at startup: --acls="" --appc_simple_discovery_uri_prefix="http://"
--appc_store_dir="/tmp/Endpoint_SlaveEndpointTest_UnauthorizedRequest_1_oMt7Et/store/appc"
--authenticate_http_executors="true" --authenticate_http_readonly="true" --authenticate_http_readwrite="true"
--authenticatee="crammd5" --authentication_backoff_factor="1secs" --authorizer="local" --cgroups_cpu_enable_pids_and_tids_count="false"
--cgroups_enable_cfs="false" --cgroups_hierarchy="/sys/fs/cgroup" --cgroups_limit_swap="false"
--cgroups_root="mesos" --container_disk_watch_interval="15secs" --containerizers="mesos" --credential="/tmp/Endpoint_SlaveEndpointTest_UnauthorizedRequest_1_oMt7Et/credential"
--default_role="*" --disallow_sharing_agent_pid_namespace="false" --disk_watch_interval="1mins"
--docker="docker" --docker_kill_orphans="true" --docker_registry="https://registry-1.docker.io"
--docker_remove_delay="6hrs" --docker_socket="/var/run/docker.sock" --docker_stop_timeout="0ns"
--docker_store_dir="/tmp/Endpoint_SlaveEndpointTest_UnauthorizedRequest_1_oMt7Et/store/docker"
--docker_volume_checkpoint_dir="/var/run/mesos/isolators/docker/volume" --enforce_container_disk_quota="false"
--executor_registration_timeout="1mins" --executor_reregistration_timeout="2secs" --executor_secret_key="/tmp/Endpoint_SlaveEndpointTest_UnauthorizedRequest_1_oMt7Et/executor_secret_key"
--executor_shutdown_grace_period="5secs" --fetcher_cache_dir="/tmp/Endpoint_SlaveEndpointTest_UnauthorizedRequest_1_oMt7Et/fetch"
--fetcher_cache_size="2GB" --frameworks_home="" --gc_delay="1weeks" --gc_disk_headroom="0.1"
--hadoop_home="" --help="false" --hostname_lookup="true" --http_command_executor="false" --http_credentials="/tmp/Endpoint_SlaveEndpointTest_UnauthorizedRequest_1_oMt7Et/http_credentials"
--http_heartbeat_interval="30secs" --initialize_driver_logging="true" --isolation="posix/cpu,posix/mem"
--launcher="posix" --launcher_dir="/mesos/mesos-1.5.0/_build/src" --logbufsecs="0" --logging_level="INFO"
--max_completed_executors_per_framework="150" --oversubscribed_resources_interval="15secs"
--perf_duration="10secs" --perf_interval="1mins" --port="5051" --qos_correction_interval_min="0ns"
--quiet="false" --recover="reconnect" --recovery_timeout="15mins" --registration_backoff_factor="10ms"
--resources="cpus:2;gpus:0;mem:1024;disk:1024;ports:[31000-32000]" --revocable_cpu_low_priority="true"
--runtime_dir="/tmp/Endpoint_SlaveEndpointTest_UnauthorizedRequest_1_oMt7Et" --sandbox_directory="/mnt/mesos/sandbox"
--strict="true" --switch_user="true" --systemd_enable_support="true" --systemd_runtime_directory="/run/systemd/system"
--version="false" --work_dir="/tmp/Endpoint_SlaveEndpointTest_UnauthorizedRequest_1_USFxpC"
--zk_session_timeout="10secs"
I0919 23:04:34.569816 25275 credentials.hpp:86] Loading credential for authentication from
'/tmp/Endpoint_SlaveEndpointTest_UnauthorizedRequest_1_oMt7Et/credential'
I0919 23:04:34.570003 25275 slave.cpp:285] Agent using credential for: test-principal
I0919 23:04:34.570036 25275 credentials.hpp:37] Loading credentials for authentication from
'/tmp/Endpoint_SlaveEndpointTest_UnauthorizedRequest_1_oMt7Et/http_credentials'
I0919 23:04:34.570415 25275 http.cpp:1045] Creating default 'basic' HTTP authenticator for
realm 'mesos-agent-executor'
I0919 23:04:34.570572 25275 http.cpp:1066] Creating default 'jwt' HTTP authenticator for realm
'mesos-agent-executor'
I0919 23:04:34.570873 25275 http.cpp:1045] Creating default 'basic' HTTP authenticator for
realm 'mesos-agent-readonly'
I0919 23:04:34.571017 25275 http.cpp:1066] Creating default 'jwt' HTTP authenticator for realm
'mesos-agent-readonly'
I0919 23:04:34.571244 25275 http.cpp:1045] Creating default 'basic' HTTP authenticator for
realm 'mesos-agent-readwrite'
I0919 23:04:34.571348 25275 http.cpp:1066] Creating default 'jwt' HTTP authenticator for realm
'mesos-agent-readwrite'
I0919 23:04:34.572616 25275 slave.cpp:583] Agent resources: [{"name":"cpus","scalar":{"value":2.0},"type":"SCALAR"},{"name":"mem","scalar":{"value":1024.0},"type":"SCALAR"},{"name":"disk","scalar":{"value":1024.0},"type":"SCALAR"},{"name":"ports","ranges":{"range":[{"begin":31000,"end":32000}]},"type":"RANGES"}]
I0919 23:04:34.572805 25275 slave.cpp:591] Agent attributes: [  ]
I0919 23:04:34.572818 25275 slave.cpp:600] Agent hostname: 9dc4f3c7181b
I0919 23:04:34.572937 25281 status_update_manager.cpp:177] Pausing sending status updates
I0919 23:04:34.574262 25280 state.cpp:64] Recovering state from '/tmp/Endpoint_SlaveEndpointTest_UnauthorizedRequest_1_USFxpC/meta'
I0919 23:04:34.574630 25280 status_update_manager.cpp:203] Recovering status update manager
I0919 23:04:34.574909 25282 containerizer.cpp:648] Recovering containerizer
I0919 23:04:34.576397 25276 provisioner.cpp:416] Provisioner recovery complete
I0919 23:04:34.576807 25268 slave.cpp:6298] Finished recovery
I0919 23:04:34.577334 25268 slave.cpp:6480] Querying resource estimator for oversubscribable
resources
I0919 23:04:34.577615 25278 slave.cpp:6494] Received oversubscribable resources {} from the
resource estimator
I0919 23:04:34.579890 25276 process.cpp:3929] Handling HTTP event for process 'slave(818)'
with path: '/slave(818)/monitor/statistics.json'
I0919 23:04:34.581863 25269 http.cpp:1185] HTTP GET for /slave(818)/monitor/statistics.json
from 172.17.0.3:57468
I0919 23:04:34.581959 25269 http.cpp:976] Authorizing principal 'test-principal' to GET the
'/monitor/statistics.json' endpoint
I0919 23:04:34.584949  6074 slave.cpp:861] Agent terminating
[       OK ] Endpoint/SlaveEndpointTest.UnauthorizedRequest/1 (33 ms)
[ RUN      ] Endpoint/SlaveEndpointTest.UnauthorizedRequest/2
I0919 23:04:34.598526  6074 containerizer.cpp:292] Using isolation { environment_secret, posix/cpu,
posix/mem, filesystem/posix, network/cni }
W0919 23:04:34.599112  6074 backend.cpp:76] Failed to create 'aufs' backend: AufsBackend requires
root privileges
W0919 23:04:34.599241  6074 backend.cpp:76] Failed to create 'bind' backend: BindBackend requires
root privileges
I0919 23:04:34.599293  6074 provisioner.cpp:255] Using default backend 'copy'
I0919 23:04:34.602964 25283 slave.cpp:252] Mesos agent started on (819)@172.17.0.3:58041
I0919 23:04:34.603013 25283 slave.cpp:253] Flags at startup: --acls="" --appc_simple_discovery_uri_prefix="http://"
--appc_store_dir="/tmp/Endpoint_SlaveEndpointTest_UnauthorizedRequest_2_OJvpXU/store/appc"
--authenticate_http_executors="true" --authenticate_http_readonly="true" --authenticate_http_readwrite="true"
--authenticatee="crammd5" --authentication_backoff_factor="1secs" --authorizer="local" --cgroups_cpu_enable_pids_and_tids_count="false"
--cgroups_enable_cfs="false" --cgroups_hierarchy="/sys/fs/cgroup" --cgroups_limit_swap="false"
--cgroups_root="mesos" --container_disk_watch_interval="15secs" --containerizers="mesos" --credential="/tmp/Endpoint_SlaveEndpointTest_UnauthorizedRequest_2_OJvpXU/credential"
--default_role="*" --disallow_sharing_agent_pid_namespace="false" --disk_watch_interval="1mins"
--docker="docker" --docker_kill_orphans="true" --docker_registry="https://registry-1.docker.io"
--docker_remove_delay="6hrs" --docker_socket="/var/run/docker.sock" --docker_stop_timeout="0ns"
--docker_store_dir="/tmp/Endpoint_SlaveEndpointTest_UnauthorizedRequest_2_OJvpXU/store/docker"
--docker_volume_checkpoint_dir="/var/run/mesos/isolators/docker/volume" --enforce_container_disk_quota="false"
--executor_registration_timeout="1mins" --executor_reregistration_timeout="2secs" --executor_secret_key="/tmp/Endpoint_SlaveEndpointTest_UnauthorizedRequest_2_OJvpXU/executor_secret_key"
--executor_shutdown_grace_period="5secs" --fetcher_cache_dir="/tmp/Endpoint_SlaveEndpointTest_UnauthorizedRequest_2_OJvpXU/fetch"
--fetcher_cache_size="2GB" --frameworks_home="" --gc_delay="1weeks" --gc_disk_headroom="0.1"
--hadoop_home="" --help="false" --hostname_lookup="true" --http_command_executor="false" --http_credentials="/tmp/Endpoint_SlaveEndpointTest_UnauthorizedRequest_2_OJvpXU/http_credentials"
--http_heartbeat_interval="30secs" --initialize_driver_logging="true" --isolation="posix/cpu,posix/mem"
--launcher="posix" --launcher_dir="/mesos/mesos-1.5.0/_build/src" --logbufsecs="0" --logging_level="INFO"
--max_completed_executors_per_framework="150" --oversubscribed_resources_interval="15secs"
--perf_duration="10secs" --perf_interval="1mins" --port="5051" --qos_correction_interval_min="0ns"
--quiet="false" --recover="reconnect" --recovery_timeout="15mins" --registration_backoff_factor="10ms"
--resources="cpus:2;gpus:0;mem:1024;disk:1024;ports:[31000-32000]" --revocable_cpu_low_priority="true"
--runtime_dir="/tmp/Endpoint_SlaveEndpointTest_UnauthorizedRequest_2_OJvpXU" --sandbox_directory="/mnt/mesos/sandbox"
--strict="true" --switch_user="true" --systemd_enable_support="true" --systemd_runtime_directory="/run/systemd/system"
--version="false" --work_dir="/tmp/Endpoint_SlaveEndpointTest_UnauthorizedRequest_2_ET4uC3"
--zk_session_timeout="10secs"
I0919 23:04:34.603597 25283 credentials.hpp:86] Loading credential for authentication from
'/tmp/Endpoint_SlaveEndpointTest_UnauthorizedRequest_2_OJvpXU/credential'
I0919 23:04:34.603792 25283 slave.cpp:285] Agent using credential for: test-principal
I0919 23:04:34.603832 25283 credentials.hpp:37] Loading credentials for authentication from
'/tmp/Endpoint_SlaveEndpointTest_UnauthorizedRequest_2_OJvpXU/http_credentials'
I0919 23:04:34.604260 25283 http.cpp:1045] Creating default 'basic' HTTP authenticator for
realm 'mesos-agent-executor'
I0919 23:04:34.604405 25283 http.cpp:1066] Creating default 'jwt' HTTP authenticator for realm
'mesos-agent-executor'
I0919 23:04:34.604701 25283 http.cpp:1045] Creating default 'basic' HTTP authenticator for
realm 'mesos-agent-readonly'
I0919 23:04:34.604830 25283 http.cpp:1066] Creating default 'jwt' HTTP authenticator for realm
'mesos-agent-readonly'
I0919 23:04:34.605114 25283 http.cpp:1045] Creating default 'basic' HTTP authenticator for
realm 'mesos-agent-readwrite'
I0919 23:04:34.605252 25283 http.cpp:1066] Creating default 'jwt' HTTP authenticator for realm
'mesos-agent-readwrite'
I0919 23:04:34.607095 25283 slave.cpp:583] Agent resources: [{"name":"cpus","scalar":{"value":2.0},"type":"SCALAR"},{"name":"mem","scalar":{"value":1024.0},"type":"SCALAR"},{"name":"disk","scalar":{"value":1024.0},"type":"SCALAR"},{"name":"ports","ranges":{"range":[{"begin":31000,"end":32000}]},"type":"RANGES"}]
I0919 23:04:34.607376 25283 slave.cpp:591] Agent attributes: [  ]
I0919 23:04:34.607393 25283 slave.cpp:600] Agent hostname: 9dc4f3c7181b
I0919 23:04:34.607564 25274 status_update_manager.cpp:177] Pausing sending status updates
I0919 23:04:34.609163 25282 state.cpp:64] Recovering state from '/tmp/Endpoint_SlaveEndpointTest_UnauthorizedRequest_2_ET4uC3/meta'
I0919 23:04:34.609462 25281 status_update_manager.cpp:203] Recovering status update manager
I0919 23:04:34.609699 25281 containerizer.cpp:648] Recovering containerizer
I0919 23:04:34.611107 25272 provisioner.cpp:416] Provisioner recovery complete
I0919 23:04:34.611522 25275 slave.cpp:6298] Finished recovery
I0919 23:04:34.612051 25275 slave.cpp:6480] Querying resource estimator for oversubscribable
resources
I0919 23:04:34.612305 25281 slave.cpp:6494] Received oversubscribable resources {} from the
resource estimator
I0919 23:04:34.614310 25272 process.cpp:3929] Handling HTTP event for process 'slave(819)'
with path: '/slave(819)/containers'
I0919 23:04:34.616169 25280 http.cpp:1185] HTTP GET for /slave(819)/containers from 172.17.0.3:57469
I0919 23:04:34.616233 25280 http.cpp:976] Authorizing principal 'test-principal' to GET the
'/containers' endpoint
I0919 23:04:34.619112  6074 slave.cpp:861] Agent terminating
[       OK ] Endpoint/SlaveEndpointTest.UnauthorizedRequest/2 (33 ms)
[ RUN      ] Endpoint/SlaveEndpointTest.NoAuthorizer/0
I0919 23:04:34.632895  6074 containerizer.cpp:292] Using isolation { environment_secret, posix/cpu,
posix/mem, filesystem/posix, network/cni }
W0919 23:04:34.633597  6074 backend.cpp:76] Failed to create 'aufs' backend: AufsBackend requires
root privileges
W0919 23:04:34.633739  6074 backend.cpp:76] Failed to create 'bind' backend: BindBackend requires
root privileges
I0919 23:04:34.633785  6074 provisioner.cpp:255] Using default backend 'copy'
I0919 23:04:34.636013  6074 cluster.cpp:448] Creating default 'local' authorizer
I0919 23:04:34.638197 25269 slave.cpp:252] Mesos agent started on (820)@172.17.0.3:58041
I0919 23:04:34.638232 25269 slave.cpp:253] Flags at startup: --acls="" --appc_simple_discovery_uri_prefix="http://"
--appc_store_dir="/tmp/Endpoint_SlaveEndpointTest_NoAuthorizer_0_mRbPBm/store/appc" --authenticate_http_executors="true"
--authenticate_http_readonly="true" --authenticate_http_readwrite="true" --authenticatee="crammd5"
--authentication_backoff_factor="1secs" --authorizer="local" --cgroups_cpu_enable_pids_and_tids_count="false"
--cgroups_enable_cfs="false" --cgroups_hierarchy="/sys/fs/cgroup" --cgroups_limit_swap="false"
--cgroups_root="mesos" --container_disk_watch_interval="15secs" --containerizers="mesos" --credential="/tmp/Endpoint_SlaveEndpointTest_NoAuthorizer_0_mRbPBm/credential"
--default_role="*" --disallow_sharing_agent_pid_namespace="false" --disk_watch_interval="1mins"
--docker="docker" --docker_kill_orphans="true" --docker_registry="https://registry-1.docker.io"
--docker_remove_delay="6hrs" --docker_socket="/var/run/docker.sock" --docker_stop_timeout="0ns"
--docker_store_dir="/tmp/Endpoint_SlaveEndpointTest_NoAuthorizer_0_mRbPBm/store/docker" --docker_volume_checkpoint_dir="/var/run/mesos/isolators/docker/volume"
--enforce_container_disk_quota="false" --executor_registration_timeout="1mins" --executor_reregistration_timeout="2secs"
--executor_secret_key="/tmp/Endpoint_SlaveEndpointTest_NoAuthorizer_0_mRbPBm/executor_secret_key"
--executor_shutdown_grace_period="5secs" --fetcher_cache_dir="/tmp/Endpoint_SlaveEndpointTest_NoAuthorizer_0_mRbPBm/fetch"
--fetcher_cache_size="2GB" --frameworks_home="" --gc_delay="1weeks" --gc_disk_headroom="0.1"
--hadoop_home="" --help="false" --hostname_lookup="true" --http_command_executor="false" --http_credentials="/tmp/Endpoint_SlaveEndpointTest_NoAuthorizer_0_mRbPBm/http_credentials"
--http_heartbeat_interval="30secs" --initialize_driver_logging="true" --isolation="posix/cpu,posix/mem"
--launcher="posix" --launcher_dir="/mesos/mesos-1.5.0/_build/src" --logbufsecs="0" --logging_level="INFO"
--max_completed_executors_per_framework="150" --oversubscribed_resources_interval="15secs"
--perf_duration="10secs" --perf_interval="1mins" --port="5051" --qos_correction_interval_min="0ns"
--quiet="false" --recover="reconnect" --recovery_timeout="15mins" --registration_backoff_factor="10ms"
--resources="cpus:2;gpus:0;mem:1024;disk:1024;ports:[31000-32000]" --revocable_cpu_low_priority="true"
--runtime_dir="/tmp/Endpoint_SlaveEndpointTest_NoAuthorizer_0_mRbPBm" --sandbox_directory="/mnt/mesos/sandbox"
--strict="true" --switch_user="true" --systemd_enable_support="true" --systemd_runtime_directory="/run/systemd/system"
--version="false" --work_dir="/tmp/Endpoint_SlaveEndpointTest_NoAuthorizer_0_g0tqbv" --zk_session_timeout="10secs"
I0919 23:04:34.638590 25269 credentials.hpp:86] Loading credential for authentication from
'/tmp/Endpoint_SlaveEndpointTest_NoAuthorizer_0_mRbPBm/credential'
I0919 23:04:34.638725 25269 slave.cpp:285] Agent using credential for: test-principal
I0919 23:04:34.638757 25269 credentials.hpp:37] Loading credentials for authentication from
'/tmp/Endpoint_SlaveEndpointTest_NoAuthorizer_0_mRbPBm/http_credentials'
I0919 23:04:34.639108 25269 http.cpp:1045] Creating default 'basic' HTTP authenticator for
realm 'mesos-agent-executor'
I0919 23:04:34.639281 25269 http.cpp:1066] Creating default 'jwt' HTTP authenticator for realm
'mesos-agent-executor'
I0919 23:04:34.639554 25269 http.cpp:1045] Creating default 'basic' HTTP authenticator for
realm 'mesos-agent-readonly'
I0919 23:04:34.639690 25269 http.cpp:1066] Creating default 'jwt' HTTP authenticator for realm
'mesos-agent-readonly'
I0919 23:04:34.639967 25269 http.cpp:1045] Creating default 'basic' HTTP authenticator for
realm 'mesos-agent-readwrite'
I0919 23:04:34.640102 25269 http.cpp:1066] Creating default 'jwt' HTTP authenticator for realm
'mesos-agent-readwrite'
I0919 23:04:34.641849 25269 slave.cpp:583] Agent resources: [{"name":"cpus","scalar":{"value":2.0},"type":"SCALAR"},{"name":"mem","scalar":{"value":1024.0},"type":"SCALAR"},{"name":"disk","scalar":{"value":1024.0},"type":"SCALAR"},{"name":"ports","ranges":{"range":[{"begin":31000,"end":32000}]},"type":"RANGES"}]
I0919 23:04:34.642125 25269 slave.cpp:591] Agent attributes: [  ]
I0919 23:04:34.642144 25269 slave.cpp:600] Agent hostname: 9dc4f3c7181b
I0919 23:04:34.642360 25280 status_update_manager.cpp:177] Pausing sending status updates
I0919 23:04:34.643537 25273 state.cpp:64] Recovering state from '/tmp/Endpoint_SlaveEndpointTest_NoAuthorizer_0_g0tqbv/meta'
I0919 23:04:34.643790 25281 status_update_manager.cpp:203] Recovering status update manager
I0919 23:04:34.644026 25271 containerizer.cpp:648] Recovering containerizer
I0919 23:04:34.645267 25273 provisioner.cpp:416] Provisioner recovery complete
I0919 23:04:34.645761 25281 slave.cpp:6298] Finished recovery
I0919 23:04:34.646183 25281 slave.cpp:6480] Querying resource estimator for oversubscribable
resources
I0919 23:04:34.646425 25268 slave.cpp:6494] Received oversubscribable resources {} from the
resource estimator
I0919 23:04:34.648187 25272 process.cpp:3929] Handling HTTP event for process 'slave(820)'
with path: '/slave(820)/monitor/statistics'
I0919 23:04:34.649905 25280 http.cpp:1185] HTTP GET for /slave(820)/monitor/statistics from
172.17.0.3:57470
I0919 23:04:34.649961 25280 http.cpp:976] Authorizing principal 'test-principal' to GET the
'/monitor/statistics' endpoint
I0919 23:04:34.653755  6074 slave.cpp:861] Agent terminating
[       OK ] Endpoint/SlaveEndpointTest.NoAuthorizer/0 (33 ms)
[ RUN      ] Endpoint/SlaveEndpointTest.NoAuthorizer/1
I0919 23:04:34.665336  6074 containerizer.cpp:292] Using isolation { environment_secret, posix/cpu,
posix/mem, filesystem/posix, network/cni }
W0919 23:04:34.665834  6074 backend.cpp:76] Failed to create 'aufs' backend: AufsBackend requires
root privileges
W0919 23:04:34.665937  6074 backend.cpp:76] Failed to create 'bind' backend: BindBackend requires
root privileges
I0919 23:04:34.665978  6074 provisioner.cpp:255] Using default backend 'copy'
I0919 23:04:34.667498  6074 cluster.cpp:448] Creating default 'local' authorizer
I0919 23:04:34.669181 25277 slave.cpp:252] Mesos agent started on (821)@172.17.0.3:58041
I0919 23:04:34.669217 25277 slave.cpp:253] Flags at startup: --acls="" --appc_simple_discovery_uri_prefix="http://"
--appc_store_dir="/tmp/Endpoint_SlaveEndpointTest_NoAuthorizer_1_C4PbCO/store/appc" --authenticate_http_executors="true"
--authenticate_http_readonly="true" --authenticate_http_readwrite="true" --authenticatee="crammd5"
--authentication_backoff_factor="1secs" --authorizer="local" --cgroups_cpu_enable_pids_and_tids_count="false"
--cgroups_enable_cfs="false" --cgroups_hierarchy="/sys/fs/cgroup" --cgroups_limit_swap="false"
--cgroups_root="mesos" --container_disk_watch_interval="15secs" --containerizers="mesos" --credential="/tmp/Endpoint_SlaveEndpointTest_NoAuthorizer_1_C4PbCO/credential"
--default_role="*" --disallow_sharing_agent_pid_namespace="false" --disk_watch_interval="1mins"
--docker="docker" --docker_kill_orphans="true" --docker_registry="https://registry-1.docker.io"
--docker_remove_delay="6hrs" --docker_socket="/var/run/docker.sock" --docker_stop_timeout="0ns"
--docker_store_dir="/tmp/Endpoint_SlaveEndpointTest_NoAuthorizer_1_C4PbCO/store/docker" --docker_volume_checkpoint_dir="/var/run/mesos/isolators/docker/volume"
--enforce_container_disk_quota="false" --executor_registration_timeout="1mins" --executor_reregistration_timeout="2secs"
--executor_secret_key="/tmp/Endpoint_SlaveEndpointTest_NoAuthorizer_1_C4PbCO/executor_secret_key"
--executor_shutdown_grace_period="5secs" --fetcher_cache_dir="/tmp/Endpoint_SlaveEndpointTest_NoAuthorizer_1_C4PbCO/fetch"
--fetcher_cache_size="2GB" --frameworks_home="" --gc_delay="1weeks" --gc_disk_headroom="0.1"
--hadoop_home="" --help="false" --hostname_lookup="true" --http_command_executor="false" --http_credentials="/tmp/Endpoint_SlaveEndpointTest_NoAuthorizer_1_C4PbCO/http_credentials"
--http_heartbeat_interval="30secs" --initialize_driver_logging="true" --isolation="posix/cpu,posix/mem"
--launcher="posix" --launcher_dir="/mesos/mesos-1.5.0/_build/src" --logbufsecs="0" --logging_level="INFO"
--max_completed_executors_per_framework="150" --oversubscribed_resources_interval="15secs"
--perf_duration="10secs" --perf_interval="1mins" --port="5051" --qos_correction_interval_min="0ns"
--quiet="false" --recover="reconnect" --recovery_timeout="15mins" --registration_backoff_factor="10ms"
--resources="cpus:2;gpus:0;mem:1024;disk:1024;ports:[31000-32000]" --revocable_cpu_low_priority="true"
--runtime_dir="/tmp/Endpoint_SlaveEndpointTest_NoAuthorizer_1_C4PbCO" --sandbox_directory="/mnt/mesos/sandbox"
--strict="true" --switch_user="true" --systemd_enable_support="true" --systemd_runtime_directory="/run/systemd/system"
--version="false" --work_dir="/tmp/Endpoint_SlaveEndpointTest_NoAuthorizer_1_cIfk6W" --zk_session_timeout="10secs"
I0919 23:04:34.669600 25277 credentials.hpp:86] Loading credential for authentication from
'/tmp/Endpoint_SlaveEndpointTest_NoAuthorizer_1_C4PbCO/credential'
I0919 23:04:34.669756 25277 slave.cpp:285] Agent using credential for: test-principal
I0919 23:04:34.669778 25277 credentials.hpp:37] Loading credentials for authentication from
'/tmp/Endpoint_SlaveEndpointTest_NoAuthorizer_1_C4PbCO/http_credentials'
I0919 23:04:34.670042 25277 http.cpp:1045] Creating default 'basic' HTTP authenticator for
realm 'mesos-agent-executor'
I0919 23:04:34.670161 25277 http.cpp:1066] Creating default 'jwt' HTTP authenticator for realm
'mesos-agent-executor'
I0919 23:04:34.670368 25277 http.cpp:1045] Creating default 'basic' HTTP authenticator for
realm 'mesos-agent-readonly'
I0919 23:04:34.670500 25277 http.cpp:1066] Creating default 'jwt' HTTP authenticator for realm
'mesos-agent-readonly'
I0919 23:04:34.670699 25277 http.cpp:1045] Creating default 'basic' HTTP authenticator for
realm 'mesos-agent-readwrite'
I0919 23:04:34.670804 25277 http.cpp:1066] Creating default 'jwt' HTTP authenticator for realm
'mesos-agent-readwrite'
I0919 23:04:34.672096 25277 slave.cpp:583] Agent resources: [{"name":"cpus","scalar":{"value":2.0},"type":"SCALAR"},{"name":"mem","scalar":{"value":1024.0},"type":"SCALAR"},{"name":"disk","scalar":{"value":1024.0},"type":"SCALAR"},{"name":"ports","ranges":{"range":[{"begin":31000,"end":32000}]},"type":"RANGES"}]
I0919 23:04:34.672291 25277 slave.cpp:591] Agent attributes: [  ]
I0919 23:04:34.672304 25277 slave.cpp:600] Agent hostname: 9dc4f3c7181b
I0919 23:04:34.672437 25269 status_update_manager.cpp:177] Pausing sending status updates
I0919 23:04:34.673789 25276 state.cpp:64] Recovering state from '/tmp/Endpoint_SlaveEndpointTest_NoAuthorizer_1_cIfk6W/meta'
I0919 23:04:34.674144 25274 status_update_manager.cpp:203] Recovering status update manager
I0919 23:04:34.674371 25283 containerizer.cpp:648] Recovering containerizer
I0919 23:04:34.675650 25276 provisioner.cpp:416] Provisioner recovery complete
I0919 23:04:34.675967 25282 slave.cpp:6298] Finished recovery
I0919 23:04:34.676395 25282 slave.cpp:6480] Querying resource estimator for oversubscribable
resources
I0919 23:04:34.676595 25273 slave.cpp:6494] Received oversubscribable resources {} from the
resource estimator
I0919 23:04:34.678515 25275 process.cpp:3929] Handling HTTP event for process 'slave(821)'
with path: '/slave(821)/monitor/statistics.json'
I0919 23:04:34.680379 25270 http.cpp:1185] HTTP GET for /slave(821)/monitor/statistics.json
from 172.17.0.3:57471
I0919 23:04:34.680461 25270 http.cpp:976] Authorizing principal 'test-principal' to GET the
'/monitor/statistics.json' endpoint
I0919 23:04:34.684603 25281 slave.cpp:861] Agent terminating
[       OK ] Endpoint/SlaveEndpointTest.NoAuthorizer/1 (31 ms)
[ RUN      ] Endpoint/SlaveEndpointTest.NoAuthorizer/2
I0919 23:04:34.698366  6074 containerizer.cpp:292] Using isolation { environment_secret, posix/cpu,
posix/mem, filesystem/posix, network/cni }
W0919 23:04:34.698827  6074 backend.cpp:76] Failed to create 'aufs' backend: AufsBackend requires
root privileges
W0919 23:04:34.698926  6074 backend.cpp:76] Failed to create 'bind' backend: BindBackend requires
root privileges
I0919 23:04:34.698982  6074 provisioner.cpp:255] Using default backend 'copy'
I0919 23:04:34.700548  6074 cluster.cpp:448] Creating default 'local' authorizer
I0919 23:04:34.702401 25269 slave.cpp:252] Mesos agent started on (822)@172.17.0.3:58041
I0919 23:04:34.702448 25269 slave.cpp:253] Flags at startup: --acls="" --appc_simple_discovery_uri_prefix="http://"
--appc_store_dir="/tmp/Endpoint_SlaveEndpointTest_NoAuthorizer_2_kzU9Wg/store/appc" --authenticate_http_executors="true"
--authenticate_http_readonly="true" --authenticate_http_readwrite="true" --authenticatee="crammd5"
--authentication_backoff_factor="1secs" --authorizer="local" --cgroups_cpu_enable_pids_and_tids_count="false"
--cgroups_enable_cfs="false" --cgroups_hierarchy="/sys/fs/cgroup" --cgroups_limit_swap="false"
--cgroups_root="mesos" --container_disk_watch_interval="15secs" --containerizers="mesos" --credential="/tmp/Endpoint_SlaveEndpointTest_NoAuthorizer_2_kzU9Wg/credential"
--default_role="*" --disallow_sharing_agent_pid_namespace="false" --disk_watch_interval="1mins"
--docker="docker" --docker_kill_orphans="true" --docker_registry="https://registry-1.docker.io"
--docker_remove_delay="6hrs" --docker_socket="/var/run/docker.sock" --docker_stop_timeout="0ns"
--docker_store_dir="/tmp/Endpoint_SlaveEndpointTest_NoAuthorizer_2_kzU9Wg/store/docker" --docker_volume_checkpoint_dir="/var/run/mesos/isolators/docker/volume"
--enforce_container_disk_quota="false" --executor_registration_timeout="1mins" --executor_reregistration_timeout="2secs"
--executor_secret_key="/tmp/Endpoint_SlaveEndpointTest_NoAuthorizer_2_kzU9Wg/executor_secret_key"
--executor_shutdown_grace_period="5secs" --fetcher_cache_dir="/tmp/Endpoint_SlaveEndpointTest_NoAuthorizer_2_kzU9Wg/fetch"
--fetcher_cache_size="2GB" --frameworks_home="" --gc_delay="1weeks" --gc_disk_headroom="0.1"
--hadoop_home="" --help="false" --hostname_lookup="true" --http_command_executor="false" --http_credentials="/tmp/Endpoint_SlaveEndpointTest_NoAuthorizer_2_kzU9Wg/http_credentials"
--http_heartbeat_interval="30secs" --initialize_driver_logging="true" --isolation="posix/cpu,posix/mem"
--launcher="posix" --launcher_dir="/mesos/mesos-1.5.0/_build/src" --logbufsecs="0" --logging_level="INFO"
--max_completed_executors_per_framework="150" --oversubscribed_resources_interval="15secs"
--perf_duration="10secs" --perf_interval="1mins" --port="5051" --qos_correction_interval_min="0ns"
--quiet="false" --recover="reconnect" --recovery_timeout="15mins" --registration_backoff_factor="10ms"
--resources="cpus:2;gpus:0;mem:1024;disk:1024;ports:[31000-32000]" --revocable_cpu_low_priority="true"
--runtime_dir="/tmp/Endpoint_SlaveEndpointTest_NoAuthorizer_2_kzU9Wg" --sandbox_directory="/mnt/mesos/sandbox"
--strict="true" --switch_user="true" --systemd_enable_support="true" --systemd_runtime_directory="/run/systemd/system"
--version="false" --work_dir="/tmp/Endpoint_SlaveEndpointTest_NoAuthorizer_2_mEN3lp" --zk_session_timeout="10secs"
I0919 23:04:34.702913 25269 credentials.hpp:86] Loading credential for authentication from
'/tmp/Endpoint_SlaveEndpointTest_NoAuthorizer_2_kzU9Wg/credential'
I0919 23:04:34.703068 25269 slave.cpp:285] Agent using credential for: test-principal
I0919 23:04:34.703090 25269 credentials.hpp:37] Loading credentials for authentication from
'/tmp/Endpoint_SlaveEndpointTest_NoAuthorizer_2_kzU9Wg/http_credentials'
I0919 23:04:34.703368 25269 http.cpp:1045] Creating default 'basic' HTTP authenticator for
realm 'mesos-agent-executor'
I0919 23:04:34.703485 25269 http.cpp:1066] Creating default 'jwt' HTTP authenticator for realm
'mesos-agent-executor'
I0919 23:04:34.703707 25269 http.cpp:1045] Creating default 'basic' HTTP authenticator for
realm 'mesos-agent-readonly'
I0919 23:04:34.703881 25269 http.cpp:1066] Creating default 'jwt' HTTP authenticator for realm
'mesos-agent-readonly'
I0919 23:04:34.704097 25269 http.cpp:1045] Creating default 'basic' HTTP authenticator for
realm 'mesos-agent-readwrite'
I0919 23:04:34.704222 25269 http.cpp:1066] Creating default 'jwt' HTTP authenticator for realm
'mesos-agent-readwrite'
I0919 23:04:34.705466 25269 slave.cpp:583] Agent resources: [{"name":"cpus","scalar":{"value":2.0},"type":"SCALAR"},{"name":"mem","scalar":{"value":1024.0},"type":"SCALAR"},{"name":"disk","scalar":{"value":1024.0},"type":"SCALAR"},{"name":"ports","ranges":{"range":[{"begin":31000,"end":32000}]},"type":"RANGES"}]
I0919 23:04:34.705687 25269 slave.cpp:591] Agent attributes: [  ]
I0919 23:04:34.705698 25269 slave.cpp:600] Agent hostname: 9dc4f3c7181b
I0919 23:04:34.705816 25274 status_update_manager.cpp:177] Pausing sending status updates
I0919 23:04:34.707329 25283 state.cpp:64] Recovering state from '/tmp/Endpoint_SlaveEndpointTest_NoAuthorizer_2_mEN3lp/meta'
I0919 23:04:34.707679 25271 status_update_manager.cpp:203] Recovering status update manager
I0919 23:04:34.707885 25278 containerizer.cpp:648] Recovering containerizer
I0919 23:04:34.709316 25280 provisioner.cpp:416] Provisioner recovery complete
I0919 23:04:34.709671 25271 slave.cpp:6298] Finished recovery
I0919 23:04:34.710256 25271 slave.cpp:6480] Querying resource estimator for oversubscribable
resources
I0919 23:04:34.710500 25273 slave.cpp:6494] Received oversubscribable resources {} from the
resource estimator
I0919 23:04:34.712365 25269 process.cpp:3929] Handling HTTP event for process 'slave(822)'
with path: '/slave(822)/containers'
I0919 23:04:34.714360 25278 http.cpp:1185] HTTP GET for /slave(822)/containers from 172.17.0.3:57472
I0919 23:04:34.714443 25278 http.cpp:976] Authorizing principal 'test-principal' to GET the
'/containers' endpoint
I0919 23:04:34.718323  6074 slave.cpp:861] Agent terminating
[       OK ] Endpoint/SlaveEndpointTest.NoAuthorizer/2 (33 ms)
[----------] 9 tests from Endpoint/SlaveEndpointTest (308 ms total)

[----------] 2 tests from ContainerizerType/DefaultContainerDNSFlagTest
[ RUN      ] ContainerizerType/DefaultContainerDNSFlagTest.ValidateFlag/0
[       OK ] ContainerizerType/DefaultContainerDNSFlagTest.ValidateFlag/0 (10 ms)
[ RUN      ] ContainerizerType/DefaultContainerDNSFlagTest.ValidateFlag/1
[       OK ] ContainerizerType/DefaultContainerDNSFlagTest.ValidateFlag/1 (9 ms)
[----------] 2 tests from ContainerizerType/DefaultContainerDNSFlagTest (19 ms total)

[----------] Global test environment tear-down
[==========] 1675 tests from 185 test cases ran. (648455 ms total)
[  PASSED  ] 1674 tests.
[  FAILED  ] 1 test, listed below:
[  FAILED  ] SlaveTest.RestartSlaveRequireExecutorAuthentication

 1 FAILED TEST
  YOU HAVE 20 DISABLED TESTS

I0919 23:04:34.807382 25284 process.cpp:1068] Failed to accept socket: future discarded
make[4]: *** [check-local] Error 1
make[4]: Leaving directory `/mesos/mesos-1.5.0/_build/src'
make[3]: *** [check-am] Error 2
make[3]: Leaving directory `/mesos/mesos-1.5.0/_build/src'
make[2]: *** [check] Error 2
make[2]: Leaving directory `/mesos/mesos-1.5.0/_build/src'
make[1]: *** [check-recursive] Error 1
make[1]: Leaving directory `/mesos/mesos-1.5.0/_build'
make: *** [distcheck] Error 1
+ docker rmi mesos-1505858370-19664
Untagged: mesos-1505858370-19664:latest
Deleted: sha256:deafc35bce6f80bd5bb49b8b2525d842a8ce9b13647fec0212a1e69aa724cfb2
Deleted: sha256:acc87d698879383b5e42337b76920d9e3576e550371f4275921d249a26565c19
Deleted: sha256:59456e887387d337eced6acc206b3da4077885f2d51ad9ca2909a9b34737a5be
Deleted: sha256:d0527f4d9754389a763d9ff8a4cd2664537e99cc36fc776d6cdfc3aab43641c1
Deleted: sha256:39bc58a6147570ebca49a558e3231c99e02516330238a38d2ae66ba04a18030d
Deleted: sha256:9f65e3d90a164f7981264b1ddaf62858a68b403e095743f2e4a7a8e51c56c937
Deleted: sha256:37847c3fd65159b4d84d78a91e33ea78cd7ad4d6af78cd861617b1b4afc7813c
Deleted: sha256:e570c38209a2a26eeeec7790da916eeca68ce6bc5b115418792f1aece99303ae
Deleted: sha256:50504855551b71a4e3f95ece7d5ccd8dd9a8b6be1e153b1242652699cc969de1
Deleted: sha256:6deb6de4d300bef455c81a15e9951e5320fadcce784cf2ce7014ee6d1dbb4a89
Deleted: sha256:89d05d69f2ed9f6d77b6c047ea6b2f9d21d9e7fdc98b07b063c064fa5daafcdb
Deleted: sha256:4b752818f57d2565127aa4b9d2c52df59dd335bed43e645f93892db3ff53e507
Deleted: sha256:3e14d4327c3a89e5ba647aad443cf4366f2de58dd3da845c1cca1ad9b0bd0f12
Deleted: sha256:c3a95a439233a9660d3edbc9e65496fcefa9a367e15f49f9af1e2acc84b381db
Deleted: sha256:feca8fb7f1ec122dcdd629caf18c4b75f1cb86fb6d5a81f1278d02be8375e2ba
Deleted: sha256:aa6d7b8b13465d3dffdf6537175d63bf9e8fc2db0b980737debf393d0d024c73
Deleted: sha256:c083ae91d2cf8d9b7d93619d0f70f99bd6420366f7788f1cb291c74475432c9d
Deleted: sha256:6b28b7cd5457812d68a0c02752a4eaa39b01981ea0ab23165e3f1e5ac90ba2aa
Deleted: sha256:66f521a44736e2e128a79d81dc7f847235d926151d075dc4b2d4c3c9c6e35fcf
Deleted: sha256:b02b76898e5370a0654af65df1a5803c3ca86046e6aa107d368c5d5e9f484ac6
Deleted: sha256:2ecfef5418256adfbd664104929152bd903c3bb5d3e0efcfc3ae675e91f9c6c5
Deleted: sha256:edb74a487c37c3d9ba2a42b6ae0d4e78a435ba9ee57782d127b8fc77bfb260cb
Deleted: sha256:052a8dcb2240bc2f5a414db349592e01bb96cb1989fba0cd6a886a12fd43cba3
Deleted: sha256:c2bee6eb205961e6e8defed98a81236420e337a32b41fb5622d006845ce0f2fc
Deleted: sha256:07e6e333971e2d03d17ad3064936ceef48c94a469da7674fb5fbc21c0a3dbbcc
Deleted: sha256:a73d5e23f568ac5a303898f4d1d1496794c882914b5c8e96fc514658068e909f
Deleted: sha256:624c0878acfa50f30f44e15a8fe3d94204df56d4c806aa024e0070b77b95a29f
Deleted: sha256:ff648db56f0a57cd8633e762aba7ff4ce4a42084c90c83c9dafc4a5acb6ff31e
Build step 'Execute shell' marked build as failure
Not sending mail to unregistered user yujie.jay@gmail.com

Mime
View raw message