mesos-builds mailing list archives

Site index · List index
Message view « Date » · « Thread »
Top « Date » · « Thread »
From Apache Jenkins Server <jenk...@builds.apache.org>
Subject Build failed in Jenkins: Mesos-Buildbot » autotools,gcc,--verbose,GLOG_v=1 MESOS_VERBOSE=1,ubuntu:14.04,(ubuntu)&&(!ubuntu-us1)&&(!ubuntu-eu2)&&(!qnode3)&&(!H23) #4262
Date Tue, 26 Sep 2017 14:38:30 GMT
See <https://builds.apache.org/job/Mesos-Buildbot/BUILDTOOL=autotools,COMPILER=gcc,CONFIGURATION=--verbose,ENVIRONMENT=GLOG_v=1%20MESOS_VERBOSE=1,OS=ubuntu%3A14.04,label_exp=(ubuntu)&&(!ubuntu-us1)&&(!ubuntu-eu2)&&(!qnode3)&&(!H23)/4262/display/redirect?page=changes>

Changes:

[klueska] Added constants for the Mesos CLI.

------------------------------------------
[...truncated 31.77 MB...]
I0926 14:38:21.777344  5793 http.cpp:1045] Creating default 'basic' HTTP authenticator for
realm 'mesos-agent-readonly'
I0926 14:38:21.777624  5793 http.cpp:1045] Creating default 'basic' HTTP authenticator for
realm 'mesos-agent-readwrite'
I0926 14:38:21.779528  5793 slave.cpp:585] Agent resources: [{"name":"cpus","scalar":{"value":2.0},"type":"SCALAR"},{"name":"mem","scalar":{"value":1024.0},"type":"SCALAR"},{"name":"disk","scalar":{"value":1024.0},"type":"SCALAR"},{"name":"ports","ranges":{"range":[{"begin":31000,"end":32000}]},"type":"RANGES"}]
I0926 14:38:21.779858  5793 slave.cpp:593] Agent attributes: [  ]
I0926 14:38:21.779876  5793 slave.cpp:602] Agent hostname: 8d0a1d056b39
I0926 14:38:21.780071  5802 status_update_manager.cpp:177] Pausing sending status updates
I0926 14:38:21.781911  5811 state.cpp:64] Recovering state from '/tmp/Endpoint_SlaveEndpointTest_AuthorizedRequest_2_NWLObt/meta'
I0926 14:38:21.782227  5799 status_update_manager.cpp:203] Recovering status update manager
I0926 14:38:21.782426  5810 containerizer.cpp:648] Recovering containerizer
I0926 14:38:21.783820  5791 provisioner.cpp:416] Provisioner recovery complete
I0926 14:38:21.784231  5807 slave.cpp:6322] Finished recovery
I0926 14:38:21.784761  5807 slave.cpp:6504] Querying resource estimator for oversubscribable
resources
I0926 14:38:21.785032  5805 slave.cpp:6518] Received oversubscribable resources {} from the
resource estimator
I0926 14:38:21.787696  5810 process.cpp:3929] Handling HTTP event for process 'slave(811)'
with path: '/slave(811)/containers'
I0926 14:38:21.789465  5800 http.cpp:1185] HTTP GET for /slave(811)/containers from 172.17.0.3:35290
I0926 14:38:21.789548  5800 http.cpp:976] Authorizing principal 'test-principal' to GET the
'/containers' endpoint
I0926 14:38:21.793210  5795 slave.cpp:869] Agent terminating
[       OK ] Endpoint/SlaveEndpointTest.AuthorizedRequest/2 (38 ms)
[ RUN      ] Endpoint/SlaveEndpointTest.UnauthorizedRequest/0
I0926 14:38:21.808879  5772 containerizer.cpp:292] Using isolation { environment_secret, posix/cpu,
posix/mem, filesystem/posix, network/cni }
W0926 14:38:21.809545  5772 backend.cpp:76] Failed to create 'aufs' backend: AufsBackend requires
root privileges
W0926 14:38:21.809664  5772 backend.cpp:76] Failed to create 'bind' backend: BindBackend requires
root privileges
I0926 14:38:21.809702  5772 provisioner.cpp:255] Using default backend 'copy'
I0926 14:38:21.814111  5814 slave.cpp:254] Mesos agent started on (812)@172.17.0.3:39015
I0926 14:38:21.814151  5814 slave.cpp:255] Flags at startup: --acls="" --appc_simple_discovery_uri_prefix="http://"
--appc_store_dir="/tmp/Endpoint_SlaveEndpointTest_UnauthorizedRequest_0_f6p010/store/appc"
--authenticate_http_readonly="true" --authenticate_http_readwrite="true" --authenticatee="crammd5"
--authentication_backoff_factor="1secs" --authorizer="local" --cgroups_cpu_enable_pids_and_tids_count="false"
--cgroups_enable_cfs="false" --cgroups_hierarchy="/sys/fs/cgroup" --cgroups_limit_swap="false"
--cgroups_root="mesos" --container_disk_watch_interval="15secs" --containerizers="mesos" --credential="/tmp/Endpoint_SlaveEndpointTest_UnauthorizedRequest_0_f6p010/credential"
--default_role="*" --disallow_sharing_agent_pid_namespace="false" --disk_watch_interval="1mins"
--docker="docker" --docker_kill_orphans="true" --docker_registry="https://registry-1.docker.io"
--docker_remove_delay="6hrs" --docker_socket="/var/run/docker.sock" --docker_stop_timeout="0ns"
--docker_store_dir="/tmp/Endpoint_SlaveEndpointTest_UnauthorizedRequest_0_f6p010/store/docker"
--docker_volume_checkpoint_dir="/var/run/mesos/isolators/docker/volume" --enforce_container_disk_quota="false"
--executor_registration_timeout="1mins" --executor_reregistration_timeout="2secs" --executor_shutdown_grace_period="5secs"
--fetcher_cache_dir="/tmp/Endpoint_SlaveEndpointTest_UnauthorizedRequest_0_f6p010/fetch" --fetcher_cache_size="2GB"
--frameworks_home="" --gc_delay="1weeks" --gc_disk_headroom="0.1" --hadoop_home="" --help="false"
--hostname_lookup="true" --http_command_executor="false" --http_credentials="/tmp/Endpoint_SlaveEndpointTest_UnauthorizedRequest_0_f6p010/http_credentials"
--http_heartbeat_interval="30secs" --initialize_driver_logging="true" --isolation="posix/cpu,posix/mem"
--launcher="posix" --launcher_dir="/mesos/mesos-1.5.0/_build/src" --logbufsecs="0" --logging_level="INFO"
--max_completed_executors_per_framework="150" --oversubscribed_resources_interval="15secs"
--perf_duration="10secs" --perf_interval="1mins" --port="5051" --qos_correction_interval_min="0ns"
--quiet="false" --recover="reconnect" --recovery_timeout="15mins" --registration_backoff_factor="10ms"
--resources="cpus:2;gpus:0;mem:1024;disk:1024;ports:[31000-32000]" --revocable_cpu_low_priority="true"
--runtime_dir="/tmp/Endpoint_SlaveEndpointTest_UnauthorizedRequest_0_f6p010" --sandbox_directory="/mnt/mesos/sandbox"
--strict="true" --switch_user="true" --systemd_enable_support="true" --systemd_runtime_directory="/run/systemd/system"
--version="false" --work_dir="/tmp/Endpoint_SlaveEndpointTest_UnauthorizedRequest_0_hKDjD6"
--zk_session_timeout="10secs"
I0926 14:38:21.814646  5814 credentials.hpp:86] Loading credential for authentication from
'/tmp/Endpoint_SlaveEndpointTest_UnauthorizedRequest_0_f6p010/credential'
I0926 14:38:21.814862  5814 slave.cpp:287] Agent using credential for: test-principal
I0926 14:38:21.814887  5814 credentials.hpp:37] Loading credentials for authentication from
'/tmp/Endpoint_SlaveEndpointTest_UnauthorizedRequest_0_f6p010/http_credentials'
I0926 14:38:21.815166  5814 http.cpp:1045] Creating default 'basic' HTTP authenticator for
realm 'mesos-agent-readonly'
I0926 14:38:21.815349  5814 http.cpp:1045] Creating default 'basic' HTTP authenticator for
realm 'mesos-agent-readwrite'
I0926 14:38:21.816953  5814 slave.cpp:585] Agent resources: [{"name":"cpus","scalar":{"value":2.0},"type":"SCALAR"},{"name":"mem","scalar":{"value":1024.0},"type":"SCALAR"},{"name":"disk","scalar":{"value":1024.0},"type":"SCALAR"},{"name":"ports","ranges":{"range":[{"begin":31000,"end":32000}]},"type":"RANGES"}]
I0926 14:38:21.817318  5814 slave.cpp:593] Agent attributes: [  ]
I0926 14:38:21.817350  5814 slave.cpp:602] Agent hostname: 8d0a1d056b39
I0926 14:38:21.817598  5796 status_update_manager.cpp:177] Pausing sending status updates
I0926 14:38:21.820135  5814 state.cpp:64] Recovering state from '/tmp/Endpoint_SlaveEndpointTest_UnauthorizedRequest_0_hKDjD6/meta'
I0926 14:38:21.820647  5814 status_update_manager.cpp:203] Recovering status update manager
I0926 14:38:21.820855  5795 containerizer.cpp:648] Recovering containerizer
I0926 14:38:21.822526  5804 provisioner.cpp:416] Provisioner recovery complete
I0926 14:38:21.823148  5796 slave.cpp:6322] Finished recovery
I0926 14:38:21.823884  5796 slave.cpp:6504] Querying resource estimator for oversubscribable
resources
I0926 14:38:21.824393  5812 slave.cpp:6518] Received oversubscribable resources {} from the
resource estimator
I0926 14:38:21.827417  5791 process.cpp:3929] Handling HTTP event for process 'slave(812)'
with path: '/slave(812)/monitor/statistics'
I0926 14:38:21.828725  5798 http.cpp:1185] HTTP GET for /slave(812)/monitor/statistics from
172.17.0.3:35292
I0926 14:38:21.828804  5798 http.cpp:976] Authorizing principal 'test-principal' to GET the
'/monitor/statistics' endpoint
I0926 14:38:21.831503  5807 slave.cpp:869] Agent terminating
[       OK ] Endpoint/SlaveEndpointTest.UnauthorizedRequest/0 (35 ms)
[ RUN      ] Endpoint/SlaveEndpointTest.UnauthorizedRequest/1
I0926 14:38:21.843538  5772 containerizer.cpp:292] Using isolation { environment_secret, posix/cpu,
posix/mem, filesystem/posix, network/cni }
W0926 14:38:21.844080  5772 backend.cpp:76] Failed to create 'aufs' backend: AufsBackend requires
root privileges
W0926 14:38:21.844197  5772 backend.cpp:76] Failed to create 'bind' backend: BindBackend requires
root privileges
I0926 14:38:21.844229  5772 provisioner.cpp:255] Using default backend 'copy'
I0926 14:38:21.847793  5796 slave.cpp:254] Mesos agent started on (813)@172.17.0.3:39015
I0926 14:38:21.847818  5796 slave.cpp:255] Flags at startup: --acls="" --appc_simple_discovery_uri_prefix="http://"
--appc_store_dir="/tmp/Endpoint_SlaveEndpointTest_UnauthorizedRequest_1_wfwKUE/store/appc"
--authenticate_http_readonly="true" --authenticate_http_readwrite="true" --authenticatee="crammd5"
--authentication_backoff_factor="1secs" --authorizer="local" --cgroups_cpu_enable_pids_and_tids_count="false"
--cgroups_enable_cfs="false" --cgroups_hierarchy="/sys/fs/cgroup" --cgroups_limit_swap="false"
--cgroups_root="mesos" --container_disk_watch_interval="15secs" --containerizers="mesos" --credential="/tmp/Endpoint_SlaveEndpointTest_UnauthorizedRequest_1_wfwKUE/credential"
--default_role="*" --disallow_sharing_agent_pid_namespace="false" --disk_watch_interval="1mins"
--docker="docker" --docker_kill_orphans="true" --docker_registry="https://registry-1.docker.io"
--docker_remove_delay="6hrs" --docker_socket="/var/run/docker.sock" --docker_stop_timeout="0ns"
--docker_store_dir="/tmp/Endpoint_SlaveEndpointTest_UnauthorizedRequest_1_wfwKUE/store/docker"
--docker_volume_checkpoint_dir="/var/run/mesos/isolators/docker/volume" --enforce_container_disk_quota="false"
--executor_registration_timeout="1mins" --executor_reregistration_timeout="2secs" --executor_shutdown_grace_period="5secs"
--fetcher_cache_dir="/tmp/Endpoint_SlaveEndpointTest_UnauthorizedRequest_1_wfwKUE/fetch" --fetcher_cache_size="2GB"
--frameworks_home="" --gc_delay="1weeks" --gc_disk_headroom="0.1" --hadoop_home="" --help="false"
--hostname_lookup="true" --http_command_executor="false" --http_credentials="/tmp/Endpoint_SlaveEndpointTest_UnauthorizedRequest_1_wfwKUE/http_credentials"
--http_heartbeat_interval="30secs" --initialize_driver_logging="true" --isolation="posix/cpu,posix/mem"
--launcher="posix" --launcher_dir="/mesos/mesos-1.5.0/_build/src" --logbufsecs="0" --logging_level="INFO"
--max_completed_executors_per_framework="150" --oversubscribed_resources_interval="15secs"
--perf_duration="10secs" --perf_interval="1mins" --port="5051" --qos_correction_interval_min="0ns"
--quiet="false" --recover="reconnect" --recovery_timeout="15mins" --registration_backoff_factor="10ms"
--resources="cpus:2;gpus:0;mem:1024;disk:1024;ports:[31000-32000]" --revocable_cpu_low_priority="true"
--runtime_dir="/tmp/Endpoint_SlaveEndpointTest_UnauthorizedRequest_1_wfwKUE" --sandbox_directory="/mnt/mesos/sandbox"
--strict="true" --switch_user="true" --systemd_enable_support="true" --systemd_runtime_directory="/run/systemd/system"
--version="false" --work_dir="/tmp/Endpoint_SlaveEndpointTest_UnauthorizedRequest_1_jcGQqK"
--zk_session_timeout="10secs"
I0926 14:38:21.848418  5796 credentials.hpp:86] Loading credential for authentication from
'/tmp/Endpoint_SlaveEndpointTest_UnauthorizedRequest_1_wfwKUE/credential'
I0926 14:38:21.848635  5796 slave.cpp:287] Agent using credential for: test-principal
I0926 14:38:21.848655  5796 credentials.hpp:37] Loading credentials for authentication from
'/tmp/Endpoint_SlaveEndpointTest_UnauthorizedRequest_1_wfwKUE/http_credentials'
I0926 14:38:21.848958  5796 http.cpp:1045] Creating default 'basic' HTTP authenticator for
realm 'mesos-agent-readonly'
I0926 14:38:21.849195  5796 http.cpp:1045] Creating default 'basic' HTTP authenticator for
realm 'mesos-agent-readwrite'
I0926 14:38:21.851006  5796 slave.cpp:585] Agent resources: [{"name":"cpus","scalar":{"value":2.0},"type":"SCALAR"},{"name":"mem","scalar":{"value":1024.0},"type":"SCALAR"},{"name":"disk","scalar":{"value":1024.0},"type":"SCALAR"},{"name":"ports","ranges":{"range":[{"begin":31000,"end":32000}]},"type":"RANGES"}]
I0926 14:38:21.851302  5796 slave.cpp:593] Agent attributes: [  ]
I0926 14:38:21.851325  5796 slave.cpp:602] Agent hostname: 8d0a1d056b39
I0926 14:38:21.851513  5809 status_update_manager.cpp:177] Pausing sending status updates
I0926 14:38:21.853684  5814 state.cpp:64] Recovering state from '/tmp/Endpoint_SlaveEndpointTest_UnauthorizedRequest_1_jcGQqK/meta'
I0926 14:38:21.853999  5812 status_update_manager.cpp:203] Recovering status update manager
I0926 14:38:21.854183  5812 containerizer.cpp:648] Recovering containerizer
I0926 14:38:21.855607  5803 provisioner.cpp:416] Provisioner recovery complete
I0926 14:38:21.856016  5792 slave.cpp:6322] Finished recovery
I0926 14:38:21.856482  5792 slave.cpp:6504] Querying resource estimator for oversubscribable
resources
I0926 14:38:21.856781  5808 slave.cpp:6518] Received oversubscribable resources {} from the
resource estimator
I0926 14:38:21.859582  5805 process.cpp:3929] Handling HTTP event for process 'slave(813)'
with path: '/slave(813)/monitor/statistics.json'
I0926 14:38:21.861003  5803 http.cpp:1185] HTTP GET for /slave(813)/monitor/statistics.json
from 172.17.0.3:35300
I0926 14:38:21.861081  5803 http.cpp:976] Authorizing principal 'test-principal' to GET the
'/monitor/statistics.json' endpoint
I0926 14:38:21.863270  5800 slave.cpp:869] Agent terminating
[       OK ] Endpoint/SlaveEndpointTest.UnauthorizedRequest/1 (31 ms)
[ RUN      ] Endpoint/SlaveEndpointTest.UnauthorizedRequest/2
I0926 14:38:21.874182  5772 containerizer.cpp:292] Using isolation { environment_secret, posix/cpu,
posix/mem, filesystem/posix, network/cni }
W0926 14:38:21.874665  5772 backend.cpp:76] Failed to create 'aufs' backend: AufsBackend requires
root privileges
W0926 14:38:21.874779  5772 backend.cpp:76] Failed to create 'bind' backend: BindBackend requires
root privileges
I0926 14:38:21.874821  5772 provisioner.cpp:255] Using default backend 'copy'
I0926 14:38:21.878864  5795 slave.cpp:254] Mesos agent started on (814)@172.17.0.3:39015
I0926 14:38:21.878897  5795 slave.cpp:255] Flags at startup: --acls="" --appc_simple_discovery_uri_prefix="http://"
--appc_store_dir="/tmp/Endpoint_SlaveEndpointTest_UnauthorizedRequest_2_Pxah6i/store/appc"
--authenticate_http_readonly="true" --authenticate_http_readwrite="true" --authenticatee="crammd5"
--authentication_backoff_factor="1secs" --authorizer="local" --cgroups_cpu_enable_pids_and_tids_count="false"
--cgroups_enable_cfs="false" --cgroups_hierarchy="/sys/fs/cgroup" --cgroups_limit_swap="false"
--cgroups_root="mesos" --container_disk_watch_interval="15secs" --containerizers="mesos" --credential="/tmp/Endpoint_SlaveEndpointTest_UnauthorizedRequest_2_Pxah6i/credential"
--default_role="*" --disallow_sharing_agent_pid_namespace="false" --disk_watch_interval="1mins"
--docker="docker" --docker_kill_orphans="true" --docker_registry="https://registry-1.docker.io"
--docker_remove_delay="6hrs" --docker_socket="/var/run/docker.sock" --docker_stop_timeout="0ns"
--docker_store_dir="/tmp/Endpoint_SlaveEndpointTest_UnauthorizedRequest_2_Pxah6i/store/docker"
--docker_volume_checkpoint_dir="/var/run/mesos/isolators/docker/volume" --enforce_container_disk_quota="false"
--executor_registration_timeout="1mins" --executor_reregistration_timeout="2secs" --executor_shutdown_grace_period="5secs"
--fetcher_cache_dir="/tmp/Endpoint_SlaveEndpointTest_UnauthorizedRequest_2_Pxah6i/fetch" --fetcher_cache_size="2GB"
--frameworks_home="" --gc_delay="1weeks" --gc_disk_headroom="0.1" --hadoop_home="" --help="false"
--hostname_lookup="true" --http_command_executor="false" --http_credentials="/tmp/Endpoint_SlaveEndpointTest_UnauthorizedRequest_2_Pxah6i/http_credentials"
--http_heartbeat_interval="30secs" --initialize_driver_logging="true" --isolation="posix/cpu,posix/mem"
--launcher="posix" --launcher_dir="/mesos/mesos-1.5.0/_build/src" --logbufsecs="0" --logging_level="INFO"
--max_completed_executors_per_framework="150" --oversubscribed_resources_interval="15secs"
--perf_duration="10secs" --perf_interval="1mins" --port="5051" --qos_correction_interval_min="0ns"
--quiet="false" --recover="reconnect" --recovery_timeout="15mins" --registration_backoff_factor="10ms"
--resources="cpus:2;gpus:0;mem:1024;disk:1024;ports:[31000-32000]" --revocable_cpu_low_priority="true"
--runtime_dir="/tmp/Endpoint_SlaveEndpointTest_UnauthorizedRequest_2_Pxah6i" --sandbox_directory="/mnt/mesos/sandbox"
--strict="true" --switch_user="true" --systemd_enable_support="true" --systemd_runtime_directory="/run/systemd/system"
--version="false" --work_dir="/tmp/Endpoint_SlaveEndpointTest_UnauthorizedRequest_2_XiSJxo"
--zk_session_timeout="10secs"
I0926 14:38:21.879312  5795 credentials.hpp:86] Loading credential for authentication from
'/tmp/Endpoint_SlaveEndpointTest_UnauthorizedRequest_2_Pxah6i/credential'
I0926 14:38:21.879487  5795 slave.cpp:287] Agent using credential for: test-principal
I0926 14:38:21.879521  5795 credentials.hpp:37] Loading credentials for authentication from
'/tmp/Endpoint_SlaveEndpointTest_UnauthorizedRequest_2_Pxah6i/http_credentials'
I0926 14:38:21.879734  5795 http.cpp:1045] Creating default 'basic' HTTP authenticator for
realm 'mesos-agent-readonly'
I0926 14:38:21.879907  5795 http.cpp:1045] Creating default 'basic' HTTP authenticator for
realm 'mesos-agent-readwrite'
I0926 14:38:21.881131  5795 slave.cpp:585] Agent resources: [{"name":"cpus","scalar":{"value":2.0},"type":"SCALAR"},{"name":"mem","scalar":{"value":1024.0},"type":"SCALAR"},{"name":"disk","scalar":{"value":1024.0},"type":"SCALAR"},{"name":"ports","ranges":{"range":[{"begin":31000,"end":32000}]},"type":"RANGES"}]
I0926 14:38:21.881340  5795 slave.cpp:593] Agent attributes: [  ]
I0926 14:38:21.881353  5795 slave.cpp:602] Agent hostname: 8d0a1d056b39
I0926 14:38:21.881516  5793 status_update_manager.cpp:177] Pausing sending status updates
I0926 14:38:21.882901  5805 state.cpp:64] Recovering state from '/tmp/Endpoint_SlaveEndpointTest_UnauthorizedRequest_2_XiSJxo/meta'
I0926 14:38:21.883298  5798 status_update_manager.cpp:203] Recovering status update manager
I0926 14:38:21.883503  5800 containerizer.cpp:648] Recovering containerizer
I0926 14:38:21.884793  5802 provisioner.cpp:416] Provisioner recovery complete
I0926 14:38:21.885067  5813 slave.cpp:6322] Finished recovery
I0926 14:38:21.885457  5813 slave.cpp:6504] Querying resource estimator for oversubscribable
resources
I0926 14:38:21.885715  5810 slave.cpp:6518] Received oversubscribable resources {} from the
resource estimator
I0926 14:38:21.888280  5792 process.cpp:3929] Handling HTTP event for process 'slave(814)'
with path: '/slave(814)/containers'
I0926 14:38:21.889336  5807 http.cpp:1185] HTTP GET for /slave(814)/containers from 172.17.0.3:35306
I0926 14:38:21.889400  5807 http.cpp:976] Authorizing principal 'test-principal' to GET the
'/containers' endpoint
I0926 14:38:21.891055  5797 slave.cpp:869] Agent terminating
[       OK ] Endpoint/SlaveEndpointTest.UnauthorizedRequest/2 (27 ms)
[ RUN      ] Endpoint/SlaveEndpointTest.NoAuthorizer/0
I0926 14:38:21.902678  5772 containerizer.cpp:292] Using isolation { environment_secret, posix/cpu,
posix/mem, filesystem/posix, network/cni }
W0926 14:38:21.903235  5772 backend.cpp:76] Failed to create 'aufs' backend: AufsBackend requires
root privileges
W0926 14:38:21.903359  5772 backend.cpp:76] Failed to create 'bind' backend: BindBackend requires
root privileges
I0926 14:38:21.903400  5772 provisioner.cpp:255] Using default backend 'copy'
I0926 14:38:21.905179  5772 cluster.cpp:448] Creating default 'local' authorizer
I0926 14:38:21.907229  5801 slave.cpp:254] Mesos agent started on (815)@172.17.0.3:39015
I0926 14:38:21.907251  5801 slave.cpp:255] Flags at startup: --acls="" --appc_simple_discovery_uri_prefix="http://"
--appc_store_dir="/tmp/Endpoint_SlaveEndpointTest_NoAuthorizer_0_yaQxyX/store/appc" --authenticate_http_readonly="true"
--authenticate_http_readwrite="true" --authenticatee="crammd5" --authentication_backoff_factor="1secs"
--authorizer="local" --cgroups_cpu_enable_pids_and_tids_count="false" --cgroups_enable_cfs="false"
--cgroups_hierarchy="/sys/fs/cgroup" --cgroups_limit_swap="false" --cgroups_root="mesos" --container_disk_watch_interval="15secs"
--containerizers="mesos" --credential="/tmp/Endpoint_SlaveEndpointTest_NoAuthorizer_0_yaQxyX/credential"
--default_role="*" --disallow_sharing_agent_pid_namespace="false" --disk_watch_interval="1mins"
--docker="docker" --docker_kill_orphans="true" --docker_registry="https://registry-1.docker.io"
--docker_remove_delay="6hrs" --docker_socket="/var/run/docker.sock" --docker_stop_timeout="0ns"
--docker_store_dir="/tmp/Endpoint_SlaveEndpointTest_NoAuthorizer_0_yaQxyX/store/docker" --docker_volume_checkpoint_dir="/var/run/mesos/isolators/docker/volume"
--enforce_container_disk_quota="false" --executor_registration_timeout="1mins" --executor_reregistration_timeout="2secs"
--executor_shutdown_grace_period="5secs" --fetcher_cache_dir="/tmp/Endpoint_SlaveEndpointTest_NoAuthorizer_0_yaQxyX/fetch"
--fetcher_cache_size="2GB" --frameworks_home="" --gc_delay="1weeks" --gc_disk_headroom="0.1"
--hadoop_home="" --help="false" --hostname_lookup="true" --http_command_executor="false" --http_credentials="/tmp/Endpoint_SlaveEndpointTest_NoAuthorizer_0_yaQxyX/http_credentials"
--http_heartbeat_interval="30secs" --initialize_driver_logging="true" --isolation="posix/cpu,posix/mem"
--launcher="posix" --launcher_dir="/mesos/mesos-1.5.0/_build/src" --logbufsecs="0" --logging_level="INFO"
--max_completed_executors_per_framework="150" --oversubscribed_resources_interval="15secs"
--perf_duration="10secs" --perf_interval="1mins" --port="5051" --qos_correction_interval_min="0ns"
--quiet="false" --recover="reconnect" --recovery_timeout="15mins" --registration_backoff_factor="10ms"
--resources="cpus:2;gpus:0;mem:1024;disk:1024;ports:[31000-32000]" --revocable_cpu_low_priority="true"
--runtime_dir="/tmp/Endpoint_SlaveEndpointTest_NoAuthorizer_0_yaQxyX" --sandbox_directory="/mnt/mesos/sandbox"
--strict="true" --switch_user="true" --systemd_enable_support="true" --systemd_runtime_directory="/run/systemd/system"
--version="false" --work_dir="/tmp/Endpoint_SlaveEndpointTest_NoAuthorizer_0_85VQV2" --zk_session_timeout="10secs"
I0926 14:38:21.907673  5801 credentials.hpp:86] Loading credential for authentication from
'/tmp/Endpoint_SlaveEndpointTest_NoAuthorizer_0_yaQxyX/credential'
I0926 14:38:21.907901  5801 slave.cpp:287] Agent using credential for: test-principal
I0926 14:38:21.907925  5801 credentials.hpp:37] Loading credentials for authentication from
'/tmp/Endpoint_SlaveEndpointTest_NoAuthorizer_0_yaQxyX/http_credentials'
I0926 14:38:21.908180  5801 http.cpp:1045] Creating default 'basic' HTTP authenticator for
realm 'mesos-agent-readonly'
I0926 14:38:21.908367  5801 http.cpp:1045] Creating default 'basic' HTTP authenticator for
realm 'mesos-agent-readwrite'
I0926 14:38:21.909766  5801 slave.cpp:585] Agent resources: [{"name":"cpus","scalar":{"value":2.0},"type":"SCALAR"},{"name":"mem","scalar":{"value":1024.0},"type":"SCALAR"},{"name":"disk","scalar":{"value":1024.0},"type":"SCALAR"},{"name":"ports","ranges":{"range":[{"begin":31000,"end":32000}]},"type":"RANGES"}]
I0926 14:38:21.909999  5801 slave.cpp:593] Agent attributes: [  ]
I0926 14:38:21.910014  5801 slave.cpp:602] Agent hostname: 8d0a1d056b39
I0926 14:38:21.910161  5792 status_update_manager.cpp:177] Pausing sending status updates
I0926 14:38:21.911615  5805 state.cpp:64] Recovering state from '/tmp/Endpoint_SlaveEndpointTest_NoAuthorizer_0_85VQV2/meta'
I0926 14:38:21.911902  5797 status_update_manager.cpp:203] Recovering status update manager
I0926 14:38:21.912076  5802 containerizer.cpp:648] Recovering containerizer
I0926 14:38:21.913646  5803 provisioner.cpp:416] Provisioner recovery complete
I0926 14:38:21.914012  5800 slave.cpp:6322] Finished recovery
I0926 14:38:21.914690  5800 slave.cpp:6504] Querying resource estimator for oversubscribable
resources
I0926 14:38:21.914988  5805 slave.cpp:6518] Received oversubscribable resources {} from the
resource estimator
I0926 14:38:21.917179  5793 process.cpp:3929] Handling HTTP event for process 'slave(815)'
with path: '/slave(815)/monitor/statistics'
I0926 14:38:21.918624  5804 http.cpp:1185] HTTP GET for /slave(815)/monitor/statistics from
172.17.0.3:35308
I0926 14:38:21.918747  5804 http.cpp:976] Authorizing principal 'test-principal' to GET the
'/monitor/statistics' endpoint
I0926 14:38:21.921696  5772 slave.cpp:869] Agent terminating
[       OK ] Endpoint/SlaveEndpointTest.NoAuthorizer/0 (31 ms)
[ RUN      ] Endpoint/SlaveEndpointTest.NoAuthorizer/1
I0926 14:38:21.934252  5772 containerizer.cpp:292] Using isolation { environment_secret, posix/cpu,
posix/mem, filesystem/posix, network/cni }
W0926 14:38:21.934798  5772 backend.cpp:76] Failed to create 'aufs' backend: AufsBackend requires
root privileges
W0926 14:38:21.934904  5772 backend.cpp:76] Failed to create 'bind' backend: BindBackend requires
root privileges
I0926 14:38:21.934947  5772 provisioner.cpp:255] Using default backend 'copy'
I0926 14:38:21.936708  5772 cluster.cpp:448] Creating default 'local' authorizer
I0926 14:38:21.939304  5797 slave.cpp:254] Mesos agent started on (816)@172.17.0.3:39015
I0926 14:38:21.939327  5797 slave.cpp:255] Flags at startup: --acls="" --appc_simple_discovery_uri_prefix="http://"
--appc_store_dir="/tmp/Endpoint_SlaveEndpointTest_NoAuthorizer_1_x3JcjC/store/appc" --authenticate_http_readonly="true"
--authenticate_http_readwrite="true" --authenticatee="crammd5" --authentication_backoff_factor="1secs"
--authorizer="local" --cgroups_cpu_enable_pids_and_tids_count="false" --cgroups_enable_cfs="false"
--cgroups_hierarchy="/sys/fs/cgroup" --cgroups_limit_swap="false" --cgroups_root="mesos" --container_disk_watch_interval="15secs"
--containerizers="mesos" --credential="/tmp/Endpoint_SlaveEndpointTest_NoAuthorizer_1_x3JcjC/credential"
--default_role="*" --disallow_sharing_agent_pid_namespace="false" --disk_watch_interval="1mins"
--docker="docker" --docker_kill_orphans="true" --docker_registry="https://registry-1.docker.io"
--docker_remove_delay="6hrs" --docker_socket="/var/run/docker.sock" --docker_stop_timeout="0ns"
--docker_store_dir="/tmp/Endpoint_SlaveEndpointTest_NoAuthorizer_1_x3JcjC/store/docker" --docker_volume_checkpoint_dir="/var/run/mesos/isolators/docker/volume"
--enforce_container_disk_quota="false" --executor_registration_timeout="1mins" --executor_reregistration_timeout="2secs"
--executor_shutdown_grace_period="5secs" --fetcher_cache_dir="/tmp/Endpoint_SlaveEndpointTest_NoAuthorizer_1_x3JcjC/fetch"
--fetcher_cache_size="2GB" --frameworks_home="" --gc_delay="1weeks" --gc_disk_headroom="0.1"
--hadoop_home="" --help="false" --hostname_lookup="true" --http_command_executor="false" --http_credentials="/tmp/Endpoint_SlaveEndpointTest_NoAuthorizer_1_x3JcjC/http_credentials"
--http_heartbeat_interval="30secs" --initialize_driver_logging="true" --isolation="posix/cpu,posix/mem"
--launcher="posix" --launcher_dir="/mesos/mesos-1.5.0/_build/src" --logbufsecs="0" --logging_level="INFO"
--max_completed_executors_per_framework="150" --oversubscribed_resources_interval="15secs"
--perf_duration="10secs" --perf_interval="1mins" --port="5051" --qos_correction_interval_min="0ns"
--quiet="false" --recover="reconnect" --recovery_timeout="15mins" --registration_backoff_factor="10ms"
--resources="cpus:2;gpus:0;mem:1024;disk:1024;ports:[31000-32000]" --revocable_cpu_low_priority="true"
--runtime_dir="/tmp/Endpoint_SlaveEndpointTest_NoAuthorizer_1_x3JcjC" --sandbox_directory="/mnt/mesos/sandbox"
--strict="true" --switch_user="true" --systemd_enable_support="true" --systemd_runtime_directory="/run/systemd/system"
--version="false" --work_dir="/tmp/Endpoint_SlaveEndpointTest_NoAuthorizer_1_7vsPBH" --zk_session_timeout="10secs"
I0926 14:38:21.939730  5797 credentials.hpp:86] Loading credential for authentication from
'/tmp/Endpoint_SlaveEndpointTest_NoAuthorizer_1_x3JcjC/credential'
I0926 14:38:21.939884  5797 slave.cpp:287] Agent using credential for: test-principal
I0926 14:38:21.939905  5797 credentials.hpp:37] Loading credentials for authentication from
'/tmp/Endpoint_SlaveEndpointTest_NoAuthorizer_1_x3JcjC/http_credentials'
I0926 14:38:21.940160  5797 http.cpp:1045] Creating default 'basic' HTTP authenticator for
realm 'mesos-agent-readonly'
I0926 14:38:21.940400  5797 http.cpp:1045] Creating default 'basic' HTTP authenticator for
realm 'mesos-agent-readwrite'
I0926 14:38:21.941690  5797 slave.cpp:585] Agent resources: [{"name":"cpus","scalar":{"value":2.0},"type":"SCALAR"},{"name":"mem","scalar":{"value":1024.0},"type":"SCALAR"},{"name":"disk","scalar":{"value":1024.0},"type":"SCALAR"},{"name":"ports","ranges":{"range":[{"begin":31000,"end":32000}]},"type":"RANGES"}]
I0926 14:38:21.941901  5797 slave.cpp:593] Agent attributes: [  ]
I0926 14:38:21.941915  5797 slave.cpp:602] Agent hostname: 8d0a1d056b39
I0926 14:38:21.942158  5811 status_update_manager.cpp:177] Pausing sending status updates
I0926 14:38:21.943437  5796 state.cpp:64] Recovering state from '/tmp/Endpoint_SlaveEndpointTest_NoAuthorizer_1_7vsPBH/meta'
I0926 14:38:21.943740  5792 status_update_manager.cpp:203] Recovering status update manager
I0926 14:38:21.943976  5807 containerizer.cpp:648] Recovering containerizer
I0926 14:38:21.945395  5793 provisioner.cpp:416] Provisioner recovery complete
I0926 14:38:21.945824  5813 slave.cpp:6322] Finished recovery
I0926 14:38:21.946595  5813 slave.cpp:6504] Querying resource estimator for oversubscribable
resources
I0926 14:38:21.946851  5802 slave.cpp:6518] Received oversubscribable resources {} from the
resource estimator
I0926 14:38:21.949205  5800 process.cpp:3929] Handling HTTP event for process 'slave(816)'
with path: '/slave(816)/monitor/statistics.json'
I0926 14:38:21.951259  5810 http.cpp:1185] HTTP GET for /slave(816)/monitor/statistics.json
from 172.17.0.3:35310
I0926 14:38:21.951331  5810 http.cpp:976] Authorizing principal 'test-principal' to GET the
'/monitor/statistics.json' endpoint
I0926 14:38:21.954608  5772 slave.cpp:869] Agent terminating
[       OK ] Endpoint/SlaveEndpointTest.NoAuthorizer/1 (35 ms)
[ RUN      ] Endpoint/SlaveEndpointTest.NoAuthorizer/2
I0926 14:38:21.969177  5772 containerizer.cpp:292] Using isolation { environment_secret, posix/cpu,
posix/mem, filesystem/posix, network/cni }
W0926 14:38:21.969655  5772 backend.cpp:76] Failed to create 'aufs' backend: AufsBackend requires
root privileges
W0926 14:38:21.969754  5772 backend.cpp:76] Failed to create 'bind' backend: BindBackend requires
root privileges
I0926 14:38:21.969789  5772 provisioner.cpp:255] Using default backend 'copy'
I0926 14:38:21.971319  5772 cluster.cpp:448] Creating default 'local' authorizer
I0926 14:38:21.972982  5808 slave.cpp:254] Mesos agent started on (817)@172.17.0.3:39015
I0926 14:38:21.973006  5808 slave.cpp:255] Flags at startup: --acls="" --appc_simple_discovery_uri_prefix="http://"
--appc_store_dir="/tmp/Endpoint_SlaveEndpointTest_NoAuthorizer_2_Rhpmoh/store/appc" --authenticate_http_readonly="true"
--authenticate_http_readwrite="true" --authenticatee="crammd5" --authentication_backoff_factor="1secs"
--authorizer="local" --cgroups_cpu_enable_pids_and_tids_count="false" --cgroups_enable_cfs="false"
--cgroups_hierarchy="/sys/fs/cgroup" --cgroups_limit_swap="false" --cgroups_root="mesos" --container_disk_watch_interval="15secs"
--containerizers="mesos" --credential="/tmp/Endpoint_SlaveEndpointTest_NoAuthorizer_2_Rhpmoh/credential"
--default_role="*" --disallow_sharing_agent_pid_namespace="false" --disk_watch_interval="1mins"
--docker="docker" --docker_kill_orphans="true" --docker_registry="https://registry-1.docker.io"
--docker_remove_delay="6hrs" --docker_socket="/var/run/docker.sock" --docker_stop_timeout="0ns"
--docker_store_dir="/tmp/Endpoint_SlaveEndpointTest_NoAuthorizer_2_Rhpmoh/store/docker" --docker_volume_checkpoint_dir="/var/run/mesos/isolators/docker/volume"
--enforce_container_disk_quota="false" --executor_registration_timeout="1mins" --executor_reregistration_timeout="2secs"
--executor_shutdown_grace_period="5secs" --fetcher_cache_dir="/tmp/Endpoint_SlaveEndpointTest_NoAuthorizer_2_Rhpmoh/fetch"
--fetcher_cache_size="2GB" --frameworks_home="" --gc_delay="1weeks" --gc_disk_headroom="0.1"
--hadoop_home="" --help="false" --hostname_lookup="true" --http_command_executor="false" --http_credentials="/tmp/Endpoint_SlaveEndpointTest_NoAuthorizer_2_Rhpmoh/http_credentials"
--http_heartbeat_interval="30secs" --initialize_driver_logging="true" --isolation="posix/cpu,posix/mem"
--launcher="posix" --launcher_dir="/mesos/mesos-1.5.0/_build/src" --logbufsecs="0" --logging_level="INFO"
--max_completed_executors_per_framework="150" --oversubscribed_resources_interval="15secs"
--perf_duration="10secs" --perf_interval="1mins" --port="5051" --qos_correction_interval_min="0ns"
--quiet="false" --recover="reconnect" --recovery_timeout="15mins" --registration_backoff_factor="10ms"
--resources="cpus:2;gpus:0;mem:1024;disk:1024;ports:[31000-32000]" --revocable_cpu_low_priority="true"
--runtime_dir="/tmp/Endpoint_SlaveEndpointTest_NoAuthorizer_2_Rhpmoh" --sandbox_directory="/mnt/mesos/sandbox"
--strict="true" --switch_user="true" --systemd_enable_support="true" --systemd_runtime_directory="/run/systemd/system"
--version="false" --work_dir="/tmp/Endpoint_SlaveEndpointTest_NoAuthorizer_2_2aLKBm" --zk_session_timeout="10secs"
I0926 14:38:21.973518  5808 credentials.hpp:86] Loading credential for authentication from
'/tmp/Endpoint_SlaveEndpointTest_NoAuthorizer_2_Rhpmoh/credential'
I0926 14:38:21.973685  5808 slave.cpp:287] Agent using credential for: test-principal
I0926 14:38:21.973707  5808 credentials.hpp:37] Loading credentials for authentication from
'/tmp/Endpoint_SlaveEndpointTest_NoAuthorizer_2_Rhpmoh/http_credentials'
I0926 14:38:21.973999  5808 http.cpp:1045] Creating default 'basic' HTTP authenticator for
realm 'mesos-agent-readonly'
I0926 14:38:21.974139  5808 http.cpp:1045] Creating default 'basic' HTTP authenticator for
realm 'mesos-agent-readwrite'
I0926 14:38:21.975330  5808 slave.cpp:585] Agent resources: [{"name":"cpus","scalar":{"value":2.0},"type":"SCALAR"},{"name":"mem","scalar":{"value":1024.0},"type":"SCALAR"},{"name":"disk","scalar":{"value":1024.0},"type":"SCALAR"},{"name":"ports","ranges":{"range":[{"begin":31000,"end":32000}]},"type":"RANGES"}]
I0926 14:38:21.975527  5808 slave.cpp:593] Agent attributes: [  ]
I0926 14:38:21.975536  5808 slave.cpp:602] Agent hostname: 8d0a1d056b39
I0926 14:38:21.975651  5793 status_update_manager.cpp:177] Pausing sending status updates
I0926 14:38:21.977113  5811 state.cpp:64] Recovering state from '/tmp/Endpoint_SlaveEndpointTest_NoAuthorizer_2_2aLKBm/meta'
I0926 14:38:21.977519  5801 status_update_manager.cpp:203] Recovering status update manager
I0926 14:38:21.977718  5802 containerizer.cpp:648] Recovering containerizer
I0926 14:38:21.978895  5809 provisioner.cpp:416] Provisioner recovery complete
I0926 14:38:21.979205  5793 slave.cpp:6322] Finished recovery
I0926 14:38:21.979625  5793 slave.cpp:6504] Querying resource estimator for oversubscribable
resources
I0926 14:38:21.979846  5801 slave.cpp:6518] Received oversubscribable resources {} from the
resource estimator
I0926 14:38:21.981876  5814 process.cpp:3929] Handling HTTP event for process 'slave(817)'
with path: '/slave(817)/containers'
I0926 14:38:21.982909  5794 http.cpp:1185] HTTP GET for /slave(817)/containers from 172.17.0.3:35312
I0926 14:38:21.982980  5794 http.cpp:976] Authorizing principal 'test-principal' to GET the
'/containers' endpoint
I0926 14:38:21.986398  5812 slave.cpp:869] Agent terminating
[       OK ] Endpoint/SlaveEndpointTest.NoAuthorizer/2 (28 ms)
[----------] 9 tests from Endpoint/SlaveEndpointTest (298 ms total)

[----------] 2 tests from ContainerizerType/DefaultContainerDNSFlagTest
[ RUN      ] ContainerizerType/DefaultContainerDNSFlagTest.ValidateFlag/0
[       OK ] ContainerizerType/DefaultContainerDNSFlagTest.ValidateFlag/0 (11 ms)
[ RUN      ] ContainerizerType/DefaultContainerDNSFlagTest.ValidateFlag/1
[       OK ] ContainerizerType/DefaultContainerDNSFlagTest.ValidateFlag/1 (9 ms)
[----------] 2 tests from ContainerizerType/DefaultContainerDNSFlagTest (20 ms total)

[----------] Global test environment tear-down
[==========] 1676 tests from 184 test cases ran. (566355 ms total)
[  PASSED  ] 1675 tests.
[  FAILED  ] 1 test, listed below:
[  FAILED  ] MasterTest.IgnoreOldAgentReregistration

 1 FAILED TEST
  YOU HAVE 20 DISABLED TESTS

I0926 14:38:22.067570  5815 process.cpp:1068] Failed to accept socket: future discarded
make[4]: *** [check-local] Error 1
make[4]: Leaving directory `/mesos/mesos-1.5.0/_build/src'
make[3]: *** [check-am] Error 2
make[3]: Leaving directory `/mesos/mesos-1.5.0/_build/src'
make[2]: *** [check] Error 2
make[2]: Leaving directory `/mesos/mesos-1.5.0/_build/src'
make[1]: *** [check-recursive] Error 1
make[1]: Leaving directory `/mesos/mesos-1.5.0/_build'
make: *** [distcheck] Error 1
+ docker rmi mesos-1506432935-20444
Untagged: mesos-1506432935-20444:latest
Deleted: sha256:78945db4775a6e5ef16f9d8a687df8021dff795d76c4ecc23cc0fa7f819f9e87
Deleted: sha256:3ca839f3745143950fe1b59309acf8db38967d08cad02075331389b71af8bcca
Deleted: sha256:84734a175e4db931a6034dae4afa80d1716a468aa629d99a85d5749bb25b6b99
Deleted: sha256:92d7a6a437cb78a2536b03aa87fc94ed79eeed7fbe58049f9021de3c0c7eba06
Deleted: sha256:937418f65110220f4303d260e13dbfd663197dac2137de51d7da41254d401f53
Deleted: sha256:c66bb7f1f02bdf5b9e82aff781e80bb04684505415f44166033fc5778b4c7a6d
Deleted: sha256:442f0a2a53f1694cce0f43560b0b8c08b645da2cafbfdc3b43ede2a1cbcbf9a5
Deleted: sha256:adf0c769023ef98bc4fa79db681777bcf9e9055b03378835a41363dbca799446
Deleted: sha256:8b8361328cef3774d9bc1736aed89f7c0f1a62b9da90f263facb1074a6e5723e
Deleted: sha256:51f35cedde5a7ac2043138438b456118be39e227ef5e65d4880233c0cff222e2
Deleted: sha256:18f02a86b7dcd8ea8679eada66df60cb72764a2f1b2bd340e54b123ece7dce4f
Deleted: sha256:cfec1732be620eb48deb3836f5e00e312d6fecb0b7574265f1366edbff9340aa
Deleted: sha256:b46854ca1a8ee392e47049c49c7a0e738a01f54370fea59315a685d8df500b35
Deleted: sha256:dc8addc6ebedee77e71a9371bef9ec324b18f38fabc92d85a1a0cf1ffeaa0433
Deleted: sha256:4963238dfb52ef7660524ea271a225d9d247c8903c0b0585528fc7e5caefff9b
Deleted: sha256:09bbd7e972b640061d2859872e09e26a0bcc83486cc74d4bc55b15eb48569f1e
Deleted: sha256:21c71f0782db56428e4ada361daf713fefb1a1d8cd35c898c9fa1b70a34b8d86
Deleted: sha256:43547feaa8c2d30f2c23e90380da8bb608285679e8f066d9b57095eb84cd00a0
Deleted: sha256:0fda488200e497a3a54f9aeba7175705709a5c3eab508b05402ef9db6e5f57e8
Deleted: sha256:822fe4aaeec31c8c09c0e1a1ff294cf0e80f8566ecd60f8ed4710b743ca4dc5f
Deleted: sha256:4bceaacd6650235603e0587f9969022bc860b0e4daeabbb3997f0fcf4a4d63e9
Deleted: sha256:a53826f4482ec58abc29a58b10ceadab956073eaf0e16471fc8225068a23ab0d
Deleted: sha256:0debdf2a2ede5eb5f777036cbb6213aa75031652a39ca5e532eba9b0eb690bf6
Deleted: sha256:388c539999e8101b64ea387a0ae2c113d545b3e2fd8c771b3ce0d63c3c9a36ea
Deleted: sha256:82bb209aee4aa79e45c2de348b04db6915722dcf647b0e29f66ab3ff1013fbde
Deleted: sha256:ce052a0d57c7a0017f8c6e69e959966511472d90d97249a1845f834dde0486fe
Deleted: sha256:2c032cac0f06f5f219da7d0340c90df1df7526824a39569559de81c0a705536e
Deleted: sha256:5f51dee9d66e9f8b98dfa1916f9b8010df6fd8f71880f3a233132c7790b700d0
Build step 'Execute shell' marked build as failure
Not sending mail to unregistered user benjamin.hindman@gmail.com

Mime
View raw message