mesos-builds mailing list archives

Site index · List index
Message view « Date » · « Thread »
Top « Date » · « Thread »
From Apache Jenkins Server <jenk...@builds.apache.org>
Subject Build failed in Jenkins: Mesos-Buildbot » autotools,gcc,--verbose,GLOG_v=1 MESOS_VERBOSE=1,centos:7,(ubuntu)&&(!ubuntu-us1)&&(!ubuntu-eu2) #4181
Date Fri, 01 Sep 2017 12:44:59 GMT
See <https://builds.apache.org/job/Mesos-Buildbot/BUILDTOOL=autotools,COMPILER=gcc,CONFIGURATION=--verbose,ENVIRONMENT=GLOG_v=1%20MESOS_VERBOSE=1,OS=centos%3A7,label_exp=(ubuntu)&&(!ubuntu-us1)&&(!ubuntu-eu2)/4181/display/redirect?page=changes>

Changes:

[yujie.jay] Added an undiscardable() helper that blocks discards from propagating.

[yujie.jay] Used 'undiscardable' to protect a future in MesosContainerizer.

[yujie.jay] Added MESOS-7926 to 1.2.3 CHANGELOG.

[yujie.jay] Added a Variant wrapper for boost::variant.

[yujie.jay] Added `is_specialization_of` trait.

[yujie.jay] Added a missing include in future.hpp.

[alexr] Ensured JAVA HTTP adapter propagates a subscription error.

[alexr] Added MESOS-7872 to 1.2.3 CHANGELOG.

------------------------------------------
[...truncated 3.08 MB...]
[       OK ] AuthorizationTest/1.ViewRole (6 ms)
[----------] 35 tests from AuthorizationTest/1 (288 ms total)

[----------] 2 tests from CheckTest
[ RUN      ] CheckTest.CheckInfoValidation
[       OK ] CheckTest.CheckInfoValidation (0 ms)
[ RUN      ] CheckTest.CheckStatusInfoValidation
[       OK ] CheckTest.CheckStatusInfoValidation (0 ms)
[----------] 2 tests from CheckTest (1 ms total)

[----------] 2 tests from HTTPCommandExecutorTest
[ RUN      ] HTTPCommandExecutorTest.TerminateWithACK
I0901 12:44:23.124749 31182 cluster.cpp:160] Creating default 'local' authorizer
I0901 12:44:23.129305 31202 master.cpp:383] Master bdf08b6a-f7d2-40cd-82b8-65b8c16cdcde (690b2d718be5)
started on 172.17.0.2:43747
I0901 12:44:23.129350 31202 master.cpp:385] Flags at startup: --acls="" --agent_ping_timeout="15secs"
--agent_reregister_timeout="10mins" --allocation_interval="1secs" --allocator="HierarchicalDRF"
--authenticate_agents="true" --authenticate_frameworks="true" --authenticate_http_frameworks="true"
--authenticate_http_readonly="true" --authenticate_http_readwrite="true" --authenticators="crammd5"
--authorizers="local" --credentials="/tmp/hTwZgI/credentials" --framework_sorter="drf" --help="false"
--hostname_lookup="true" --http_authenticators="basic" --http_framework_authenticators="basic"
--initialize_driver_logging="true" --log_auto_initialize="true" --logbufsecs="0" --logging_level="INFO"
--max_agent_ping_timeouts="5" --max_completed_frameworks="50" --max_completed_tasks_per_framework="1000"
--max_unreachable_tasks_per_framework="1000" --port="5050" --quiet="false" --recovery_agent_removal_limit="100%"
--registry="in_memory" --registry_fetch_timeout="1mins" --registry_gc_interval="15mins" --registry_max_agent_age="2weeks"
--registry_max_agent_count="102400" --registry_store_timeout="100secs" --registry_strict="false"
--root_submissions="true" --user_sorter="drf" --version="false" --webui_dir="/mesos/mesos-1.2.3/_inst/share/mesos/webui"
--work_dir="/tmp/hTwZgI/master" --zk_session_timeout="10secs"
I0901 12:44:23.130071 31202 master.cpp:435] Master only allowing authenticated frameworks
to register
I0901 12:44:23.130095 31202 master.cpp:449] Master only allowing authenticated agents to register
I0901 12:44:23.130111 31202 master.cpp:462] Master only allowing authenticated HTTP frameworks
to register
I0901 12:44:23.130129 31202 credentials.hpp:37] Loading credentials for authentication from
'/tmp/hTwZgI/credentials'
I0901 12:44:23.130580 31202 master.cpp:507] Using default 'crammd5' authenticator
I0901 12:44:23.130790 31202 http.cpp:919] Using default 'basic' HTTP authenticator for realm
'mesos-master-readonly'
I0901 12:44:23.131019 31202 http.cpp:919] Using default 'basic' HTTP authenticator for realm
'mesos-master-readwrite'
I0901 12:44:23.131161 31202 http.cpp:919] Using default 'basic' HTTP authenticator for realm
'mesos-master-scheduler'
I0901 12:44:23.131273 31202 master.cpp:587] Authorization enabled
I0901 12:44:23.131561 31205 hierarchical.cpp:161] Initialized hierarchical allocator process
I0901 12:44:23.131570 31203 whitelist_watcher.cpp:77] No whitelist given
I0901 12:44:23.134883 31205 master.cpp:2124] Elected as the leading master!
I0901 12:44:23.134923 31205 master.cpp:1646] Recovering from registrar
I0901 12:44:23.135164 31208 registrar.cpp:329] Recovering registrar
I0901 12:44:23.136379 31206 registrar.cpp:362] Successfully fetched the registry (0B) in 1.123072ms
I0901 12:44:23.136554 31206 registrar.cpp:461] Applied 1 operations in 25484ns; attempting
to update the registry
I0901 12:44:23.138015 31208 registrar.cpp:506] Successfully updated the registry in 1.378048ms
I0901 12:44:23.138254 31208 registrar.cpp:392] Successfully recovered registrar
I0901 12:44:23.138942 31203 master.cpp:1762] Recovered 0 agents from the registry (129B);
allowing 10mins for agents to re-register
I0901 12:44:23.138974 31202 hierarchical.cpp:188] Skipping recovery of hierarchical allocator:
nothing to recover
I0901 12:44:23.143599 31182 containerizer.cpp:221] Using isolation: posix/cpu,posix/mem,filesystem/posix,network/cni
W0901 12:44:23.144567 31182 backend.cpp:76] Failed to create 'overlay' backend: OverlayBackend
requires root privileges
W0901 12:44:23.144804 31182 backend.cpp:76] Failed to create 'bind' backend: BindBackend requires
root privileges
I0901 12:44:23.145067 31182 provisioner.cpp:249] Using default backend 'copy'
I0901 12:44:23.151105 31201 slave.cpp:217] Mesos agent started on 172.17.0.2:43747
I0901 12:44:23.151159 31201 slave.cpp:218] Flags at startup: --acls="" --appc_simple_discovery_uri_prefix="http://"
--appc_store_dir="/tmp/mesos/store/appc" --authenticate_http_readonly="true" --authenticate_http_readwrite="true"
--authenticatee="crammd5" --authentication_backoff_factor="1secs" --authorizer="local" --cgroups_cpu_enable_pids_and_tids_count="false"
--cgroups_enable_cfs="false" --cgroups_hierarchy="/sys/fs/cgroup" --cgroups_limit_swap="false"
--cgroups_root="mesos" --container_disk_watch_interval="15secs" --containerizers="mesos" --credential="/tmp/HTTPCommandExecutorTest_TerminateWithACK_PUdfew/credential"
--default_role="*" --disk_watch_interval="1mins" --docker="docker" --docker_kill_orphans="true"
--docker_registry="https://registry-1.docker.io" --docker_remove_delay="6hrs" --docker_socket="/var/run/docker.sock"
--docker_stop_timeout="0ns" --docker_store_dir="/tmp/mesos/store/docker" --docker_volume_checkpoint_dir="/var/run/mesos/isolators/docker/volume"
--enforce_container_disk_quota="false" --executor_registration_timeout="1mins" --executor_reregistration_timeout="2secs"
--executor_shutdown_grace_period="5secs" --fetcher_cache_dir="/tmp/HTTPCommandExecutorTest_TerminateWithACK_PUdfew/fetch"
--fetcher_cache_size="2GB" --frameworks_home="" --gc_delay="1weeks" --gc_disk_headroom="0.1"
--hadoop_home="" --help="false" --hostname_lookup="true" --http_authenticators="basic" --http_command_executor="true"
--http_credentials="/tmp/HTTPCommandExecutorTest_TerminateWithACK_PUdfew/http_credentials"
--http_heartbeat_interval="30secs" --initialize_driver_logging="true" --isolation="posix/cpu,posix/mem"
--launcher="posix" --launcher_dir="/mesos/mesos-1.2.3/_build/src" --logbufsecs="0" --logging_level="INFO"
--max_completed_executors_per_framework="150" --oversubscribed_resources_interval="15secs"
--perf_duration="10secs" --perf_interval="1mins" --port="5051" --qos_correction_interval_min="0ns"
--quiet="false" --recover="reconnect" --recovery_timeout="15mins" --registration_backoff_factor="10ms"
--resources="cpus:2;gpus:0;mem:1024;disk:1024;ports:[31000-32000]" --revocable_cpu_low_priority="true"
--runtime_dir="/tmp/HTTPCommandExecutorTest_TerminateWithACK_PUdfew" --sandbox_directory="/mnt/mesos/sandbox"
--strict="true" --switch_user="true" --systemd_enable_support="true" --systemd_runtime_directory="/run/systemd/system"
--version="false" --work_dir="/tmp/HTTPCommandExecutorTest_TerminateWithACK_hECBf7"
I0901 12:44:23.152261 31201 credentials.hpp:86] Loading credential for authentication from
'/tmp/HTTPCommandExecutorTest_TerminateWithACK_PUdfew/credential'
I0901 12:44:23.152549 31201 slave.cpp:360] Agent using credential for: test-principal
I0901 12:44:23.152583 31201 credentials.hpp:37] Loading credentials for authentication from
'/tmp/HTTPCommandExecutorTest_TerminateWithACK_PUdfew/http_credentials'
I0901 12:44:23.153023 31201 http.cpp:919] Using default 'basic' HTTP authenticator for realm
'mesos-agent-readonly'
I0901 12:44:23.153281 31201 http.cpp:919] Using default 'basic' HTTP authenticator for realm
'mesos-agent-readwrite'
I0901 12:44:23.154145 31182 sched.cpp:232] Version: 1.2.3
I0901 12:44:23.155001 31206 sched.cpp:336] New master detected at master@172.17.0.2:43747
I0901 12:44:23.155264 31206 sched.cpp:407] Authenticating with master master@172.17.0.2:43747
I0901 12:44:23.155350 31206 sched.cpp:414] Using default CRAM-MD5 authenticatee
I0901 12:44:23.155666 31207 authenticatee.cpp:121] Creating new client SASL connection
I0901 12:44:23.156077 31206 master.cpp:7201] Authenticating scheduler-90bda06f-5aa5-4c17-8d98-7afd0646000c@172.17.0.2:43747
I0901 12:44:23.156239 31207 authenticator.cpp:414] Starting authentication session for crammd5-authenticatee(34)@172.17.0.2:43747
I0901 12:44:23.156592 31206 authenticator.cpp:98] Creating new server SASL connection
I0901 12:44:23.156975 31207 authenticatee.cpp:213] Received SASL authentication mechanisms:
CRAM-MD5
I0901 12:44:23.157017 31207 authenticatee.cpp:239] Attempting to authenticate with mechanism
'CRAM-MD5'
I0901 12:44:23.157243 31206 authenticator.cpp:204] Received SASL authentication start
I0901 12:44:23.157364 31206 authenticator.cpp:326] Authentication requires more steps
I0901 12:44:23.157559 31206 authenticatee.cpp:259] Received SASL authentication step
I0901 12:44:23.157584 31201 slave.cpp:547] Agent resources: cpus(*):2; mem(*):1024; disk(*):1024;
ports(*):[31000-32000]
I0901 12:44:23.157776 31206 authenticator.cpp:232] Received SASL authentication step
I0901 12:44:23.157850 31206 auxprop.cpp:109] Request to lookup properties for user: 'test-principal'
realm: '690b2d718be5' server FQDN: '690b2d718be5' SASL_AUXPROP_VERIFY_AGAINST_HASH: false
SASL_AUXPROP_OVERRIDE: false SASL_AUXPROP_AUTHZID: false 
I0901 12:44:23.158061 31206 auxprop.cpp:181] Looking up auxiliary property '*userPassword'
I0901 12:44:23.158125 31206 auxprop.cpp:181] Looking up auxiliary property '*cmusaslsecretCRAM-MD5'
I0901 12:44:23.158180 31206 auxprop.cpp:109] Request to lookup properties for user: 'test-principal'
realm: '690b2d718be5' server FQDN: '690b2d718be5' SASL_AUXPROP_VERIFY_AGAINST_HASH: false
SASL_AUXPROP_OVERRIDE: false SASL_AUXPROP_AUTHZID: true 
I0901 12:44:23.158203 31206 auxprop.cpp:131] Skipping auxiliary property '*userPassword' since
SASL_AUXPROP_AUTHZID == true
I0901 12:44:23.158223 31206 auxprop.cpp:131] Skipping auxiliary property '*cmusaslsecretCRAM-MD5'
since SASL_AUXPROP_AUTHZID == true
I0901 12:44:23.158254 31206 authenticator.cpp:318] Authentication success
I0901 12:44:23.158421 31208 authenticatee.cpp:299] Authentication success
I0901 12:44:23.158715 31202 master.cpp:7231] Successfully authenticated principal 'test-principal'
at scheduler-90bda06f-5aa5-4c17-8d98-7afd0646000c@172.17.0.2:43747
I0901 12:44:23.158819 31208 sched.cpp:513] Successfully authenticated with master master@172.17.0.2:43747
I0901 12:44:23.158846 31208 sched.cpp:836] Sending SUBSCRIBE call to master@172.17.0.2:43747
I0901 12:44:23.158843 31202 authenticator.cpp:432] Authentication session cleanup for crammd5-authenticatee(34)@172.17.0.2:43747
I0901 12:44:23.158987 31208 sched.cpp:869] Will retry registration in 1.16416842secs if necessary
I0901 12:44:23.159255 31204 master.cpp:2737] Received SUBSCRIBE call for framework 'default'
at scheduler-90bda06f-5aa5-4c17-8d98-7afd0646000c@172.17.0.2:43747
I0901 12:44:23.159428 31204 master.cpp:2160] Authorizing framework principal 'test-principal'
to receive offers for role '*'
I0901 12:44:23.157784 31201 slave.cpp:555] Agent attributes: [  ]
I0901 12:44:23.159509 31201 slave.cpp:560] Agent hostname: 690b2d718be5
I0901 12:44:23.159756 31204 status_update_manager.cpp:177] Pausing sending status updates
I0901 12:44:23.160143 31208 master.cpp:2813] Subscribing framework default with checkpointing
disabled and capabilities [  ]
I0901 12:44:23.160862 31206 sched.cpp:759] Framework registered with bdf08b6a-f7d2-40cd-82b8-65b8c16cdcde-0000
I0901 12:44:23.160944 31206 sched.cpp:773] Scheduler::registered took 29634ns
I0901 12:44:23.161415 31203 hierarchical.cpp:286] Added framework bdf08b6a-f7d2-40cd-82b8-65b8c16cdcde-0000
I0901 12:44:23.161788 31203 hierarchical.cpp:1810] No allocations performed
I0901 12:44:23.161881 31203 hierarchical.cpp:1900] No inverse offers to send out!
I0901 12:44:23.161974 31203 hierarchical.cpp:1394] Performed allocation for 0 agents in 249647ns
I0901 12:44:23.162143 31204 state.cpp:62] Recovering state from '/tmp/HTTPCommandExecutorTest_TerminateWithACK_hECBf7/meta'
I0901 12:44:23.162768 31208 status_update_manager.cpp:203] Recovering status update manager
I0901 12:44:23.162981 31207 containerizer.cpp:600] Recovering containerizer
I0901 12:44:23.164978 31207 provisioner.cpp:410] Provisioner recovery complete
I0901 12:44:23.165714 31207 slave.cpp:5711] Finished recovery
I0901 12:44:23.166321 31207 slave.cpp:5885] Querying resource estimator for oversubscribable
resources
I0901 12:44:23.166887 31202 status_update_manager.cpp:177] Pausing sending status updates
I0901 12:44:23.166918 31204 slave.cpp:937] New master detected at master@172.17.0.2:43747
I0901 12:44:23.167248 31204 slave.cpp:972] Detecting new master
I0901 12:44:23.175643 31204 slave.cpp:999] Authenticating with master master@172.17.0.2:43747
I0901 12:44:23.175803 31204 slave.cpp:1010] Using default CRAM-MD5 authenticatee
I0901 12:44:23.176182 31205 authenticatee.cpp:121] Creating new client SASL connection
I0901 12:44:23.176699 31204 master.cpp:7201] Authenticating (13)@172.17.0.2:43747
I0901 12:44:23.176908 31208 authenticator.cpp:414] Starting authentication session for crammd5-authenticatee(35)@172.17.0.2:43747
I0901 12:44:23.177355 31203 authenticator.cpp:98] Creating new server SASL connection
I0901 12:44:23.177776 31208 authenticatee.cpp:213] Received SASL authentication mechanisms:
CRAM-MD5
I0901 12:44:23.177822 31208 authenticatee.cpp:239] Attempting to authenticate with mechanism
'CRAM-MD5'
I0901 12:44:23.177942 31208 authenticator.cpp:204] Received SASL authentication start
I0901 12:44:23.178004 31208 authenticator.cpp:326] Authentication requires more steps
I0901 12:44:23.178098 31208 authenticatee.cpp:259] Received SASL authentication step
I0901 12:44:23.178205 31208 authenticator.cpp:232] Received SASL authentication step
I0901 12:44:23.178238 31208 auxprop.cpp:109] Request to lookup properties for user: 'test-principal'
realm: '690b2d718be5' server FQDN: '690b2d718be5' SASL_AUXPROP_VERIFY_AGAINST_HASH: false
SASL_AUXPROP_OVERRIDE: false SASL_AUXPROP_AUTHZID: false 
I0901 12:44:23.178259 31208 auxprop.cpp:181] Looking up auxiliary property '*userPassword'
I0901 12:44:23.178309 31208 auxprop.cpp:181] Looking up auxiliary property '*cmusaslsecretCRAM-MD5'
I0901 12:44:23.178341 31208 auxprop.cpp:109] Request to lookup properties for user: 'test-principal'
realm: '690b2d718be5' server FQDN: '690b2d718be5' SASL_AUXPROP_VERIFY_AGAINST_HASH: false
SASL_AUXPROP_OVERRIDE: false SASL_AUXPROP_AUTHZID: true 
I0901 12:44:23.178360 31208 auxprop.cpp:131] Skipping auxiliary property '*userPassword' since
SASL_AUXPROP_AUTHZID == true
I0901 12:44:23.178377 31208 auxprop.cpp:131] Skipping auxiliary property '*cmusaslsecretCRAM-MD5'
since SASL_AUXPROP_AUTHZID == true
I0901 12:44:23.178413 31208 authenticator.cpp:318] Authentication success
I0901 12:44:23.178520 31202 authenticatee.cpp:299] Authentication success
I0901 12:44:23.178640 31204 master.cpp:7231] Successfully authenticated principal 'test-principal'
at (13)@172.17.0.2:43747
I0901 12:44:23.178715 31203 authenticator.cpp:432] Authentication session cleanup for crammd5-authenticatee(35)@172.17.0.2:43747
I0901 12:44:23.179179 31202 slave.cpp:1094] Successfully authenticated with master master@172.17.0.2:43747
I0901 12:44:23.179538 31202 slave.cpp:1521] Will retry registration in 10.22077ms if necessary
I0901 12:44:23.179873 31207 master.cpp:5398] Registering agent at (13)@172.17.0.2:43747 (690b2d718be5)
with id bdf08b6a-f7d2-40cd-82b8-65b8c16cdcde-S0
I0901 12:44:23.180655 31205 registrar.cpp:461] Applied 1 operations in 119160ns; attempting
to update the registry
I0901 12:44:23.183372 31205 registrar.cpp:506] Successfully updated the registry in 2.57792ms
I0901 12:44:23.184725 31202 slave.cpp:4442] Received ping from slave-observer(9)@172.17.0.2:43747
I0901 12:44:23.184782 31207 master.cpp:5472] Registered agent bdf08b6a-f7d2-40cd-82b8-65b8c16cdcde-S0
at (13)@172.17.0.2:43747 (690b2d718be5) with cpus(*):2; mem(*):1024; disk(*):1024; ports(*):[31000-32000]
I0901 12:44:23.185689 31203 hierarchical.cpp:516] Added agent bdf08b6a-f7d2-40cd-82b8-65b8c16cdcde-S0
(690b2d718be5) with cpus(*):2; mem(*):1024; disk(*):1024; ports(*):[31000-32000] (allocated:
{})
I0901 12:44:23.186349 31202 slave.cpp:1140] Registered with master master@172.17.0.2:43747;
given agent ID bdf08b6a-f7d2-40cd-82b8-65b8c16cdcde-S0
I0901 12:44:23.186384 31202 fetcher.cpp:94] Clearing fetcher cache
I0901 12:44:23.186604 31208 status_update_manager.cpp:184] Resuming sending status updates
I0901 12:44:23.186873 31202 slave.cpp:1168] Checkpointing SlaveInfo to '/tmp/HTTPCommandExecutorTest_TerminateWithACK_hECBf7/meta/slaves/bdf08b6a-f7d2-40cd-82b8-65b8c16cdcde-S0/slave.info'
I0901 12:44:23.188688 31203 hierarchical.cpp:1900] No inverse offers to send out!
I0901 12:44:23.188809 31203 hierarchical.cpp:1394] Performed allocation for 1 agents in 2.866277ms
I0901 12:44:23.189558 31208 master.cpp:7030] Sending 1 offers to framework bdf08b6a-f7d2-40cd-82b8-65b8c16cdcde-0000
(default) at scheduler-90bda06f-5aa5-4c17-8d98-7afd0646000c@172.17.0.2:43747
I0901 12:44:23.190523 31203 sched.cpp:933] Scheduler::resourceOffers took 193095ns
I0901 12:44:23.193812 31206 master.cpp:3776] Processing ACCEPT call for offers: [ bdf08b6a-f7d2-40cd-82b8-65b8c16cdcde-O0
] on agent bdf08b6a-f7d2-40cd-82b8-65b8c16cdcde-S0 at (13)@172.17.0.2:43747 (690b2d718be5)
for framework bdf08b6a-f7d2-40cd-82b8-65b8c16cdcde-0000 (default) at scheduler-90bda06f-5aa5-4c17-8d98-7afd0646000c@172.17.0.2:43747
I0901 12:44:23.194015 31206 master.cpp:3352] Authorizing framework principal 'test-principal'
to launch task dfa58119-c8ac-475f-804f-cf1771217037
I0901 12:44:23.198707 31206 master.cpp:9091] Adding task dfa58119-c8ac-475f-804f-cf1771217037
with resources cpus(*)(allocated: *):2; mem(*)(allocated: *):1024; disk(*)(allocated: *):1024;
ports(*)(allocated: *):[31000-32000] on agent bdf08b6a-f7d2-40cd-82b8-65b8c16cdcde-S0 at (13)@172.17.0.2:43747
(690b2d718be5)
I0901 12:44:23.199733 31206 master.cpp:4426] Launching task dfa58119-c8ac-475f-804f-cf1771217037
of framework bdf08b6a-f7d2-40cd-82b8-65b8c16cdcde-0000 (default) at scheduler-90bda06f-5aa5-4c17-8d98-7afd0646000c@172.17.0.2:43747
with resources cpus(*)(allocated: *):2; mem(*)(allocated: *):1024; disk(*)(allocated: *):1024;
ports(*)(allocated: *):[31000-32000] on agent bdf08b6a-f7d2-40cd-82b8-65b8c16cdcde-S0 at (13)@172.17.0.2:43747
(690b2d718be5)
I0901 12:44:23.201331 31208 slave.cpp:1631] Got assigned task 'dfa58119-c8ac-475f-804f-cf1771217037'
for framework bdf08b6a-f7d2-40cd-82b8-65b8c16cdcde-0000
I0901 12:44:23.202576 31208 slave.cpp:1797] Launching task 'dfa58119-c8ac-475f-804f-cf1771217037'
for framework bdf08b6a-f7d2-40cd-82b8-65b8c16cdcde-0000
I0901 12:44:23.203701 31208 paths.cpp:547] Trying to chown '/tmp/HTTPCommandExecutorTest_TerminateWithACK_hECBf7/slaves/bdf08b6a-f7d2-40cd-82b8-65b8c16cdcde-S0/frameworks/bdf08b6a-f7d2-40cd-82b8-65b8c16cdcde-0000/executors/dfa58119-c8ac-475f-804f-cf1771217037/runs/e11b45b2-2b7b-4454-8cf6-62348762c331'
to user 'mesos'
I0901 12:44:23.204108 31208 slave.cpp:6639] Launching executor 'dfa58119-c8ac-475f-804f-cf1771217037'
of framework bdf08b6a-f7d2-40cd-82b8-65b8c16cdcde-0000 with resources cpus(*)(allocated: *):0.1;
mem(*)(allocated: *):32 in work directory '/tmp/HTTPCommandExecutorTest_TerminateWithACK_hECBf7/slaves/bdf08b6a-f7d2-40cd-82b8-65b8c16cdcde-S0/frameworks/bdf08b6a-f7d2-40cd-82b8-65b8c16cdcde-0000/executors/dfa58119-c8ac-475f-804f-cf1771217037/runs/e11b45b2-2b7b-4454-8cf6-62348762c331'
I0901 12:44:23.205407 31208 slave.cpp:2108] Queued task 'dfa58119-c8ac-475f-804f-cf1771217037'
for executor 'dfa58119-c8ac-475f-804f-cf1771217037' of framework bdf08b6a-f7d2-40cd-82b8-65b8c16cdcde-0000
I0901 12:44:23.205889 31208 containerizer.cpp:993] Starting container e11b45b2-2b7b-4454-8cf6-62348762c331
for executor 'dfa58119-c8ac-475f-804f-cf1771217037' of framework bdf08b6a-f7d2-40cd-82b8-65b8c16cdcde-0000
I0901 12:44:23.207140 31206 hierarchical.cpp:807] Updated allocation of framework bdf08b6a-f7d2-40cd-82b8-65b8c16cdcde-0000
on agent bdf08b6a-f7d2-40cd-82b8-65b8c16cdcde-S0 from cpus(*)(allocated: *):2; mem(*)(allocated:
*):1024; disk(*)(allocated: *):1024; ports(*)(allocated: *):[31000-32000] to cpus(*)(allocated:
*):2; mem(*)(allocated: *):1024; disk(*)(allocated: *):1024; ports(*)(allocated: *):[31000-32000]
I0901 12:44:23.207707 31206 slave.cpp:890] Successfully attached file '/tmp/HTTPCommandExecutorTest_TerminateWithACK_hECBf7/slaves/bdf08b6a-f7d2-40cd-82b8-65b8c16cdcde-S0/frameworks/bdf08b6a-f7d2-40cd-82b8-65b8c16cdcde-0000/executors/dfa58119-c8ac-475f-804f-cf1771217037/runs/e11b45b2-2b7b-4454-8cf6-62348762c331'
I0901 12:44:23.222053 31208 containerizer.cpp:1548] Launching 'mesos-containerizer' with flags
'--help="false" --launch_info="{"command":{"arguments":["mesos-executor","--launcher_dir=\/mesos\/mesos-1.2.3\/_build\/src"],"shell":false,"value":"\/mesos\/mesos-1.2.3\/_build\/src\/mesos-executor"},"environment":{"variables":[{"name":"LIBPROCESS_PORT","value":"0"},{"name":"MESOS_AGENT_ENDPOINT","value":"172.17.0.2:43747"},{"name":"MESOS_CHECKPOINT","value":"0"},{"name":"MESOS_DIRECTORY","value":"\/tmp\/HTTPCommandExecutorTest_TerminateWithACK_hECBf7\/slaves\/bdf08b6a-f7d2-40cd-82b8-65b8c16cdcde-S0\/frameworks\/bdf08b6a-f7d2-40cd-82b8-65b8c16cdcde-0000\/executors\/dfa58119-c8ac-475f-804f-cf1771217037\/runs\/e11b45b2-2b7b-4454-8cf6-62348762c331"},{"name":"MESOS_EXECUTOR_ID","value":"dfa58119-c8ac-475f-804f-cf1771217037"},{"name":"MESOS_EXECUTOR_SHUTDOWN_GRACE_PERIOD","value":"5secs"},{"name":"MESOS_FRAMEWORK_ID","value":"bdf08b6a-f7d2-40cd-82b8-65b8c16cdcde-0000"},{"name":"MESOS_HTTP_COMMAND_EXECUTOR","value":"1"},{"name":"MESOS_SLAVE_ID","value":"bdf08b6a-f7d2-40cd-82b8-65b8c16cdcde-S0"},{"name":"MESOS_SLAVE_PID","value":"(13)@172.17.0.2:43747"},{"name":"MESOS_SANDBOX","value":"\/tmp\/HTTPCommandExecutorTest_TerminateWithACK_hECBf7\/slaves\/bdf08b6a-f7d2-40cd-82b8-65b8c16cdcde-S0\/frameworks\/bdf08b6a-f7d2-40cd-82b8-65b8c16cdcde-0000\/executors\/dfa58119-c8ac-475f-804f-cf1771217037\/runs\/e11b45b2-2b7b-4454-8cf6-62348762c331"}]},"user":"mesos","working_directory":"\/tmp\/HTTPCommandExecutorTest_TerminateWithACK_hECBf7\/slaves\/bdf08b6a-f7d2-40cd-82b8-65b8c16cdcde-S0\/frameworks\/bdf08b6a-f7d2-40cd-82b8-65b8c16cdcde-0000\/executors\/dfa58119-c8ac-475f-804f-cf1771217037\/runs\/e11b45b2-2b7b-4454-8cf6-62348762c331"}"
--pipe_read="6" --pipe_write="7" --runtime_directory="/tmp/HTTPCommandExecutorTest_TerminateWithACK_PUdfew/containers/e11b45b2-2b7b-4454-8cf6-62348762c331"
--unshare_namespace_mnt="false"'
I0901 12:44:23.225257 31208 launcher.cpp:135] Forked child with pid '31221' for container
'e11b45b2-2b7b-4454-8cf6-62348762c331'
I0901 12:44:23.232924 31205 fetcher.cpp:353] Starting to fetch URIs for container: e11b45b2-2b7b-4454-8cf6-62348762c331,
directory: /tmp/HTTPCommandExecutorTest_TerminateWithACK_hECBf7/slaves/bdf08b6a-f7d2-40cd-82b8-65b8c16cdcde-S0/frameworks/bdf08b6a-f7d2-40cd-82b8-65b8c16cdcde-0000/executors/dfa58119-c8ac-475f-804f-cf1771217037/runs/e11b45b2-2b7b-4454-8cf6-62348762c331
I0901 12:44:24.133255 31206 hierarchical.cpp:1810] No allocations performed
I0901 12:44:24.133345 31206 hierarchical.cpp:1900] No inverse offers to send out!
I0901 12:44:24.133436 31206 hierarchical.cpp:1394] Performed allocation for 1 agents in 387564ns
I0901 12:44:25.135031 31201 hierarchical.cpp:1810] No allocations performed
I0901 12:44:25.135114 31201 hierarchical.cpp:1900] No inverse offers to send out!
I0901 12:44:25.135192 31201 hierarchical.cpp:1394] Performed allocation for 1 agents in 379483ns
I0901 12:44:26.136647 31205 hierarchical.cpp:1810] No allocations performed
I0901 12:44:26.136739 31205 hierarchical.cpp:1900] No inverse offers to send out!
I0901 12:44:26.136823 31205 hierarchical.cpp:1394] Performed allocation for 1 agents in 391834ns
I0901 12:44:27.138078 31203 hierarchical.cpp:1810] No allocations performed
I0901 12:44:27.138162 31203 hierarchical.cpp:1900] No inverse offers to send out!
I0901 12:44:27.138242 31203 hierarchical.cpp:1394] Performed allocation for 1 agents in 370040ns
I0901 12:44:28.139844 31204 hierarchical.cpp:1810] No allocations performed
I0901 12:44:28.139931 31204 hierarchical.cpp:1900] No inverse offers to send out!
I0901 12:44:28.140010 31204 hierarchical.cpp:1394] Performed allocation for 1 agents in 364886ns
I0901 12:44:29.141602 31203 hierarchical.cpp:1810] No allocations performed
I0901 12:44:29.141685 31203 hierarchical.cpp:1900] No inverse offers to send out!
I0901 12:44:29.141757 31203 hierarchical.cpp:1394] Performed allocation for 1 agents in 329698ns
I0901 12:44:30.143674 31203 hierarchical.cpp:1810] No allocations performed
I0901 12:44:30.143779 31203 hierarchical.cpp:1900] No inverse offers to send out!
I0901 12:44:30.143874 31203 hierarchical.cpp:1394] Performed allocation for 1 agents in 395553ns
I0901 12:44:31.145346 31205 hierarchical.cpp:1810] No allocations performed
I0901 12:44:31.145443 31205 hierarchical.cpp:1900] No inverse offers to send out!
I0901 12:44:31.145531 31205 hierarchical.cpp:1394] Performed allocation for 1 agents in 380766ns
I0901 12:44:32.146684 31203 hierarchical.cpp:1810] No allocations performed
I0901 12:44:32.146778 31203 hierarchical.cpp:1900] No inverse offers to send out!
I0901 12:44:32.146986 31203 hierarchical.cpp:1394] Performed allocation for 1 agents in 482612ns
I0901 12:44:33.148185 31201 hierarchical.cpp:1810] No allocations performed
I0901 12:44:33.148496 31201 hierarchical.cpp:1900] No inverse offers to send out!
I0901 12:44:33.148710 31201 hierarchical.cpp:1394] Performed allocation for 1 agents in 697932ns
I0901 12:44:34.150687 31206 hierarchical.cpp:1810] No allocations performed
I0901 12:44:34.150794 31206 hierarchical.cpp:1900] No inverse offers to send out!
I0901 12:44:34.150998 31206 hierarchical.cpp:1394] Performed allocation for 1 agents in 501439ns
I0901 12:44:35.151957 31205 hierarchical.cpp:1810] No allocations performed
I0901 12:44:35.152047 31205 hierarchical.cpp:1900] No inverse offers to send out!
I0901 12:44:35.152132 31205 hierarchical.cpp:1394] Performed allocation for 1 agents in 359823ns
I0901 12:44:36.153239 31201 hierarchical.cpp:1810] No allocations performed
I0901 12:44:36.153332 31201 hierarchical.cpp:1900] No inverse offers to send out!
I0901 12:44:36.153424 31201 hierarchical.cpp:1394] Performed allocation for 1 agents in 376646ns
I0901 12:44:37.154974 31206 hierarchical.cpp:1810] No allocations performed
I0901 12:44:37.155071 31206 hierarchical.cpp:1900] No inverse offers to send out!
I0901 12:44:37.155163 31206 hierarchical.cpp:1394] Performed allocation for 1 agents in 373949ns
I0901 12:44:38.157063 31205 hierarchical.cpp:1810] No allocations performed
I0901 12:44:38.157162 31205 hierarchical.cpp:1900] No inverse offers to send out!
I0901 12:44:38.157255 31205 hierarchical.cpp:1394] Performed allocation for 1 agents in 391513ns
I0901 12:44:38.186005 31201 slave.cpp:4442] Received ping from slave-observer(9)@172.17.0.2:43747
../../src/tests/command_executor_tests.cpp:402: Failure
Failed to wait 15secs for statusRunning
../../src/tests/command_executor_tests.cpp:391: Failure
Actual function call count doesn't match EXPECT_CALL(sched, statusUpdate(_, _))...
         Expected: to be called twice
           Actual: never called - unsatisfied and active
../../src/tests/command_executor_tests.cpp:396: Failure
Actual function call count doesn't match EXPECT_CALL(slave, executorTerminated(_, _, _))...
         Expected: to be called once
           Actual: never called - unsatisfied and active
I0901 12:44:38.213807 31182 master.cpp:1103] Master terminating
W0901 12:44:38.214002 31182 master.cpp:8420] Removing task dfa58119-c8ac-475f-804f-cf1771217037
with resources cpus(*)(allocated: *):2; mem(*)(allocated: *):1024; disk(*)(allocated: *):1024;
ports(*)(allocated: *):[31000-32000] of framework bdf08b6a-f7d2-40cd-82b8-65b8c16cdcde-0000
on agent bdf08b6a-f7d2-40cd-82b8-65b8c16cdcde-S0 at (13)@172.17.0.2:43747 (690b2d718be5) in
non-removable state TASK_STAGING
*** Aborted at 1504269878 (unix time) try "date -d @1504269878" if you are using GNU date
***
PC: @                0x0 (unknown)
*** SIGSEGV (@0x0) received by PID 31182 (TID 0x7faa7557c700) from PID 0; stack trace: ***
    @     0x7faa7fd84370 (unknown)
I0901 12:44:38.226032 31201 hierarchical.cpp:549] Removed agent bdf08b6a-f7d2-40cd-82b8-65b8c16cdcde-S0
make[4]: *** [check-local] Segmentation fault (core dumped)
make[4]: Leaving directory `/mesos/mesos-1.2.3/_build/src'
make[3]: *** [check-am] Error 2
make[3]: Leaving directory `/mesos/mesos-1.2.3/_build/src'
make[2]: *** [check] Error 2
make[2]: Leaving directory `/mesos/mesos-1.2.3/_build/src'
make[1]: *** [check-recursive] Error 1
make[1]: Leaving directory `/mesos/mesos-1.2.3/_build'
make: *** [distcheck] Error 1
+ docker rmi mesos-1504265783-26279
Untagged: mesos-1504265783-26279:latest
Deleted: sha256:36c36e92142060dd5c19323462d1aa8887152d904dfaba5fe8922cbd30eba06d
Deleted: sha256:3e75905277f185b8f161e56626a5a842908c379ce45acd2a06163d1df7f56288
Deleted: sha256:b4cccffcc145a6ebea5a55114eec23c55ceb3333a2de18b3169d0817b363012e
Deleted: sha256:aa9359799409d07d7654ea7cb141d372b4ec7e80401fc658ea7213ce4ad0d73e
Deleted: sha256:694afd048ecf2a31f1841fefff272962562982e530ff1af7ff3ea688f88d01b7
Deleted: sha256:ca91ca61bb56d9afbcd9b90e1df23a522ef950f7708e731f256368903fb8aca5
Deleted: sha256:124d3e0ce5ad5e65b0d5ef6faac6a206ae503403da13328f2c4777ad4c8fd6be
Deleted: sha256:b9a3ee8b51d917f7c78a46355ba2e702afecfb41ff67ec327f926e40a21f9bd0
Deleted: sha256:2bd67ca0005d47a8835dd4173e12fa4b625387769cf94550bc052f1af77c8f5a
Deleted: sha256:91ff64c6a9995b024c3bd1eaaf1a7324ae4aae131879b092eb1802ae480c6c43
Deleted: sha256:0689b23741bc1bbdee67cdded948e4be03c8488f416e3299639658cbe73c80a3
Deleted: sha256:4180184ff5172fe68c14ed8a85c159ce8e27cc9bfcc551ace475d0af00d4101f
Deleted: sha256:de83a946b7ab9abdba77a8cfcd1c8fcdb0955d63e3267e6f3e16e1e3e0f0f077
Deleted: sha256:f310d3cdc1feef02db82f2e92ba1306d8c03812ba494d4638c62a1b8244cd7fd
Deleted: sha256:8ba8d8f5f159d3c7a61eb467cceadb78e122dbcaea02001ce39c856077b59173
Deleted: sha256:ef0ed3842e64b960ed98dc064caeed9babe391bfb0677fff376747ba49783d36
Deleted: sha256:602198c0d0e04e7f8d2711d2c2c1921a14fd2158a8682ea65880f1476d676e41
Deleted: sha256:294ca2b14ee431e392db341a51052312272f9023bd30bb19ad9992ab62118994
Deleted: sha256:c3480d35102d869999905ad11d18ed645276c693c6baa0d62ae3e945bea480ee
Deleted: sha256:c150a3e5fa3efb4a83090546e5258f7d30fd771a1d847bc04559d76d33ef0189
Deleted: sha256:cb98d4676ba0f083dd62da8234bbc07adce4e6f8c8cc7c907ced054a0a5c2acb
Deleted: sha256:9fb318c597c975a8cab506f6d6431e02a8dfa271daca589f195829389b602915
Deleted: sha256:8ecb304a58bed0c980472b22e85fc71cbc80cde3dc0a0bffc2f6f13efd084173
Deleted: sha256:94cc416ba79a951e1b9793ad63e4debb0ba49425a80ac44cc76a776b46710e43
Deleted: sha256:1bd1e42c6c5c838d4ecff3150bd881d39c92b4cf3ee7dd28b6862be810be56f6
Build step 'Execute shell' marked build as failure
Not sending mail to unregistered user yujie.jay@gmail.com

Mime
View raw message