mesos-builds mailing list archives

Site index · List index
Message view « Date » · « Thread »
Top « Date » · « Thread »
From Apache Jenkins Server <jenk...@builds.apache.org>
Subject Build failed in Jenkins: Mesos-Reviewbot #19295
Date Fri, 08 Sep 2017 17:47:52 GMT
See <https://builds.apache.org/job/Mesos-Reviewbot/19295/display/redirect>

------------------------------------------
[...truncated 31.27 MB...]
I0908 17:47:46.664654  5816 credentials.hpp:37] Loading credentials for authentication from
'/tmp/Endpoint_SlaveEndpointTest_AuthorizedRequest_2_SqDYNd/http_credentials'
I0908 17:47:46.664971  5816 http.cpp:1045] Creating default 'basic' HTTP authenticator for
realm 'mesos-agent-readonly'
I0908 17:47:46.665210  5816 http.cpp:1045] Creating default 'basic' HTTP authenticator for
realm 'mesos-agent-readwrite'
I0908 17:47:46.667254  5816 slave.cpp:583] Agent resources: [{"name":"cpus","scalar":{"value":2.0},"type":"SCALAR"},{"name":"mem","scalar":{"value":1024.0},"type":"SCALAR"},{"name":"disk","scalar":{"value":1024.0},"type":"SCALAR"},{"name":"ports","ranges":{"range":[{"begin":31000,"end":32000}]},"type":"RANGES"}]
I0908 17:47:46.667657  5816 slave.cpp:591] Agent attributes: [  ]
I0908 17:47:46.667678  5816 slave.cpp:600] Agent hostname: 8eb165f12f17
I0908 17:47:46.667928  5800 status_update_manager.cpp:177] Pausing sending status updates
I0908 17:47:46.669764  5801 state.cpp:64] Recovering state from '/tmp/Endpoint_SlaveEndpointTest_AuthorizedRequest_2_6gu8Wp/meta'
I0908 17:47:46.670120  5801 status_update_manager.cpp:203] Recovering status update manager
I0908 17:47:46.670297  5809 containerizer.cpp:648] Recovering containerizer
I0908 17:47:46.671725  5804 provisioner.cpp:416] Provisioner recovery complete
I0908 17:47:46.672204  5804 slave.cpp:6298] Finished recovery
I0908 17:47:46.672621  5804 slave.cpp:6480] Querying resource estimator for oversubscribable
resources
I0908 17:47:46.672855  5799 slave.cpp:6494] Received oversubscribable resources {} from the
resource estimator
I0908 17:47:46.675062  5797 process.cpp:3929] Handling HTTP event for process 'slave(810)'
with path: '/slave(810)/containers'
I0908 17:47:46.676334  5808 http.cpp:1185] HTTP GET for /slave(810)/containers from 172.17.0.3:40234
I0908 17:47:46.676417  5808 http.cpp:976] Authorizing principal 'test-principal' to GET the
'/containers' endpoint
I0908 17:47:46.680429  5816 slave.cpp:861] Agent terminating
[       OK ] Endpoint/SlaveEndpointTest.AuthorizedRequest/2 (34 ms)
[ RUN      ] Endpoint/SlaveEndpointTest.UnauthorizedRequest/0
I0908 17:47:46.692867  5776 containerizer.cpp:292] Using isolation { environment_secret, posix/cpu,
posix/mem, filesystem/posix, network/cni }
W0908 17:47:46.693354  5776 backend.cpp:76] Failed to create 'aufs' backend: AufsBackend requires
root privileges
W0908 17:47:46.693467  5776 backend.cpp:76] Failed to create 'bind' backend: BindBackend requires
root privileges
I0908 17:47:46.693498  5776 provisioner.cpp:255] Using default backend 'copy'
I0908 17:47:46.697340  5799 slave.cpp:252] Mesos agent started on (811)@172.17.0.3:33408
I0908 17:47:46.697365  5799 slave.cpp:253] Flags at startup: --acls="" --appc_simple_discovery_uri_prefix="http://"
--appc_store_dir="/tmp/Endpoint_SlaveEndpointTest_UnauthorizedRequest_0_odrUur/store/appc"
--authenticate_http_readonly="true" --authenticate_http_readwrite="true" --authenticatee="crammd5"
--authentication_backoff_factor="1secs" --authorizer="local" --cgroups_cpu_enable_pids_and_tids_count="false"
--cgroups_enable_cfs="false" --cgroups_hierarchy="/sys/fs/cgroup" --cgroups_limit_swap="false"
--cgroups_root="mesos" --container_disk_watch_interval="15secs" --containerizers="mesos" --credential="/tmp/Endpoint_SlaveEndpointTest_UnauthorizedRequest_0_odrUur/credential"
--default_role="*" --disallow_sharing_agent_pid_namespace="false" --disk_watch_interval="1mins"
--docker="docker" --docker_kill_orphans="true" --docker_registry="https://registry-1.docker.io"
--docker_remove_delay="6hrs" --docker_socket="/var/run/docker.sock" --docker_stop_timeout="0ns"
--docker_store_dir="/tmp/Endpoint_SlaveEndpointTest_UnauthorizedRequest_0_odrUur/store/docker"
--docker_volume_checkpoint_dir="/var/run/mesos/isolators/docker/volume" --enforce_container_disk_quota="false"
--executor_registration_timeout="1mins" --executor_reregistration_timeout="2secs" --executor_shutdown_grace_period="5secs"
--fetcher_cache_dir="/tmp/Endpoint_SlaveEndpointTest_UnauthorizedRequest_0_odrUur/fetch" --fetcher_cache_size="2GB"
--frameworks_home="" --gc_delay="1weeks" --gc_disk_headroom="0.1" --hadoop_home="" --help="false"
--hostname_lookup="true" --http_command_executor="false" --http_credentials="/tmp/Endpoint_SlaveEndpointTest_UnauthorizedRequest_0_odrUur/http_credentials"
--http_heartbeat_interval="30secs" --initialize_driver_logging="true" --isolation="posix/cpu,posix/mem"
--launcher="posix" --launcher_dir="/mesos/mesos-1.5.0/_build/src" --logbufsecs="0" --logging_level="INFO"
--max_completed_executors_per_framework="150" --oversubscribed_resources_interval="15secs"
--perf_duration="10secs" --perf_interval="1mins" --port="5051" --qos_correction_interval_min="0ns"
--quiet="false" --recover="reconnect" --recovery_timeout="15mins" --registration_backoff_factor="10ms"
--resources="cpus:2;gpus:0;mem:1024;disk:1024;ports:[31000-32000]" --revocable_cpu_low_priority="true"
--runtime_dir="/tmp/Endpoint_SlaveEndpointTest_UnauthorizedRequest_0_odrUur" --sandbox_directory="/mnt/mesos/sandbox"
--strict="true" --switch_user="true" --systemd_enable_support="true" --systemd_runtime_directory="/run/systemd/system"
--version="false" --work_dir="/tmp/Endpoint_SlaveEndpointTest_UnauthorizedRequest_0_g7JVyD"
--zk_session_timeout="10secs"
I0908 17:47:46.697746  5799 credentials.hpp:86] Loading credential for authentication from
'/tmp/Endpoint_SlaveEndpointTest_UnauthorizedRequest_0_odrUur/credential'
I0908 17:47:46.697906  5799 slave.cpp:285] Agent using credential for: test-principal
I0908 17:47:46.697927  5799 credentials.hpp:37] Loading credentials for authentication from
'/tmp/Endpoint_SlaveEndpointTest_UnauthorizedRequest_0_odrUur/http_credentials'
I0908 17:47:46.698158  5799 http.cpp:1045] Creating default 'basic' HTTP authenticator for
realm 'mesos-agent-readonly'
I0908 17:47:46.698312  5799 http.cpp:1045] Creating default 'basic' HTTP authenticator for
realm 'mesos-agent-readwrite'
I0908 17:47:46.699757  5799 slave.cpp:583] Agent resources: [{"name":"cpus","scalar":{"value":2.0},"type":"SCALAR"},{"name":"mem","scalar":{"value":1024.0},"type":"SCALAR"},{"name":"disk","scalar":{"value":1024.0},"type":"SCALAR"},{"name":"ports","ranges":{"range":[{"begin":31000,"end":32000}]},"type":"RANGES"}]
I0908 17:47:46.700009  5799 slave.cpp:591] Agent attributes: [  ]
I0908 17:47:46.700022  5799 slave.cpp:600] Agent hostname: 8eb165f12f17
I0908 17:47:46.700153  5818 status_update_manager.cpp:177] Pausing sending status updates
I0908 17:47:46.701896  5796 state.cpp:64] Recovering state from '/tmp/Endpoint_SlaveEndpointTest_UnauthorizedRequest_0_g7JVyD/meta'
I0908 17:47:46.702208  5809 status_update_manager.cpp:203] Recovering status update manager
I0908 17:47:46.702457  5816 containerizer.cpp:648] Recovering containerizer
I0908 17:47:46.704077  5806 provisioner.cpp:416] Provisioner recovery complete
I0908 17:47:46.704483  5813 slave.cpp:6298] Finished recovery
I0908 17:47:46.704968  5813 slave.cpp:6480] Querying resource estimator for oversubscribable
resources
I0908 17:47:46.705193  5804 slave.cpp:6494] Received oversubscribable resources {} from the
resource estimator
I0908 17:47:46.707307  5814 process.cpp:3929] Handling HTTP event for process 'slave(811)'
with path: '/slave(811)/monitor/statistics'
I0908 17:47:46.709046  5797 http.cpp:1185] HTTP GET for /slave(811)/monitor/statistics from
172.17.0.3:40236
I0908 17:47:46.709120  5797 http.cpp:976] Authorizing principal 'test-principal' to GET the
'/monitor/statistics' endpoint
I0908 17:47:46.711918  5776 slave.cpp:861] Agent terminating
[       OK ] Endpoint/SlaveEndpointTest.UnauthorizedRequest/0 (30 ms)
[ RUN      ] Endpoint/SlaveEndpointTest.UnauthorizedRequest/1
I0908 17:47:46.723664  5776 containerizer.cpp:292] Using isolation { environment_secret, posix/cpu,
posix/mem, filesystem/posix, network/cni }
W0908 17:47:46.724473  5776 backend.cpp:76] Failed to create 'aufs' backend: AufsBackend requires
root privileges
W0908 17:47:46.724663  5776 backend.cpp:76] Failed to create 'bind' backend: BindBackend requires
root privileges
I0908 17:47:46.724705  5776 provisioner.cpp:255] Using default backend 'copy'
I0908 17:47:46.729032  5813 slave.cpp:252] Mesos agent started on (812)@172.17.0.3:33408
I0908 17:47:46.729059  5813 slave.cpp:253] Flags at startup: --acls="" --appc_simple_discovery_uri_prefix="http://"
--appc_store_dir="/tmp/Endpoint_SlaveEndpointTest_UnauthorizedRequest_1_iIgmuF/store/appc"
--authenticate_http_readonly="true" --authenticate_http_readwrite="true" --authenticatee="crammd5"
--authentication_backoff_factor="1secs" --authorizer="local" --cgroups_cpu_enable_pids_and_tids_count="false"
--cgroups_enable_cfs="false" --cgroups_hierarchy="/sys/fs/cgroup" --cgroups_limit_swap="false"
--cgroups_root="mesos" --container_disk_watch_interval="15secs" --containerizers="mesos" --credential="/tmp/Endpoint_SlaveEndpointTest_UnauthorizedRequest_1_iIgmuF/credential"
--default_role="*" --disallow_sharing_agent_pid_namespace="false" --disk_watch_interval="1mins"
--docker="docker" --docker_kill_orphans="true" --docker_registry="https://registry-1.docker.io"
--docker_remove_delay="6hrs" --docker_socket="/var/run/docker.sock" --docker_stop_timeout="0ns"
--docker_store_dir="/tmp/Endpoint_SlaveEndpointTest_UnauthorizedRequest_1_iIgmuF/store/docker"
--docker_volume_checkpoint_dir="/var/run/mesos/isolators/docker/volume" --enforce_container_disk_quota="false"
--executor_registration_timeout="1mins" --executor_reregistration_timeout="2secs" --executor_shutdown_grace_period="5secs"
--fetcher_cache_dir="/tmp/Endpoint_SlaveEndpointTest_UnauthorizedRequest_1_iIgmuF/fetch" --fetcher_cache_size="2GB"
--frameworks_home="" --gc_delay="1weeks" --gc_disk_headroom="0.1" --hadoop_home="" --help="false"
--hostname_lookup="true" --http_command_executor="false" --http_credentials="/tmp/Endpoint_SlaveEndpointTest_UnauthorizedRequest_1_iIgmuF/http_credentials"
--http_heartbeat_interval="30secs" --initialize_driver_logging="true" --isolation="posix/cpu,posix/mem"
--launcher="posix" --launcher_dir="/mesos/mesos-1.5.0/_build/src" --logbufsecs="0" --logging_level="INFO"
--max_completed_executors_per_framework="150" --oversubscribed_resources_interval="15secs"
--perf_duration="10secs" --perf_interval="1mins" --port="5051" --qos_correction_interval_min="0ns"
--quiet="false" --recover="reconnect" --recovery_timeout="15mins" --registration_backoff_factor="10ms"
--resources="cpus:2;gpus:0;mem:1024;disk:1024;ports:[31000-32000]" --revocable_cpu_low_priority="true"
--runtime_dir="/tmp/Endpoint_SlaveEndpointTest_UnauthorizedRequest_1_iIgmuF" --sandbox_directory="/mnt/mesos/sandbox"
--strict="true" --switch_user="true" --systemd_enable_support="true" --systemd_runtime_directory="/run/systemd/system"
--version="false" --work_dir="/tmp/Endpoint_SlaveEndpointTest_UnauthorizedRequest_1_wKYOtR"
--zk_session_timeout="10secs"
I0908 17:47:46.729774  5813 credentials.hpp:86] Loading credential for authentication from
'/tmp/Endpoint_SlaveEndpointTest_UnauthorizedRequest_1_iIgmuF/credential'
I0908 17:47:46.729915  5813 slave.cpp:285] Agent using credential for: test-principal
I0908 17:47:46.729938  5813 credentials.hpp:37] Loading credentials for authentication from
'/tmp/Endpoint_SlaveEndpointTest_UnauthorizedRequest_1_iIgmuF/http_credentials'
I0908 17:47:46.730149  5813 http.cpp:1045] Creating default 'basic' HTTP authenticator for
realm 'mesos-agent-readonly'
I0908 17:47:46.730335  5813 http.cpp:1045] Creating default 'basic' HTTP authenticator for
realm 'mesos-agent-readwrite'
I0908 17:47:46.731706  5813 slave.cpp:583] Agent resources: [{"name":"cpus","scalar":{"value":2.0},"type":"SCALAR"},{"name":"mem","scalar":{"value":1024.0},"type":"SCALAR"},{"name":"disk","scalar":{"value":1024.0},"type":"SCALAR"},{"name":"ports","ranges":{"range":[{"begin":31000,"end":32000}]},"type":"RANGES"}]
I0908 17:47:46.731930  5813 slave.cpp:591] Agent attributes: [  ]
I0908 17:47:46.731943  5813 slave.cpp:600] Agent hostname: 8eb165f12f17
I0908 17:47:46.732071  5797 status_update_manager.cpp:177] Pausing sending status updates
I0908 17:47:46.733326  5810 state.cpp:64] Recovering state from '/tmp/Endpoint_SlaveEndpointTest_UnauthorizedRequest_1_wKYOtR/meta'
I0908 17:47:46.733685  5807 status_update_manager.cpp:203] Recovering status update manager
I0908 17:47:46.733901  5807 containerizer.cpp:648] Recovering containerizer
I0908 17:47:46.735296  5808 provisioner.cpp:416] Provisioner recovery complete
I0908 17:47:46.735769  5808 slave.cpp:6298] Finished recovery
I0908 17:47:46.736428  5808 slave.cpp:6480] Querying resource estimator for oversubscribable
resources
I0908 17:47:46.736701  5817 slave.cpp:6494] Received oversubscribable resources {} from the
resource estimator
I0908 17:47:46.739428  5818 process.cpp:3929] Handling HTTP event for process 'slave(812)'
with path: '/slave(812)/monitor/statistics.json'
I0908 17:47:46.740741  5800 http.cpp:1185] HTTP GET for /slave(812)/monitor/statistics.json
from 172.17.0.3:40238
I0908 17:47:46.740818  5800 http.cpp:976] Authorizing principal 'test-principal' to GET the
'/monitor/statistics.json' endpoint
I0908 17:47:46.743793  5816 slave.cpp:861] Agent terminating
[       OK ] Endpoint/SlaveEndpointTest.UnauthorizedRequest/1 (32 ms)
[ RUN      ] Endpoint/SlaveEndpointTest.UnauthorizedRequest/2
I0908 17:47:46.756116  5776 containerizer.cpp:292] Using isolation { environment_secret, posix/cpu,
posix/mem, filesystem/posix, network/cni }
W0908 17:47:46.756568  5776 backend.cpp:76] Failed to create 'aufs' backend: AufsBackend requires
root privileges
W0908 17:47:46.756681  5776 backend.cpp:76] Failed to create 'bind' backend: BindBackend requires
root privileges
I0908 17:47:46.756711  5776 provisioner.cpp:255] Using default backend 'copy'
I0908 17:47:46.760058  5812 slave.cpp:252] Mesos agent started on (813)@172.17.0.3:33408
I0908 17:47:46.760087  5812 slave.cpp:253] Flags at startup: --acls="" --appc_simple_discovery_uri_prefix="http://"
--appc_store_dir="/tmp/Endpoint_SlaveEndpointTest_UnauthorizedRequest_2_UtAbNT/store/appc"
--authenticate_http_readonly="true" --authenticate_http_readwrite="true" --authenticatee="crammd5"
--authentication_backoff_factor="1secs" --authorizer="local" --cgroups_cpu_enable_pids_and_tids_count="false"
--cgroups_enable_cfs="false" --cgroups_hierarchy="/sys/fs/cgroup" --cgroups_limit_swap="false"
--cgroups_root="mesos" --container_disk_watch_interval="15secs" --containerizers="mesos" --credential="/tmp/Endpoint_SlaveEndpointTest_UnauthorizedRequest_2_UtAbNT/credential"
--default_role="*" --disallow_sharing_agent_pid_namespace="false" --disk_watch_interval="1mins"
--docker="docker" --docker_kill_orphans="true" --docker_registry="https://registry-1.docker.io"
--docker_remove_delay="6hrs" --docker_socket="/var/run/docker.sock" --docker_stop_timeout="0ns"
--docker_store_dir="/tmp/Endpoint_SlaveEndpointTest_UnauthorizedRequest_2_UtAbNT/store/docker"
--docker_volume_checkpoint_dir="/var/run/mesos/isolators/docker/volume" --enforce_container_disk_quota="false"
--executor_registration_timeout="1mins" --executor_reregistration_timeout="2secs" --executor_shutdown_grace_period="5secs"
--fetcher_cache_dir="/tmp/Endpoint_SlaveEndpointTest_UnauthorizedRequest_2_UtAbNT/fetch" --fetcher_cache_size="2GB"
--frameworks_home="" --gc_delay="1weeks" --gc_disk_headroom="0.1" --hadoop_home="" --help="false"
--hostname_lookup="true" --http_command_executor="false" --http_credentials="/tmp/Endpoint_SlaveEndpointTest_UnauthorizedRequest_2_UtAbNT/http_credentials"
--http_heartbeat_interval="30secs" --initialize_driver_logging="true" --isolation="posix/cpu,posix/mem"
--launcher="posix" --launcher_dir="/mesos/mesos-1.5.0/_build/src" --logbufsecs="0" --logging_level="INFO"
--max_completed_executors_per_framework="150" --oversubscribed_resources_interval="15secs"
--perf_duration="10secs" --perf_interval="1mins" --port="5051" --qos_correction_interval_min="0ns"
--quiet="false" --recover="reconnect" --recovery_timeout="15mins" --registration_backoff_factor="10ms"
--resources="cpus:2;gpus:0;mem:1024;disk:1024;ports:[31000-32000]" --revocable_cpu_low_priority="true"
--runtime_dir="/tmp/Endpoint_SlaveEndpointTest_UnauthorizedRequest_2_UtAbNT" --sandbox_directory="/mnt/mesos/sandbox"
--strict="true" --switch_user="true" --systemd_enable_support="true" --systemd_runtime_directory="/run/systemd/system"
--version="false" --work_dir="/tmp/Endpoint_SlaveEndpointTest_UnauthorizedRequest_2_O6aKH5"
--zk_session_timeout="10secs"
I0908 17:47:46.760481  5812 credentials.hpp:86] Loading credential for authentication from
'/tmp/Endpoint_SlaveEndpointTest_UnauthorizedRequest_2_UtAbNT/credential'
I0908 17:47:46.760689  5812 slave.cpp:285] Agent using credential for: test-principal
I0908 17:47:46.760713  5812 credentials.hpp:37] Loading credentials for authentication from
'/tmp/Endpoint_SlaveEndpointTest_UnauthorizedRequest_2_UtAbNT/http_credentials'
I0908 17:47:46.760964  5812 http.cpp:1045] Creating default 'basic' HTTP authenticator for
realm 'mesos-agent-readonly'
I0908 17:47:46.761132  5812 http.cpp:1045] Creating default 'basic' HTTP authenticator for
realm 'mesos-agent-readwrite'
I0908 17:47:46.762485  5812 slave.cpp:583] Agent resources: [{"name":"cpus","scalar":{"value":2.0},"type":"SCALAR"},{"name":"mem","scalar":{"value":1024.0},"type":"SCALAR"},{"name":"disk","scalar":{"value":1024.0},"type":"SCALAR"},{"name":"ports","ranges":{"range":[{"begin":31000,"end":32000}]},"type":"RANGES"}]
I0908 17:47:46.762714  5812 slave.cpp:591] Agent attributes: [  ]
I0908 17:47:46.762728  5812 slave.cpp:600] Agent hostname: 8eb165f12f17
I0908 17:47:46.762848  5804 status_update_manager.cpp:177] Pausing sending status updates
I0908 17:47:46.764333  5807 state.cpp:64] Recovering state from '/tmp/Endpoint_SlaveEndpointTest_UnauthorizedRequest_2_O6aKH5/meta'
I0908 17:47:46.764601  5807 status_update_manager.cpp:203] Recovering status update manager
I0908 17:47:46.764786  5807 containerizer.cpp:648] Recovering containerizer
I0908 17:47:46.766242  5808 provisioner.cpp:416] Provisioner recovery complete
I0908 17:47:46.766628  5818 slave.cpp:6298] Finished recovery
I0908 17:47:46.767207  5818 slave.cpp:6480] Querying resource estimator for oversubscribable
resources
I0908 17:47:46.767503  5816 slave.cpp:6494] Received oversubscribable resources {} from the
resource estimator
I0908 17:47:46.769821  5798 process.cpp:3929] Handling HTTP event for process 'slave(813)'
with path: '/slave(813)/containers'
I0908 17:47:46.770979  5817 http.cpp:1185] HTTP GET for /slave(813)/containers from 172.17.0.3:40240
I0908 17:47:46.771040  5817 http.cpp:976] Authorizing principal 'test-principal' to GET the
'/containers' endpoint
I0908 17:47:46.773429  5805 slave.cpp:861] Agent terminating
[       OK ] Endpoint/SlaveEndpointTest.UnauthorizedRequest/2 (28 ms)
[ RUN      ] Endpoint/SlaveEndpointTest.NoAuthorizer/0
I0908 17:47:46.785439  5776 containerizer.cpp:292] Using isolation { environment_secret, posix/cpu,
posix/mem, filesystem/posix, network/cni }
W0908 17:47:46.785993  5776 backend.cpp:76] Failed to create 'aufs' backend: AufsBackend requires
root privileges
W0908 17:47:46.786111  5776 backend.cpp:76] Failed to create 'bind' backend: BindBackend requires
root privileges
I0908 17:47:46.786152  5776 provisioner.cpp:255] Using default backend 'copy'
I0908 17:47:46.788153  5776 cluster.cpp:448] Creating default 'local' authorizer
I0908 17:47:46.790246  5801 slave.cpp:252] Mesos agent started on (814)@172.17.0.3:33408
I0908 17:47:46.790266  5801 slave.cpp:253] Flags at startup: --acls="" --appc_simple_discovery_uri_prefix="http://"
--appc_store_dir="/tmp/Endpoint_SlaveEndpointTest_NoAuthorizer_0_6Jitn8/store/appc" --authenticate_http_readonly="true"
--authenticate_http_readwrite="true" --authenticatee="crammd5" --authentication_backoff_factor="1secs"
--authorizer="local" --cgroups_cpu_enable_pids_and_tids_count="false" --cgroups_enable_cfs="false"
--cgroups_hierarchy="/sys/fs/cgroup" --cgroups_limit_swap="false" --cgroups_root="mesos" --container_disk_watch_interval="15secs"
--containerizers="mesos" --credential="/tmp/Endpoint_SlaveEndpointTest_NoAuthorizer_0_6Jitn8/credential"
--default_role="*" --disallow_sharing_agent_pid_namespace="false" --disk_watch_interval="1mins"
--docker="docker" --docker_kill_orphans="true" --docker_registry="https://registry-1.docker.io"
--docker_remove_delay="6hrs" --docker_socket="/var/run/docker.sock" --docker_stop_timeout="0ns"
--docker_store_dir="/tmp/Endpoint_SlaveEndpointTest_NoAuthorizer_0_6Jitn8/store/docker" --docker_volume_checkpoint_dir="/var/run/mesos/isolators/docker/volume"
--enforce_container_disk_quota="false" --executor_registration_timeout="1mins" --executor_reregistration_timeout="2secs"
--executor_shutdown_grace_period="5secs" --fetcher_cache_dir="/tmp/Endpoint_SlaveEndpointTest_NoAuthorizer_0_6Jitn8/fetch"
--fetcher_cache_size="2GB" --frameworks_home="" --gc_delay="1weeks" --gc_disk_headroom="0.1"
--hadoop_home="" --help="false" --hostname_lookup="true" --http_command_executor="false" --http_credentials="/tmp/Endpoint_SlaveEndpointTest_NoAuthorizer_0_6Jitn8/http_credentials"
--http_heartbeat_interval="30secs" --initialize_driver_logging="true" --isolation="posix/cpu,posix/mem"
--launcher="posix" --launcher_dir="/mesos/mesos-1.5.0/_build/src" --logbufsecs="0" --logging_level="INFO"
--max_completed_executors_per_framework="150" --oversubscribed_resources_interval="15secs"
--perf_duration="10secs" --perf_interval="1mins" --port="5051" --qos_correction_interval_min="0ns"
--quiet="false" --recover="reconnect" --recovery_timeout="15mins" --registration_backoff_factor="10ms"
--resources="cpus:2;gpus:0;mem:1024;disk:1024;ports:[31000-32000]" --revocable_cpu_low_priority="true"
--runtime_dir="/tmp/Endpoint_SlaveEndpointTest_NoAuthorizer_0_6Jitn8" --sandbox_directory="/mnt/mesos/sandbox"
--strict="true" --switch_user="true" --systemd_enable_support="true" --systemd_runtime_directory="/run/systemd/system"
--version="false" --work_dir="/tmp/Endpoint_SlaveEndpointTest_NoAuthorizer_0_CvKKdk" --zk_session_timeout="10secs"
I0908 17:47:46.790720  5801 credentials.hpp:86] Loading credential for authentication from
'/tmp/Endpoint_SlaveEndpointTest_NoAuthorizer_0_6Jitn8/credential'
I0908 17:47:46.790879  5801 slave.cpp:285] Agent using credential for: test-principal
I0908 17:47:46.790901  5801 credentials.hpp:37] Loading credentials for authentication from
'/tmp/Endpoint_SlaveEndpointTest_NoAuthorizer_0_6Jitn8/http_credentials'
I0908 17:47:46.791187  5801 http.cpp:1045] Creating default 'basic' HTTP authenticator for
realm 'mesos-agent-readonly'
I0908 17:47:46.791342  5801 http.cpp:1045] Creating default 'basic' HTTP authenticator for
realm 'mesos-agent-readwrite'
I0908 17:47:46.792635  5801 slave.cpp:583] Agent resources: [{"name":"cpus","scalar":{"value":2.0},"type":"SCALAR"},{"name":"mem","scalar":{"value":1024.0},"type":"SCALAR"},{"name":"disk","scalar":{"value":1024.0},"type":"SCALAR"},{"name":"ports","ranges":{"range":[{"begin":31000,"end":32000}]},"type":"RANGES"}]
I0908 17:47:46.792865  5801 slave.cpp:591] Agent attributes: [  ]
I0908 17:47:46.792879  5801 slave.cpp:600] Agent hostname: 8eb165f12f17
I0908 17:47:46.793027  5818 status_update_manager.cpp:177] Pausing sending status updates
I0908 17:47:46.794401  5812 state.cpp:64] Recovering state from '/tmp/Endpoint_SlaveEndpointTest_NoAuthorizer_0_CvKKdk/meta'
I0908 17:47:46.794754  5806 status_update_manager.cpp:203] Recovering status update manager
I0908 17:47:46.794950  5805 containerizer.cpp:648] Recovering containerizer
I0908 17:47:46.796169  5813 provisioner.cpp:416] Provisioner recovery complete
I0908 17:47:46.796528  5796 slave.cpp:6298] Finished recovery
I0908 17:47:46.797112  5796 slave.cpp:6480] Querying resource estimator for oversubscribable
resources
I0908 17:47:46.797366  5795 slave.cpp:6494] Received oversubscribable resources {} from the
resource estimator
I0908 17:47:46.799440  5808 process.cpp:3929] Handling HTTP event for process 'slave(814)'
with path: '/slave(814)/monitor/statistics'
I0908 17:47:46.800773  5809 http.cpp:1185] HTTP GET for /slave(814)/monitor/statistics from
172.17.0.3:40242
I0908 17:47:46.800854  5809 http.cpp:976] Authorizing principal 'test-principal' to GET the
'/monitor/statistics' endpoint
I0908 17:47:46.804486  5776 slave.cpp:861] Agent terminating
[       OK ] Endpoint/SlaveEndpointTest.NoAuthorizer/0 (31 ms)
[ RUN      ] Endpoint/SlaveEndpointTest.NoAuthorizer/1
I0908 17:47:46.817402  5776 containerizer.cpp:292] Using isolation { environment_secret, posix/cpu,
posix/mem, filesystem/posix, network/cni }
W0908 17:47:46.817886  5776 backend.cpp:76] Failed to create 'aufs' backend: AufsBackend requires
root privileges
W0908 17:47:46.818002  5776 backend.cpp:76] Failed to create 'bind' backend: BindBackend requires
root privileges
I0908 17:47:46.818034  5776 provisioner.cpp:255] Using default backend 'copy'
I0908 17:47:46.819831  5776 cluster.cpp:448] Creating default 'local' authorizer
I0908 17:47:46.821737  5795 slave.cpp:252] Mesos agent started on (815)@172.17.0.3:33408
I0908 17:47:46.821763  5795 slave.cpp:253] Flags at startup: --acls="" --appc_simple_discovery_uri_prefix="http://"
--appc_store_dir="/tmp/Endpoint_SlaveEndpointTest_NoAuthorizer_1_2rmwgn/store/appc" --authenticate_http_readonly="true"
--authenticate_http_readwrite="true" --authenticatee="crammd5" --authentication_backoff_factor="1secs"
--authorizer="local" --cgroups_cpu_enable_pids_and_tids_count="false" --cgroups_enable_cfs="false"
--cgroups_hierarchy="/sys/fs/cgroup" --cgroups_limit_swap="false" --cgroups_root="mesos" --container_disk_watch_interval="15secs"
--containerizers="mesos" --credential="/tmp/Endpoint_SlaveEndpointTest_NoAuthorizer_1_2rmwgn/credential"
--default_role="*" --disallow_sharing_agent_pid_namespace="false" --disk_watch_interval="1mins"
--docker="docker" --docker_kill_orphans="true" --docker_registry="https://registry-1.docker.io"
--docker_remove_delay="6hrs" --docker_socket="/var/run/docker.sock" --docker_stop_timeout="0ns"
--docker_store_dir="/tmp/Endpoint_SlaveEndpointTest_NoAuthorizer_1_2rmwgn/store/docker" --docker_volume_checkpoint_dir="/var/run/mesos/isolators/docker/volume"
--enforce_container_disk_quota="false" --executor_registration_timeout="1mins" --executor_reregistration_timeout="2secs"
--executor_shutdown_grace_period="5secs" --fetcher_cache_dir="/tmp/Endpoint_SlaveEndpointTest_NoAuthorizer_1_2rmwgn/fetch"
--fetcher_cache_size="2GB" --frameworks_home="" --gc_delay="1weeks" --gc_disk_headroom="0.1"
--hadoop_home="" --help="false" --hostname_lookup="true" --http_command_executor="false" --http_credentials="/tmp/Endpoint_SlaveEndpointTest_NoAuthorizer_1_2rmwgn/http_credentials"
--http_heartbeat_interval="30secs" --initialize_driver_logging="true" --isolation="posix/cpu,posix/mem"
--launcher="posix" --launcher_dir="/mesos/mesos-1.5.0/_build/src" --logbufsecs="0" --logging_level="INFO"
--max_completed_executors_per_framework="150" --oversubscribed_resources_interval="15secs"
--perf_duration="10secs" --perf_interval="1mins" --port="5051" --qos_correction_interval_min="0ns"
--quiet="false" --recover="reconnect" --recovery_timeout="15mins" --registration_backoff_factor="10ms"
--resources="cpus:2;gpus:0;mem:1024;disk:1024;ports:[31000-32000]" --revocable_cpu_low_priority="true"
--runtime_dir="/tmp/Endpoint_SlaveEndpointTest_NoAuthorizer_1_2rmwgn" --sandbox_directory="/mnt/mesos/sandbox"
--strict="true" --switch_user="true" --systemd_enable_support="true" --systemd_runtime_directory="/run/systemd/system"
--version="false" --work_dir="/tmp/Endpoint_SlaveEndpointTest_NoAuthorizer_1_2MI11y" --zk_session_timeout="10secs"
I0908 17:47:46.822279  5795 credentials.hpp:86] Loading credential for authentication from
'/tmp/Endpoint_SlaveEndpointTest_NoAuthorizer_1_2rmwgn/credential'
I0908 17:47:46.822459  5795 slave.cpp:285] Agent using credential for: test-principal
I0908 17:47:46.822482  5795 credentials.hpp:37] Loading credentials for authentication from
'/tmp/Endpoint_SlaveEndpointTest_NoAuthorizer_1_2rmwgn/http_credentials'
I0908 17:47:46.822815  5795 http.cpp:1045] Creating default 'basic' HTTP authenticator for
realm 'mesos-agent-readonly'
I0908 17:47:46.822991  5795 http.cpp:1045] Creating default 'basic' HTTP authenticator for
realm 'mesos-agent-readwrite'
I0908 17:47:46.824407  5795 slave.cpp:583] Agent resources: [{"name":"cpus","scalar":{"value":2.0},"type":"SCALAR"},{"name":"mem","scalar":{"value":1024.0},"type":"SCALAR"},{"name":"disk","scalar":{"value":1024.0},"type":"SCALAR"},{"name":"ports","ranges":{"range":[{"begin":31000,"end":32000}]},"type":"RANGES"}]
I0908 17:47:46.824718  5795 slave.cpp:591] Agent attributes: [  ]
I0908 17:47:46.824738  5795 slave.cpp:600] Agent hostname: 8eb165f12f17
I0908 17:47:46.824918  5796 status_update_manager.cpp:177] Pausing sending status updates
I0908 17:47:46.826417  5815 state.cpp:64] Recovering state from '/tmp/Endpoint_SlaveEndpointTest_NoAuthorizer_1_2MI11y/meta'
I0908 17:47:46.826763  5813 status_update_manager.cpp:203] Recovering status update manager
I0908 17:47:46.826977  5816 containerizer.cpp:648] Recovering containerizer
I0908 17:47:46.828444  5808 provisioner.cpp:416] Provisioner recovery complete
I0908 17:47:46.828860  5805 slave.cpp:6298] Finished recovery
I0908 17:47:46.829366  5805 slave.cpp:6480] Querying resource estimator for oversubscribable
resources
I0908 17:47:46.829610  5798 slave.cpp:6494] Received oversubscribable resources {} from the
resource estimator
I0908 17:47:46.832219  5810 process.cpp:3929] Handling HTTP event for process 'slave(815)'
with path: '/slave(815)/monitor/statistics.json'
I0908 17:47:46.833868  5800 http.cpp:1185] HTTP GET for /slave(815)/monitor/statistics.json
from 172.17.0.3:40244
I0908 17:47:46.833945  5800 http.cpp:976] Authorizing principal 'test-principal' to GET the
'/monitor/statistics.json' endpoint
I0908 17:47:46.837471  5776 slave.cpp:861] Agent terminating
[       OK ] Endpoint/SlaveEndpointTest.NoAuthorizer/1 (32 ms)
[ RUN      ] Endpoint/SlaveEndpointTest.NoAuthorizer/2
I0908 17:47:46.850308  5776 containerizer.cpp:292] Using isolation { environment_secret, posix/cpu,
posix/mem, filesystem/posix, network/cni }
W0908 17:47:46.850859  5776 backend.cpp:76] Failed to create 'aufs' backend: AufsBackend requires
root privileges
W0908 17:47:46.850980  5776 backend.cpp:76] Failed to create 'bind' backend: BindBackend requires
root privileges
I0908 17:47:46.851022  5776 provisioner.cpp:255] Using default backend 'copy'
I0908 17:47:46.852906  5776 cluster.cpp:448] Creating default 'local' authorizer
I0908 17:47:46.854825  5806 slave.cpp:252] Mesos agent started on (816)@172.17.0.3:33408
I0908 17:47:46.854849  5806 slave.cpp:253] Flags at startup: --acls="" --appc_simple_discovery_uri_prefix="http://"
--appc_store_dir="/tmp/Endpoint_SlaveEndpointTest_NoAuthorizer_2_qWKWsC/store/appc" --authenticate_http_readonly="true"
--authenticate_http_readwrite="true" --authenticatee="crammd5" --authentication_backoff_factor="1secs"
--authorizer="local" --cgroups_cpu_enable_pids_and_tids_count="false" --cgroups_enable_cfs="false"
--cgroups_hierarchy="/sys/fs/cgroup" --cgroups_limit_swap="false" --cgroups_root="mesos" --container_disk_watch_interval="15secs"
--containerizers="mesos" --credential="/tmp/Endpoint_SlaveEndpointTest_NoAuthorizer_2_qWKWsC/credential"
--default_role="*" --disallow_sharing_agent_pid_namespace="false" --disk_watch_interval="1mins"
--docker="docker" --docker_kill_orphans="true" --docker_registry="https://registry-1.docker.io"
--docker_remove_delay="6hrs" --docker_socket="/var/run/docker.sock" --docker_stop_timeout="0ns"
--docker_store_dir="/tmp/Endpoint_SlaveEndpointTest_NoAuthorizer_2_qWKWsC/store/docker" --docker_volume_checkpoint_dir="/var/run/mesos/isolators/docker/volume"
--enforce_container_disk_quota="false" --executor_registration_timeout="1mins" --executor_reregistration_timeout="2secs"
--executor_shutdown_grace_period="5secs" --fetcher_cache_dir="/tmp/Endpoint_SlaveEndpointTest_NoAuthorizer_2_qWKWsC/fetch"
--fetcher_cache_size="2GB" --frameworks_home="" --gc_delay="1weeks" --gc_disk_headroom="0.1"
--hadoop_home="" --help="false" --hostname_lookup="true" --http_command_executor="false" --http_credentials="/tmp/Endpoint_SlaveEndpointTest_NoAuthorizer_2_qWKWsC/http_credentials"
--http_heartbeat_interval="30secs" --initialize_driver_logging="true" --isolation="posix/cpu,posix/mem"
--launcher="posix" --launcher_dir="/mesos/mesos-1.5.0/_build/src" --logbufsecs="0" --logging_level="INFO"
--max_completed_executors_per_framework="150" --oversubscribed_resources_interval="15secs"
--perf_duration="10secs" --perf_interval="1mins" --port="5051" --qos_correction_interval_min="0ns"
--quiet="false" --recover="reconnect" --recovery_timeout="15mins" --registration_backoff_factor="10ms"
--resources="cpus:2;gpus:0;mem:1024;disk:1024;ports:[31000-32000]" --revocable_cpu_low_priority="true"
--runtime_dir="/tmp/Endpoint_SlaveEndpointTest_NoAuthorizer_2_qWKWsC" --sandbox_directory="/mnt/mesos/sandbox"
--strict="true" --switch_user="true" --systemd_enable_support="true" --systemd_runtime_directory="/run/systemd/system"
--version="false" --work_dir="/tmp/Endpoint_SlaveEndpointTest_NoAuthorizer_2_OicA9N" --zk_session_timeout="10secs"
I0908 17:47:46.855253  5806 credentials.hpp:86] Loading credential for authentication from
'/tmp/Endpoint_SlaveEndpointTest_NoAuthorizer_2_qWKWsC/credential'
I0908 17:47:46.855403  5806 slave.cpp:285] Agent using credential for: test-principal
I0908 17:47:46.855425  5806 credentials.hpp:37] Loading credentials for authentication from
'/tmp/Endpoint_SlaveEndpointTest_NoAuthorizer_2_qWKWsC/http_credentials'
I0908 17:47:46.855729  5806 http.cpp:1045] Creating default 'basic' HTTP authenticator for
realm 'mesos-agent-readonly'
I0908 17:47:46.855906  5806 http.cpp:1045] Creating default 'basic' HTTP authenticator for
realm 'mesos-agent-readwrite'
I0908 17:47:46.857460  5806 slave.cpp:583] Agent resources: [{"name":"cpus","scalar":{"value":2.0},"type":"SCALAR"},{"name":"mem","scalar":{"value":1024.0},"type":"SCALAR"},{"name":"disk","scalar":{"value":1024.0},"type":"SCALAR"},{"name":"ports","ranges":{"range":[{"begin":31000,"end":32000}]},"type":"RANGES"}]
I0908 17:47:46.857692  5806 slave.cpp:591] Agent attributes: [  ]
I0908 17:47:46.857704  5806 slave.cpp:600] Agent hostname: 8eb165f12f17
I0908 17:47:46.857894  5815 status_update_manager.cpp:177] Pausing sending status updates
I0908 17:47:46.859237  5796 state.cpp:64] Recovering state from '/tmp/Endpoint_SlaveEndpointTest_NoAuthorizer_2_OicA9N/meta'
I0908 17:47:46.859568  5802 status_update_manager.cpp:203] Recovering status update manager
I0908 17:47:46.859757  5802 containerizer.cpp:648] Recovering containerizer
I0908 17:47:46.861518  5813 provisioner.cpp:416] Provisioner recovery complete
I0908 17:47:46.861917  5800 slave.cpp:6298] Finished recovery
I0908 17:47:46.862370  5800 slave.cpp:6480] Querying resource estimator for oversubscribable
resources
I0908 17:47:46.862615  5803 slave.cpp:6494] Received oversubscribable resources {} from the
resource estimator
I0908 17:47:46.865553  5810 process.cpp:3929] Handling HTTP event for process 'slave(816)'
with path: '/slave(816)/containers'
I0908 17:47:46.867342  5818 http.cpp:1185] HTTP GET for /slave(816)/containers from 172.17.0.3:40248
I0908 17:47:46.867462  5818 http.cpp:976] Authorizing principal 'test-principal' to GET the
'/containers' endpoint
I0908 17:47:46.872439  5776 slave.cpp:861] Agent terminating
[       OK ] Endpoint/SlaveEndpointTest.NoAuthorizer/2 (36 ms)
[----------] 9 tests from Endpoint/SlaveEndpointTest (298 ms total)

[----------] 2 tests from ContainerizerType/DefaultContainerDNSFlagTest
[ RUN      ] ContainerizerType/DefaultContainerDNSFlagTest.ValidateFlag/0
[       OK ] ContainerizerType/DefaultContainerDNSFlagTest.ValidateFlag/0 (14 ms)
[ RUN      ] ContainerizerType/DefaultContainerDNSFlagTest.ValidateFlag/1
[       OK ] ContainerizerType/DefaultContainerDNSFlagTest.ValidateFlag/1 (12 ms)
[----------] 2 tests from ContainerizerType/DefaultContainerDNSFlagTest (26 ms total)

[----------] Global test environment tear-down
[==========] 1667 tests from 183 test cases ran. (628506 ms total)
[  PASSED  ] 1666 tests.
[  FAILED  ] 1 test, listed below:
[  FAILED  ] ExamplesTest.NoExecutorFramework

 1 FAILED TEST
  YOU HAVE 20 DISABLED TESTS

I0908 17:47:46.989810  5819 process.cpp:1068] Failed to accept socket: future discarded
make[4]: *** [check-local] Error 1
make[4]: Leaving directory `/mesos/mesos-1.5.0/_build/src'
make[3]: *** [check-am] Error 2
make[3]: Leaving directory `/mesos/mesos-1.5.0/_build/src'
make[2]: *** [check] Error 2
make[2]: Leaving directory `/mesos/mesos-1.5.0/_build/src'
make[1]: *** [check-recursive] Error 1
make[1]: Leaving directory `/mesos/mesos-1.5.0/_build'
make: *** [distcheck] Error 1
+ docker rmi mesos-1504889488-15769
Untagged: mesos-1504889488-15769:latest
Deleted: sha256:219c2455984d76bb1a8f54a2b14312f765e96f4ce978f479b67a2bd8f1bfb1de
Deleted: sha256:1289a045046ed89fe2d85db3919623df5867c93a179af1fa2093a8201321c157
Deleted: sha256:319c8a56291f31046f8884af1d41d4ce01f49c75deb4413ede2ebcd59e0d23d8
Deleted: sha256:b20e8b6a18390fb89486b81f322cafc0405a278ed5478199ee5388337c105cf0
Deleted: sha256:a50779608b31255520f5df2d256d1fa8695da50e71bad9a85c748039784efaf3
Deleted: sha256:c0f5ae324e09306ebcbe6d7fb221b33f3e633a1c1133efd61448b244d5501deb
Deleted: sha256:8a52a7d1bee2583324699750c90bc420961eee0f991160a9231aacbe9050f3dc
Deleted: sha256:271e7ab499150520023ec4de14eac8d4baadc6ba4758257c0e2ae628e0ea5c47
Deleted: sha256:3fe51767c73b14afc9ceb5f4f09b3808adc605b45adfccff67f9940c1b3e0717
Deleted: sha256:eefb51e4403cb91533120a3ba8390cbf6797ea0a7231f3e845be6106a8e8beba
Deleted: sha256:d571367ba02f7546267a261e19daf5100cd20bc330d95d4bc971cfa46bd1513e
Deleted: sha256:ce31a47dd0cbebc7f47fd342a19dc757975b503e2005f16039d5b1a812eeeb5e
Deleted: sha256:7b31abbeac3706cb4805c606b7294911ecae47aafe6a54f73d878b2bf598cc30
Deleted: sha256:f04d21820b63de02b6adc7d3f5bcbbd4c3abfa49b5b2bc1c1804f5af2654720e
Deleted: sha256:2e106dade72a1d87117a86c10711910e931d3801d97582c915e9b15723646319
Deleted: sha256:20e2b1ed1650d79e15a0515e84554975ca99e7ae84f29ad5a4a39f8262d5233e
Deleted: sha256:c983972ca8a047ed7048b78bc5016338788599f8101b3e2f0f6b49bc7e17c088
Deleted: sha256:8368b0de2370312af2f883787413e1de4c0903ca0c15a32dcad4940dfe97be41
Deleted: sha256:8bd997f5dfc8eac8b0aee6ccccb5bacbc6069942a8ac247d6adc8f0d785da963
Deleted: sha256:8969d76d8653c10eaf5855e5c45b7f0f90d60b12be44664dec84fe445dbf241d
Deleted: sha256:71a88dfe011c92fe382daff385ca33670abb2481a552f4308625da14711c4acb
Deleted: sha256:fa327fd59918f7f78982cfcdff17bf1a4e684979f5bda367195b90de43297f4d
Deleted: sha256:fe4bef6571d2c31af06ecce67a2d313bdbd33d2cc4b62a9c50e5d7164d5762b5
Deleted: sha256:569228f17e48e3dc2462fd87f792775827b595fe10448a58bad881790c2662e8
Deleted: sha256:6e76107e5cf3d63f926fdb0d76fe69e990c9724f94d2b98f6f309a2cd7258546
Deleted: sha256:c9072c6ef5dbe3aad88e2e31ab74e00edd7ea2dfa2d19a74619c9fa914cafdcd
Deleted: sha256:bc0c72fc8a391cce695e3562308e93fc2d9702a0f37a5a8bd6045876c3324495
Deleted: sha256:974aac17aa9afec7763684b0cf99744bf5166a991d714f25577dccd276f22154
Build step 'Execute shell' marked build as failure

Mime
View raw message