mesos-builds mailing list archives

Site index · List index
Message view « Date » · « Thread »
Top « Date » · « Thread »
From Apache Jenkins Server <jenk...@builds.apache.org>
Subject Build failed in Jenkins: Mesos-Buildbot » cmake,clang,--verbose --enable-libevent --enable-ssl,GLOG_v=1 MESOS_VERBOSE=1,ubuntu:14.04,(ubuntu)&&(!ubuntu-us1)&&(!ubuntu-eu2)&&(!qnode3)&&(!H23) #4244
Date Wed, 20 Sep 2017 05:54:17 GMT
See <https://builds.apache.org/job/Mesos-Buildbot/BUILDTOOL=cmake,COMPILER=clang,CONFIGURATION=--verbose%20--enable-libevent%20--enable-ssl,ENVIRONMENT=GLOG_v=1%20MESOS_VERBOSE=1,OS=ubuntu%3A14.04,label_exp=(ubuntu)&&(!ubuntu-us1)&&(!ubuntu-eu2)&&(!qnode3)&&(!H23)/4244/display/redirect>

------------------------------------------
[...truncated 30.95 MB...]
3: I0920 05:54:06.289634 26262 slave.cpp:252] Mesos agent started on (815)@172.17.0.2:43433
3: I0920 05:54:06.289682 26262 slave.cpp:253] Flags at startup: --acls="" --appc_simple_discovery_uri_prefix="http://"
--appc_store_dir="/tmp/Endpoint_SlaveEndpointTest_UnauthorizedRequest_0_y5XbFl/store/appc"
--authenticate_http_executors="true" --authenticate_http_readonly="true" --authenticate_http_readwrite="true"
--authenticatee="crammd5" --authentication_backoff_factor="1secs" --authorizer="local" --cgroups_cpu_enable_pids_and_tids_count="false"
--cgroups_enable_cfs="false" --cgroups_hierarchy="/sys/fs/cgroup" --cgroups_limit_swap="false"
--cgroups_root="mesos" --container_disk_watch_interval="15secs" --containerizers="mesos" --credential="/tmp/Endpoint_SlaveEndpointTest_UnauthorizedRequest_0_y5XbFl/credential"
--default_role="*" --disallow_sharing_agent_pid_namespace="false" --disk_watch_interval="1mins"
--docker="docker" --docker_kill_orphans="true" --docker_registry="https://registry-1.docker.io"
--docker_remove_delay="6hrs" --docker_socket="/var/run/docker.sock" --docker_stop_timeout="0ns"
--docker_store_dir="/tmp/Endpoint_SlaveEndpointTest_UnauthorizedRequest_0_y5XbFl/store/docker"
--docker_volume_checkpoint_dir="/var/run/mesos/isolators/docker/volume" --enforce_container_disk_quota="false"
--executor_registration_timeout="1mins" --executor_reregistration_timeout="2secs" --executor_secret_key="/tmp/Endpoint_SlaveEndpointTest_UnauthorizedRequest_0_y5XbFl/executor_secret_key"
--executor_shutdown_grace_period="5secs" --fetcher_cache_dir="/tmp/Endpoint_SlaveEndpointTest_UnauthorizedRequest_0_y5XbFl/fetch"
--fetcher_cache_size="2GB" --frameworks_home="" --gc_delay="1weeks" --gc_disk_headroom="0.1"
--hadoop_home="" --help="false" --hostname_lookup="true" --http_command_executor="false" --http_credentials="/tmp/Endpoint_SlaveEndpointTest_UnauthorizedRequest_0_y5XbFl/http_credentials"
--http_heartbeat_interval="30secs" --initialize_driver_logging="true" --isolation="posix/cpu,posix/mem"
--launcher="posix" --launcher_dir="/mesos/build/src" --logbufsecs="0" --logging_level="INFO"
--max_completed_executors_per_framework="150" --oversubscribed_resources_interval="15secs"
--perf_duration="10secs" --perf_interval="1mins" --port="5051" --qos_correction_interval_min="0ns"
--quiet="false" --recover="reconnect" --recovery_timeout="15mins" --registration_backoff_factor="10ms"
--resources="cpus:2;gpus:0;mem:1024;disk:1024;ports:[31000-32000]" --revocable_cpu_low_priority="true"
--runtime_dir="/tmp/Endpoint_SlaveEndpointTest_UnauthorizedRequest_0_y5XbFl" --sandbox_directory="/mnt/mesos/sandbox"
--strict="true" --switch_user="true" --systemd_enable_support="true" --systemd_runtime_directory="/run/systemd/system"
--version="false" --work_dir="/tmp/Endpoint_SlaveEndpointTest_UnauthorizedRequest_0_IxjlDM"
--zk_session_timeout="10secs"
3: I0920 05:54:06.290355 26262 credentials.hpp:86] Loading credential for authentication from
'/tmp/Endpoint_SlaveEndpointTest_UnauthorizedRequest_0_y5XbFl/credential'
3: I0920 05:54:06.290541 26262 slave.cpp:285] Agent using credential for: test-principal
3: I0920 05:54:06.290563 26262 credentials.hpp:37] Loading credentials for authentication
from '/tmp/Endpoint_SlaveEndpointTest_UnauthorizedRequest_0_y5XbFl/http_credentials'
3: I0920 05:54:06.290850 26262 http.cpp:1045] Creating default 'basic' HTTP authenticator
for realm 'mesos-agent-executor'
3: I0920 05:54:06.290971 26262 http.cpp:1066] Creating default 'jwt' HTTP authenticator for
realm 'mesos-agent-executor'
3: I0920 05:54:06.291172 26262 http.cpp:1045] Creating default 'basic' HTTP authenticator
for realm 'mesos-agent-readonly'
3: I0920 05:54:06.291263 26262 http.cpp:1066] Creating default 'jwt' HTTP authenticator for
realm 'mesos-agent-readonly'
3: I0920 05:54:06.291458 26262 http.cpp:1045] Creating default 'basic' HTTP authenticator
for realm 'mesos-agent-readwrite'
3: I0920 05:54:06.291568 26262 http.cpp:1066] Creating default 'jwt' HTTP authenticator for
realm 'mesos-agent-readwrite'
3: I0920 05:54:06.292937 26262 slave.cpp:583] Agent resources: [{"name":"cpus","scalar":{"value":2.0},"type":"SCALAR"},{"name":"mem","scalar":{"value":1024.0},"type":"SCALAR"},{"name":"disk","scalar":{"value":1024.0},"type":"SCALAR"},{"name":"ports","ranges":{"range":[{"begin":31000,"end":32000}]},"type":"RANGES"}]
3: I0920 05:54:06.293133 26262 slave.cpp:591] Agent attributes: [  ]
3: I0920 05:54:06.293143 26262 slave.cpp:600] Agent hostname: d55e55df34d0
3: I0920 05:54:06.293326 26245 status_update_manager.cpp:177] Pausing sending status updates
3: I0920 05:54:06.294503 26243 state.cpp:64] Recovering state from '/tmp/Endpoint_SlaveEndpointTest_UnauthorizedRequest_0_IxjlDM/meta'
3: I0920 05:54:06.294878 26247 status_update_manager.cpp:203] Recovering status update manager
3: I0920 05:54:06.295217 26257 containerizer.cpp:648] Recovering containerizer
3: I0920 05:54:06.296774 26256 provisioner.cpp:416] Provisioner recovery complete
3: I0920 05:54:06.297276 26255 slave.cpp:6320] Finished recovery
3: I0920 05:54:06.297881 26255 slave.cpp:6502] Querying resource estimator for oversubscribable
resources
3: I0920 05:54:06.298189 26249 slave.cpp:6516] Received oversubscribable resources {} from
the resource estimator
3: I0920 05:54:06.300427 26246 process.cpp:3929] Handling HTTP event for process 'slave(815)'
with path: '/slave(815)/monitor/statistics'
3: I0920 05:54:06.302346 26265 http.cpp:1185] HTTP GET for /slave(815)/monitor/statistics
from 172.17.0.2:57230
3: I0920 05:54:06.302441 26265 http.cpp:976] Authorizing principal 'test-principal' to GET
the '/monitor/statistics' endpoint
3: I0920 05:54:06.305553 18171 slave.cpp:867] Agent terminating
3: [       OK ] Endpoint/SlaveEndpointTest.UnauthorizedRequest/0 (39 ms)
3: [ RUN      ] Endpoint/SlaveEndpointTest.UnauthorizedRequest/1
3: I0920 05:54:06.320610 18171 containerizer.cpp:292] Using isolation { environment_secret,
posix/cpu, posix/mem, filesystem/posix, network/cni }
3: W0920 05:54:06.321184 18171 backend.cpp:76] Failed to create 'aufs' backend: AufsBackend
requires root privileges
3: W0920 05:54:06.321305 18171 backend.cpp:76] Failed to create 'bind' backend: BindBackend
requires root privileges
3: I0920 05:54:06.321347 18171 provisioner.cpp:255] Using default backend 'copy'
3: I0920 05:54:06.325403 26263 slave.cpp:252] Mesos agent started on (816)@172.17.0.2:43433
3: I0920 05:54:06.325435 26263 slave.cpp:253] Flags at startup: --acls="" --appc_simple_discovery_uri_prefix="http://"
--appc_store_dir="/tmp/Endpoint_SlaveEndpointTest_UnauthorizedRequest_1_UkyG6B/store/appc"
--authenticate_http_executors="true" --authenticate_http_readonly="true" --authenticate_http_readwrite="true"
--authenticatee="crammd5" --authentication_backoff_factor="1secs" --authorizer="local" --cgroups_cpu_enable_pids_and_tids_count="false"
--cgroups_enable_cfs="false" --cgroups_hierarchy="/sys/fs/cgroup" --cgroups_limit_swap="false"
--cgroups_root="mesos" --container_disk_watch_interval="15secs" --containerizers="mesos" --credential="/tmp/Endpoint_SlaveEndpointTest_UnauthorizedRequest_1_UkyG6B/credential"
--default_role="*" --disallow_sharing_agent_pid_namespace="false" --disk_watch_interval="1mins"
--docker="docker" --docker_kill_orphans="true" --docker_registry="https://registry-1.docker.io"
--docker_remove_delay="6hrs" --docker_socket="/var/run/docker.sock" --docker_stop_timeout="0ns"
--docker_store_dir="/tmp/Endpoint_SlaveEndpointTest_UnauthorizedRequest_1_UkyG6B/store/docker"
--docker_volume_checkpoint_dir="/var/run/mesos/isolators/docker/volume" --enforce_container_disk_quota="false"
--executor_registration_timeout="1mins" --executor_reregistration_timeout="2secs" --executor_secret_key="/tmp/Endpoint_SlaveEndpointTest_UnauthorizedRequest_1_UkyG6B/executor_secret_key"
--executor_shutdown_grace_period="5secs" --fetcher_cache_dir="/tmp/Endpoint_SlaveEndpointTest_UnauthorizedRequest_1_UkyG6B/fetch"
--fetcher_cache_size="2GB" --frameworks_home="" --gc_delay="1weeks" --gc_disk_headroom="0.1"
--hadoop_home="" --help="false" --hostname_lookup="true" --http_command_executor="false" --http_credentials="/tmp/Endpoint_SlaveEndpointTest_UnauthorizedRequest_1_UkyG6B/http_credentials"
--http_heartbeat_interval="30secs" --initialize_driver_logging="true" --isolation="posix/cpu,posix/mem"
--launcher="posix" --launcher_dir="/mesos/build/src" --logbufsecs="0" --logging_level="INFO"
--max_completed_executors_per_framework="150" --oversubscribed_resources_interval="15secs"
--perf_duration="10secs" --perf_interval="1mins" --port="5051" --qos_correction_interval_min="0ns"
--quiet="false" --recover="reconnect" --recovery_timeout="15mins" --registration_backoff_factor="10ms"
--resources="cpus:2;gpus:0;mem:1024;disk:1024;ports:[31000-32000]" --revocable_cpu_low_priority="true"
--runtime_dir="/tmp/Endpoint_SlaveEndpointTest_UnauthorizedRequest_1_UkyG6B" --sandbox_directory="/mnt/mesos/sandbox"
--strict="true" --switch_user="true" --systemd_enable_support="true" --systemd_runtime_directory="/run/systemd/system"
--version="false" --work_dir="/tmp/Endpoint_SlaveEndpointTest_UnauthorizedRequest_1_XOnWY2"
--zk_session_timeout="10secs"
3: I0920 05:54:06.325819 26263 credentials.hpp:86] Loading credential for authentication from
'/tmp/Endpoint_SlaveEndpointTest_UnauthorizedRequest_1_UkyG6B/credential'
3: I0920 05:54:06.325963 26263 slave.cpp:285] Agent using credential for: test-principal
3: I0920 05:54:06.325980 26263 credentials.hpp:37] Loading credentials for authentication
from '/tmp/Endpoint_SlaveEndpointTest_UnauthorizedRequest_1_UkyG6B/http_credentials'
3: I0920 05:54:06.326225 26263 http.cpp:1045] Creating default 'basic' HTTP authenticator
for realm 'mesos-agent-executor'
3: I0920 05:54:06.326335 26263 http.cpp:1066] Creating default 'jwt' HTTP authenticator for
realm 'mesos-agent-executor'
3: I0920 05:54:06.326524 26263 http.cpp:1045] Creating default 'basic' HTTP authenticator
for realm 'mesos-agent-readonly'
3: I0920 05:54:06.326611 26263 http.cpp:1066] Creating default 'jwt' HTTP authenticator for
realm 'mesos-agent-readonly'
3: I0920 05:54:06.326776 26263 http.cpp:1045] Creating default 'basic' HTTP authenticator
for realm 'mesos-agent-readwrite'
3: I0920 05:54:06.326864 26263 http.cpp:1066] Creating default 'jwt' HTTP authenticator for
realm 'mesos-agent-readwrite'
3: I0920 05:54:06.328169 26263 slave.cpp:583] Agent resources: [{"name":"cpus","scalar":{"value":2.0},"type":"SCALAR"},{"name":"mem","scalar":{"value":1024.0},"type":"SCALAR"},{"name":"disk","scalar":{"value":1024.0},"type":"SCALAR"},{"name":"ports","ranges":{"range":[{"begin":31000,"end":32000}]},"type":"RANGES"}]
3: I0920 05:54:06.328368 26263 slave.cpp:591] Agent attributes: [  ]
3: I0920 05:54:06.328377 26263 slave.cpp:600] Agent hostname: d55e55df34d0
3: I0920 05:54:06.328541 26261 status_update_manager.cpp:177] Pausing sending status updates
3: I0920 05:54:06.330065 26251 state.cpp:64] Recovering state from '/tmp/Endpoint_SlaveEndpointTest_UnauthorizedRequest_1_XOnWY2/meta'
3: I0920 05:54:06.330374 26251 status_update_manager.cpp:203] Recovering status update manager
3: I0920 05:54:06.330562 26246 containerizer.cpp:648] Recovering containerizer
3: I0920 05:54:06.332186 26243 provisioner.cpp:416] Provisioner recovery complete
3: I0920 05:54:06.332801 26255 slave.cpp:6320] Finished recovery
3: I0920 05:54:06.333271 26255 slave.cpp:6502] Querying resource estimator for oversubscribable
resources
3: I0920 05:54:06.333520 26259 slave.cpp:6516] Received oversubscribable resources {} from
the resource estimator
3: I0920 05:54:06.335690 26248 process.cpp:3929] Handling HTTP event for process 'slave(816)'
with path: '/slave(816)/monitor/statistics.json'
3: I0920 05:54:06.337805 26243 http.cpp:1185] HTTP GET for /slave(816)/monitor/statistics.json
from 172.17.0.2:57232
3: I0920 05:54:06.337949 26243 http.cpp:976] Authorizing principal 'test-principal' to GET
the '/monitor/statistics.json' endpoint
3: I0920 05:54:06.340517 18171 slave.cpp:867] Agent terminating
3: [       OK ] Endpoint/SlaveEndpointTest.UnauthorizedRequest/1 (32 ms)
3: [ RUN      ] Endpoint/SlaveEndpointTest.UnauthorizedRequest/2
3: I0920 05:54:06.352133 18171 containerizer.cpp:292] Using isolation { environment_secret,
posix/cpu, posix/mem, filesystem/posix, network/cni }
3: W0920 05:54:06.352612 18171 backend.cpp:76] Failed to create 'aufs' backend: AufsBackend
requires root privileges
3: W0920 05:54:06.352726 18171 backend.cpp:76] Failed to create 'bind' backend: BindBackend
requires root privileges
3: I0920 05:54:06.352764 18171 provisioner.cpp:255] Using default backend 'copy'
3: I0920 05:54:06.356004 26247 slave.cpp:252] Mesos agent started on (817)@172.17.0.2:43433
3: I0920 05:54:06.356034 26247 slave.cpp:253] Flags at startup: --acls="" --appc_simple_discovery_uri_prefix="http://"
--appc_store_dir="/tmp/Endpoint_SlaveEndpointTest_UnauthorizedRequest_2_028URS/store/appc"
--authenticate_http_executors="true" --authenticate_http_readonly="true" --authenticate_http_readwrite="true"
--authenticatee="crammd5" --authentication_backoff_factor="1secs" --authorizer="local" --cgroups_cpu_enable_pids_and_tids_count="false"
--cgroups_enable_cfs="false" --cgroups_hierarchy="/sys/fs/cgroup" --cgroups_limit_swap="false"
--cgroups_root="mesos" --container_disk_watch_interval="15secs" --containerizers="mesos" --credential="/tmp/Endpoint_SlaveEndpointTest_UnauthorizedRequest_2_028URS/credential"
--default_role="*" --disallow_sharing_agent_pid_namespace="false" --disk_watch_interval="1mins"
--docker="docker" --docker_kill_orphans="true" --docker_registry="https://registry-1.docker.io"
--docker_remove_delay="6hrs" --docker_socket="/var/run/docker.sock" --docker_stop_timeout="0ns"
--docker_store_dir="/tmp/Endpoint_SlaveEndpointTest_UnauthorizedRequest_2_028URS/store/docker"
--docker_volume_checkpoint_dir="/var/run/mesos/isolators/docker/volume" --enforce_container_disk_quota="false"
--executor_registration_timeout="1mins" --executor_reregistration_timeout="2secs" --executor_secret_key="/tmp/Endpoint_SlaveEndpointTest_UnauthorizedRequest_2_028URS/executor_secret_key"
--executor_shutdown_grace_period="5secs" --fetcher_cache_dir="/tmp/Endpoint_SlaveEndpointTest_UnauthorizedRequest_2_028URS/fetch"
--fetcher_cache_size="2GB" --frameworks_home="" --gc_delay="1weeks" --gc_disk_headroom="0.1"
--hadoop_home="" --help="false" --hostname_lookup="true" --http_command_executor="false" --http_credentials="/tmp/Endpoint_SlaveEndpointTest_UnauthorizedRequest_2_028URS/http_credentials"
--http_heartbeat_interval="30secs" --initialize_driver_logging="true" --isolation="posix/cpu,posix/mem"
--launcher="posix" --launcher_dir="/mesos/build/src" --logbufsecs="0" --logging_level="INFO"
--max_completed_executors_per_framework="150" --oversubscribed_resources_interval="15secs"
--perf_duration="10secs" --perf_interval="1mins" --port="5051" --qos_correction_interval_min="0ns"
--quiet="false" --recover="reconnect" --recovery_timeout="15mins" --registration_backoff_factor="10ms"
--resources="cpus:2;gpus:0;mem:1024;disk:1024;ports:[31000-32000]" --revocable_cpu_low_priority="true"
--runtime_dir="/tmp/Endpoint_SlaveEndpointTest_UnauthorizedRequest_2_028URS" --sandbox_directory="/mnt/mesos/sandbox"
--strict="true" --switch_user="true" --systemd_enable_support="true" --systemd_runtime_directory="/run/systemd/system"
--version="false" --work_dir="/tmp/Endpoint_SlaveEndpointTest_UnauthorizedRequest_2_lL9pFj"
--zk_session_timeout="10secs"
3: I0920 05:54:06.356449 26247 credentials.hpp:86] Loading credential for authentication from
'/tmp/Endpoint_SlaveEndpointTest_UnauthorizedRequest_2_028URS/credential'
3: I0920 05:54:06.356606 26247 slave.cpp:285] Agent using credential for: test-principal
3: I0920 05:54:06.356622 26247 credentials.hpp:37] Loading credentials for authentication
from '/tmp/Endpoint_SlaveEndpointTest_UnauthorizedRequest_2_028URS/http_credentials'
3: I0920 05:54:06.357066 26247 http.cpp:1045] Creating default 'basic' HTTP authenticator
for realm 'mesos-agent-executor'
3: I0920 05:54:06.357224 26247 http.cpp:1066] Creating default 'jwt' HTTP authenticator for
realm 'mesos-agent-executor'
3: I0920 05:54:06.357553 26247 http.cpp:1045] Creating default 'basic' HTTP authenticator
for realm 'mesos-agent-readonly'
3: I0920 05:54:06.357668 26247 http.cpp:1066] Creating default 'jwt' HTTP authenticator for
realm 'mesos-agent-readonly'
3: I0920 05:54:06.357949 26247 http.cpp:1045] Creating default 'basic' HTTP authenticator
for realm 'mesos-agent-readwrite'
3: I0920 05:54:06.358054 26247 http.cpp:1066] Creating default 'jwt' HTTP authenticator for
realm 'mesos-agent-readwrite'
3: I0920 05:54:06.360154 26247 slave.cpp:583] Agent resources: [{"name":"cpus","scalar":{"value":2.0},"type":"SCALAR"},{"name":"mem","scalar":{"value":1024.0},"type":"SCALAR"},{"name":"disk","scalar":{"value":1024.0},"type":"SCALAR"},{"name":"ports","ranges":{"range":[{"begin":31000,"end":32000}]},"type":"RANGES"}]
3: I0920 05:54:06.360517 26247 slave.cpp:591] Agent attributes: [  ]
3: I0920 05:54:06.360532 26247 slave.cpp:600] Agent hostname: d55e55df34d0
3: I0920 05:54:06.360769 26246 status_update_manager.cpp:177] Pausing sending status updates
3: I0920 05:54:06.362529 26261 state.cpp:64] Recovering state from '/tmp/Endpoint_SlaveEndpointTest_UnauthorizedRequest_2_lL9pFj/meta'
3: I0920 05:54:06.362808 26249 status_update_manager.cpp:203] Recovering status update manager
3: I0920 05:54:06.362987 26249 containerizer.cpp:648] Recovering containerizer
3: I0920 05:54:06.364267 26245 provisioner.cpp:416] Provisioner recovery complete
3: I0920 05:54:06.364629 26257 slave.cpp:6320] Finished recovery
3: I0920 05:54:06.365193 26257 slave.cpp:6502] Querying resource estimator for oversubscribable
resources
3: I0920 05:54:06.365481 26258 slave.cpp:6516] Received oversubscribable resources {} from
the resource estimator
3: I0920 05:54:06.367396 26242 process.cpp:3929] Handling HTTP event for process 'slave(817)'
with path: '/slave(817)/containers'
3: I0920 05:54:06.369223 26246 http.cpp:1185] HTTP GET for /slave(817)/containers from 172.17.0.2:57234
3: I0920 05:54:06.369292 26246 http.cpp:976] Authorizing principal 'test-principal' to GET
the '/containers' endpoint
3: I0920 05:54:06.371922 26251 slave.cpp:867] Agent terminating
3: [       OK ] Endpoint/SlaveEndpointTest.UnauthorizedRequest/2 (33 ms)
3: [ RUN      ] Endpoint/SlaveEndpointTest.NoAuthorizer/0
3: I0920 05:54:06.386756 18171 containerizer.cpp:292] Using isolation { environment_secret,
posix/cpu, posix/mem, filesystem/posix, network/cni }
3: W0920 05:54:06.387217 18171 backend.cpp:76] Failed to create 'aufs' backend: AufsBackend
requires root privileges
3: W0920 05:54:06.387313 18171 backend.cpp:76] Failed to create 'bind' backend: BindBackend
requires root privileges
3: I0920 05:54:06.387344 18171 provisioner.cpp:255] Using default backend 'copy'
3: I0920 05:54:06.389190 18171 cluster.cpp:448] Creating default 'local' authorizer
3: I0920 05:54:06.391031 26262 slave.cpp:252] Mesos agent started on (818)@172.17.0.2:43433
3: I0920 05:54:06.391065 26262 slave.cpp:253] Flags at startup: --acls="" --appc_simple_discovery_uri_prefix="http://"
--appc_store_dir="/tmp/Endpoint_SlaveEndpointTest_NoAuthorizer_0_qwZbX9/store/appc" --authenticate_http_executors="true"
--authenticate_http_readonly="true" --authenticate_http_readwrite="true" --authenticatee="crammd5"
--authentication_backoff_factor="1secs" --authorizer="local" --cgroups_cpu_enable_pids_and_tids_count="false"
--cgroups_enable_cfs="false" --cgroups_hierarchy="/sys/fs/cgroup" --cgroups_limit_swap="false"
--cgroups_root="mesos" --container_disk_watch_interval="15secs" --containerizers="mesos" --credential="/tmp/Endpoint_SlaveEndpointTest_NoAuthorizer_0_qwZbX9/credential"
--default_role="*" --disallow_sharing_agent_pid_namespace="false" --disk_watch_interval="1mins"
--docker="docker" --docker_kill_orphans="true" --docker_registry="https://registry-1.docker.io"
--docker_remove_delay="6hrs" --docker_socket="/var/run/docker.sock" --docker_stop_timeout="0ns"
--docker_store_dir="/tmp/Endpoint_SlaveEndpointTest_NoAuthorizer_0_qwZbX9/store/docker" --docker_volume_checkpoint_dir="/var/run/mesos/isolators/docker/volume"
--enforce_container_disk_quota="false" --executor_registration_timeout="1mins" --executor_reregistration_timeout="2secs"
--executor_secret_key="/tmp/Endpoint_SlaveEndpointTest_NoAuthorizer_0_qwZbX9/executor_secret_key"
--executor_shutdown_grace_period="5secs" --fetcher_cache_dir="/tmp/Endpoint_SlaveEndpointTest_NoAuthorizer_0_qwZbX9/fetch"
--fetcher_cache_size="2GB" --frameworks_home="" --gc_delay="1weeks" --gc_disk_headroom="0.1"
--hadoop_home="" --help="false" --hostname_lookup="true" --http_command_executor="false" --http_credentials="/tmp/Endpoint_SlaveEndpointTest_NoAuthorizer_0_qwZbX9/http_credentials"
--http_heartbeat_interval="30secs" --initialize_driver_logging="true" --isolation="posix/cpu,posix/mem"
--launcher="posix" --launcher_dir="/mesos/build/src" --logbufsecs="0" --logging_level="INFO"
--max_completed_executors_per_framework="150" --oversubscribed_resources_interval="15secs"
--perf_duration="10secs" --perf_interval="1mins" --port="5051" --qos_correction_interval_min="0ns"
--quiet="false" --recover="reconnect" --recovery_timeout="15mins" --registration_backoff_factor="10ms"
--resources="cpus:2;gpus:0;mem:1024;disk:1024;ports:[31000-32000]" --revocable_cpu_low_priority="true"
--runtime_dir="/tmp/Endpoint_SlaveEndpointTest_NoAuthorizer_0_qwZbX9" --sandbox_directory="/mnt/mesos/sandbox"
--strict="true" --switch_user="true" --systemd_enable_support="true" --systemd_runtime_directory="/run/systemd/system"
--version="false" --work_dir="/tmp/Endpoint_SlaveEndpointTest_NoAuthorizer_0_f7lBFA" --zk_session_timeout="10secs"
3: I0920 05:54:06.391631 26262 credentials.hpp:86] Loading credential for authentication from
'/tmp/Endpoint_SlaveEndpointTest_NoAuthorizer_0_qwZbX9/credential'
3: I0920 05:54:06.391754 26262 slave.cpp:285] Agent using credential for: test-principal
3: I0920 05:54:06.391770 26262 credentials.hpp:37] Loading credentials for authentication
from '/tmp/Endpoint_SlaveEndpointTest_NoAuthorizer_0_qwZbX9/http_credentials'
3: I0920 05:54:06.392029 26262 http.cpp:1045] Creating default 'basic' HTTP authenticator
for realm 'mesos-agent-executor'
3: I0920 05:54:06.392139 26262 http.cpp:1066] Creating default 'jwt' HTTP authenticator for
realm 'mesos-agent-executor'
3: I0920 05:54:06.392324 26262 http.cpp:1045] Creating default 'basic' HTTP authenticator
for realm 'mesos-agent-readonly'
3: I0920 05:54:06.392410 26262 http.cpp:1066] Creating default 'jwt' HTTP authenticator for
realm 'mesos-agent-readonly'
3: I0920 05:54:06.392580 26262 http.cpp:1045] Creating default 'basic' HTTP authenticator
for realm 'mesos-agent-readwrite'
3: I0920 05:54:06.392674 26262 http.cpp:1066] Creating default 'jwt' HTTP authenticator for
realm 'mesos-agent-readwrite'
3: I0920 05:54:06.394955 26262 slave.cpp:583] Agent resources: [{"name":"cpus","scalar":{"value":2.0},"type":"SCALAR"},{"name":"mem","scalar":{"value":1024.0},"type":"SCALAR"},{"name":"disk","scalar":{"value":1024.0},"type":"SCALAR"},{"name":"ports","ranges":{"range":[{"begin":31000,"end":32000}]},"type":"RANGES"}]
3: I0920 05:54:06.395313 26262 slave.cpp:591] Agent attributes: [  ]
3: I0920 05:54:06.395339 26262 slave.cpp:600] Agent hostname: d55e55df34d0
3: I0920 05:54:06.395458 26258 status_update_manager.cpp:177] Pausing sending status updates
3: I0920 05:54:06.397330 26263 state.cpp:64] Recovering state from '/tmp/Endpoint_SlaveEndpointTest_NoAuthorizer_0_f7lBFA/meta'
3: I0920 05:54:06.397761 26246 status_update_manager.cpp:203] Recovering status update manager
3: I0920 05:54:06.397939 26249 containerizer.cpp:648] Recovering containerizer
3: I0920 05:54:06.399411 26259 provisioner.cpp:416] Provisioner recovery complete
3: I0920 05:54:06.399910 26258 slave.cpp:6320] Finished recovery
3: I0920 05:54:06.400353 26258 slave.cpp:6502] Querying resource estimator for oversubscribable
resources
3: I0920 05:54:06.400598 26260 slave.cpp:6516] Received oversubscribable resources {} from
the resource estimator
3: I0920 05:54:06.402897 26251 process.cpp:3929] Handling HTTP event for process 'slave(818)'
with path: '/slave(818)/monitor/statistics'
3: I0920 05:54:06.405385 26261 http.cpp:1185] HTTP GET for /slave(818)/monitor/statistics
from 172.17.0.2:57236
3: I0920 05:54:06.405526 26261 http.cpp:976] Authorizing principal 'test-principal' to GET
the '/monitor/statistics' endpoint
3: I0920 05:54:06.409091 26262 slave.cpp:867] Agent terminating
3: [       OK ] Endpoint/SlaveEndpointTest.NoAuthorizer/0 (37 ms)
3: [ RUN      ] Endpoint/SlaveEndpointTest.NoAuthorizer/1
3: I0920 05:54:06.424908 18171 containerizer.cpp:292] Using isolation { environment_secret,
posix/cpu, posix/mem, filesystem/posix, network/cni }
3: W0920 05:54:06.425586 18171 backend.cpp:76] Failed to create 'aufs' backend: AufsBackend
requires root privileges
3: W0920 05:54:06.425709 18171 backend.cpp:76] Failed to create 'bind' backend: BindBackend
requires root privileges
3: I0920 05:54:06.425743 18171 provisioner.cpp:255] Using default backend 'copy'
3: I0920 05:54:06.428848 18171 cluster.cpp:448] Creating default 'local' authorizer
3: I0920 05:54:06.431257 26257 slave.cpp:252] Mesos agent started on (819)@172.17.0.2:43433
3: I0920 05:54:06.431299 26257 slave.cpp:253] Flags at startup: --acls="" --appc_simple_discovery_uri_prefix="http://"
--appc_store_dir="/tmp/Endpoint_SlaveEndpointTest_NoAuthorizer_1_s5lzor/store/appc" --authenticate_http_executors="true"
--authenticate_http_readonly="true" --authenticate_http_readwrite="true" --authenticatee="crammd5"
--authentication_backoff_factor="1secs" --authorizer="local" --cgroups_cpu_enable_pids_and_tids_count="false"
--cgroups_enable_cfs="false" --cgroups_hierarchy="/sys/fs/cgroup" --cgroups_limit_swap="false"
--cgroups_root="mesos" --container_disk_watch_interval="15secs" --containerizers="mesos" --credential="/tmp/Endpoint_SlaveEndpointTest_NoAuthorizer_1_s5lzor/credential"
--default_role="*" --disallow_sharing_agent_pid_namespace="false" --disk_watch_interval="1mins"
--docker="docker" --docker_kill_orphans="true" --docker_registry="https://registry-1.docker.io"
--docker_remove_delay="6hrs" --docker_socket="/var/run/docker.sock" --docker_stop_timeout="0ns"
--docker_store_dir="/tmp/Endpoint_SlaveEndpointTest_NoAuthorizer_1_s5lzor/store/docker" --docker_volume_checkpoint_dir="/var/run/mesos/isolators/docker/volume"
--enforce_container_disk_quota="false" --executor_registration_timeout="1mins" --executor_reregistration_timeout="2secs"
--executor_secret_key="/tmp/Endpoint_SlaveEndpointTest_NoAuthorizer_1_s5lzor/executor_secret_key"
--executor_shutdown_grace_period="5secs" --fetcher_cache_dir="/tmp/Endpoint_SlaveEndpointTest_NoAuthorizer_1_s5lzor/fetch"
--fetcher_cache_size="2GB" --frameworks_home="" --gc_delay="1weeks" --gc_disk_headroom="0.1"
--hadoop_home="" --help="false" --hostname_lookup="true" --http_command_executor="false" --http_credentials="/tmp/Endpoint_SlaveEndpointTest_NoAuthorizer_1_s5lzor/http_credentials"
--http_heartbeat_interval="30secs" --initialize_driver_logging="true" --isolation="posix/cpu,posix/mem"
--launcher="posix" --launcher_dir="/mesos/build/src" --logbufsecs="0" --logging_level="INFO"
--max_completed_executors_per_framework="150" --oversubscribed_resources_interval="15secs"
--perf_duration="10secs" --perf_interval="1mins" --port="5051" --qos_correction_interval_min="0ns"
--quiet="false" --recover="reconnect" --recovery_timeout="15mins" --registration_backoff_factor="10ms"
--resources="cpus:2;gpus:0;mem:1024;disk:1024;ports:[31000-32000]" --revocable_cpu_low_priority="true"
--runtime_dir="/tmp/Endpoint_SlaveEndpointTest_NoAuthorizer_1_s5lzor" --sandbox_directory="/mnt/mesos/sandbox"
--strict="true" --switch_user="true" --systemd_enable_support="true" --systemd_runtime_directory="/run/systemd/system"
--version="false" --work_dir="/tmp/Endpoint_SlaveEndpointTest_NoAuthorizer_1_b6Ol1R" --zk_session_timeout="10secs"
3: I0920 05:54:06.431895 26257 credentials.hpp:86] Loading credential for authentication from
'/tmp/Endpoint_SlaveEndpointTest_NoAuthorizer_1_s5lzor/credential'
3: I0920 05:54:06.432093 26257 slave.cpp:285] Agent using credential for: test-principal
3: I0920 05:54:06.432116 26257 credentials.hpp:37] Loading credentials for authentication
from '/tmp/Endpoint_SlaveEndpointTest_NoAuthorizer_1_s5lzor/http_credentials'
3: I0920 05:54:06.432504 26257 http.cpp:1045] Creating default 'basic' HTTP authenticator
for realm 'mesos-agent-executor'
3: I0920 05:54:06.432670 26257 http.cpp:1066] Creating default 'jwt' HTTP authenticator for
realm 'mesos-agent-executor'
3: I0920 05:54:06.432989 26257 http.cpp:1045] Creating default 'basic' HTTP authenticator
for realm 'mesos-agent-readonly'
3: I0920 05:54:06.433140 26257 http.cpp:1066] Creating default 'jwt' HTTP authenticator for
realm 'mesos-agent-readonly'
3: I0920 05:54:06.433416 26257 http.cpp:1045] Creating default 'basic' HTTP authenticator
for realm 'mesos-agent-readwrite'
3: I0920 05:54:06.433573 26257 http.cpp:1066] Creating default 'jwt' HTTP authenticator for
realm 'mesos-agent-readwrite'
3: I0920 05:54:06.435463 26257 slave.cpp:583] Agent resources: [{"name":"cpus","scalar":{"value":2.0},"type":"SCALAR"},{"name":"mem","scalar":{"value":1024.0},"type":"SCALAR"},{"name":"disk","scalar":{"value":1024.0},"type":"SCALAR"},{"name":"ports","ranges":{"range":[{"begin":31000,"end":32000}]},"type":"RANGES"}]
3: I0920 05:54:06.435755 26257 slave.cpp:591] Agent attributes: [  ]
3: I0920 05:54:06.435782 26257 slave.cpp:600] Agent hostname: d55e55df34d0
3: I0920 05:54:06.436025 26245 status_update_manager.cpp:177] Pausing sending status updates
3: I0920 05:54:06.438097 26256 state.cpp:64] Recovering state from '/tmp/Endpoint_SlaveEndpointTest_NoAuthorizer_1_b6Ol1R/meta'
3: I0920 05:54:06.438419 26261 status_update_manager.cpp:203] Recovering status update manager
3: I0920 05:54:06.438755 26242 containerizer.cpp:648] Recovering containerizer
3: I0920 05:54:06.440488 26265 provisioner.cpp:416] Provisioner recovery complete
3: I0920 05:54:06.440913 26251 slave.cpp:6320] Finished recovery
3: I0920 05:54:06.441578 26251 slave.cpp:6502] Querying resource estimator for oversubscribable
resources
3: I0920 05:54:06.441844 26250 slave.cpp:6516] Received oversubscribable resources {} from
the resource estimator
3: I0920 05:54:06.444169 26243 process.cpp:3929] Handling HTTP event for process 'slave(819)'
with path: '/slave(819)/monitor/statistics.json'
3: I0920 05:54:06.446091 26265 http.cpp:1185] HTTP GET for /slave(819)/monitor/statistics.json
from 172.17.0.2:57238
3: I0920 05:54:06.446224 26265 http.cpp:976] Authorizing principal 'test-principal' to GET
the '/monitor/statistics.json' endpoint
3: I0920 05:54:06.450402 18171 slave.cpp:867] Agent terminating
3: [       OK ] Endpoint/SlaveEndpointTest.NoAuthorizer/1 (39 ms)
3: [ RUN      ] Endpoint/SlaveEndpointTest.NoAuthorizer/2
3: I0920 05:54:06.465876 18171 containerizer.cpp:292] Using isolation { environment_secret,
posix/cpu, posix/mem, filesystem/posix, network/cni }
3: W0920 05:54:06.466497 18171 backend.cpp:76] Failed to create 'aufs' backend: AufsBackend
requires root privileges
3: W0920 05:54:06.466622 18171 backend.cpp:76] Failed to create 'bind' backend: BindBackend
requires root privileges
3: I0920 05:54:06.466655 18171 provisioner.cpp:255] Using default backend 'copy'
3: I0920 05:54:06.468821 18171 cluster.cpp:448] Creating default 'local' authorizer
3: I0920 05:54:06.471181 26249 slave.cpp:252] Mesos agent started on (820)@172.17.0.2:43433
3: I0920 05:54:06.471220 26249 slave.cpp:253] Flags at startup: --acls="" --appc_simple_discovery_uri_prefix="http://"
--appc_store_dir="/tmp/Endpoint_SlaveEndpointTest_NoAuthorizer_2_ROb9dJ/store/appc" --authenticate_http_executors="true"
--authenticate_http_readonly="true" --authenticate_http_readwrite="true" --authenticatee="crammd5"
--authentication_backoff_factor="1secs" --authorizer="local" --cgroups_cpu_enable_pids_and_tids_count="false"
--cgroups_enable_cfs="false" --cgroups_hierarchy="/sys/fs/cgroup" --cgroups_limit_swap="false"
--cgroups_root="mesos" --container_disk_watch_interval="15secs" --containerizers="mesos" --credential="/tmp/Endpoint_SlaveEndpointTest_NoAuthorizer_2_ROb9dJ/credential"
--default_role="*" --disallow_sharing_agent_pid_namespace="false" --disk_watch_interval="1mins"
--docker="docker" --docker_kill_orphans="true" --docker_registry="https://registry-1.docker.io"
--docker_remove_delay="6hrs" --docker_socket="/var/run/docker.sock" --docker_stop_timeout="0ns"
--docker_store_dir="/tmp/Endpoint_SlaveEndpointTest_NoAuthorizer_2_ROb9dJ/store/docker" --docker_volume_checkpoint_dir="/var/run/mesos/isolators/docker/volume"
--enforce_container_disk_quota="false" --executor_registration_timeout="1mins" --executor_reregistration_timeout="2secs"
--executor_secret_key="/tmp/Endpoint_SlaveEndpointTest_NoAuthorizer_2_ROb9dJ/executor_secret_key"
--executor_shutdown_grace_period="5secs" --fetcher_cache_dir="/tmp/Endpoint_SlaveEndpointTest_NoAuthorizer_2_ROb9dJ/fetch"
--fetcher_cache_size="2GB" --frameworks_home="" --gc_delay="1weeks" --gc_disk_headroom="0.1"
--hadoop_home="" --help="false" --hostname_lookup="true" --http_command_executor="false" --http_credentials="/tmp/Endpoint_SlaveEndpointTest_NoAuthorizer_2_ROb9dJ/http_credentials"
--http_heartbeat_interval="30secs" --initialize_driver_logging="true" --isolation="posix/cpu,posix/mem"
--launcher="posix" --launcher_dir="/mesos/build/src" --logbufsecs="0" --logging_level="INFO"
--max_completed_executors_per_framework="150" --oversubscribed_resources_interval="15secs"
--perf_duration="10secs" --perf_interval="1mins" --port="5051" --qos_correction_interval_min="0ns"
--quiet="false" --recover="reconnect" --recovery_timeout="15mins" --registration_backoff_factor="10ms"
--resources="cpus:2;gpus:0;mem:1024;disk:1024;ports:[31000-32000]" --revocable_cpu_low_priority="true"
--runtime_dir="/tmp/Endpoint_SlaveEndpointTest_NoAuthorizer_2_ROb9dJ" --sandbox_directory="/mnt/mesos/sandbox"
--strict="true" --switch_user="true" --systemd_enable_support="true" --systemd_runtime_directory="/run/systemd/system"
--version="false" --work_dir="/tmp/Endpoint_SlaveEndpointTest_NoAuthorizer_2_s5vSK9" --zk_session_timeout="10secs"
3: I0920 05:54:06.471593 26249 credentials.hpp:86] Loading credential for authentication from
'/tmp/Endpoint_SlaveEndpointTest_NoAuthorizer_2_ROb9dJ/credential'
3: I0920 05:54:06.471737 26249 slave.cpp:285] Agent using credential for: test-principal
3: I0920 05:54:06.471756 26249 credentials.hpp:37] Loading credentials for authentication
from '/tmp/Endpoint_SlaveEndpointTest_NoAuthorizer_2_ROb9dJ/http_credentials'
3: I0920 05:54:06.472036 26249 http.cpp:1045] Creating default 'basic' HTTP authenticator
for realm 'mesos-agent-executor'
3: I0920 05:54:06.472157 26249 http.cpp:1066] Creating default 'jwt' HTTP authenticator for
realm 'mesos-agent-executor'
3: I0920 05:54:06.472358 26249 http.cpp:1045] Creating default 'basic' HTTP authenticator
for realm 'mesos-agent-readonly'
3: I0920 05:54:06.472460 26249 http.cpp:1066] Creating default 'jwt' HTTP authenticator for
realm 'mesos-agent-readonly'
3: I0920 05:54:06.472659 26249 http.cpp:1045] Creating default 'basic' HTTP authenticator
for realm 'mesos-agent-readwrite'
3: I0920 05:54:06.472790 26249 http.cpp:1066] Creating default 'jwt' HTTP authenticator for
realm 'mesos-agent-readwrite'
3: I0920 05:54:06.474230 26249 slave.cpp:583] Agent resources: [{"name":"cpus","scalar":{"value":2.0},"type":"SCALAR"},{"name":"mem","scalar":{"value":1024.0},"type":"SCALAR"},{"name":"disk","scalar":{"value":1024.0},"type":"SCALAR"},{"name":"ports","ranges":{"range":[{"begin":31000,"end":32000}]},"type":"RANGES"}]
3: I0920 05:54:06.474457 26249 slave.cpp:591] Agent attributes: [  ]
3: I0920 05:54:06.474476 26249 slave.cpp:600] Agent hostname: d55e55df34d0
3: I0920 05:54:06.474624 26243 status_update_manager.cpp:177] Pausing sending status updates
3: I0920 05:54:06.476017 26265 state.cpp:64] Recovering state from '/tmp/Endpoint_SlaveEndpointTest_NoAuthorizer_2_s5vSK9/meta'
3: I0920 05:54:06.476284 26265 status_update_manager.cpp:203] Recovering status update manager
3: I0920 05:54:06.476498 26259 containerizer.cpp:648] Recovering containerizer
3: I0920 05:54:06.478440 26262 provisioner.cpp:416] Provisioner recovery complete
3: I0920 05:54:06.478976 26246 slave.cpp:6320] Finished recovery
3: I0920 05:54:06.479537 26246 slave.cpp:6502] Querying resource estimator for oversubscribable
resources
3: I0920 05:54:06.479799 26244 slave.cpp:6516] Received oversubscribable resources {} from
the resource estimator
3: I0920 05:54:06.482241 26253 process.cpp:3929] Handling HTTP event for process 'slave(820)'
with path: '/slave(820)/containers'
3: I0920 05:54:06.484414 26263 http.cpp:1185] HTTP GET for /slave(820)/containers from 172.17.0.2:57240
3: I0920 05:54:06.484486 26263 http.cpp:976] Authorizing principal 'test-principal' to GET
the '/containers' endpoint
3: I0920 05:54:06.489172 18171 slave.cpp:867] Agent terminating
3: [       OK ] Endpoint/SlaveEndpointTest.NoAuthorizer/2 (37 ms)
3: [----------] 9 tests from Endpoint/SlaveEndpointTest (327 ms total)
3: 
3: [----------] Global test environment tear-down
3: [==========] 1629 tests from 178 test cases ran. (340593 ms total)
3: [  PASSED  ] 1628 tests.
3: [  FAILED  ] 1 test, listed below:
3: [  FAILED  ] MasterTest.IgnoreOldAgentReregistration
3: 
3:  1 FAILED TEST
3:   YOU HAVE 20 DISABLED TESTS
3: 
3: I0920 05:54:06.559242 26266 process.cpp:1068] Failed to accept socket: future discarded
3/3 Test #3: MesosTests .......................***Failed  345.23 sec

67% tests passed, 1 tests failed out of 3

Total Test time (real) = 388.42 sec

The following tests FAILED:
	  3 - MesosTests (Failed)
Errors while running CTest
make[3]: *** [CMakeFiles/check] Error 8
make[3]: Leaving directory `/mesos/build'
make[2]: *** [CMakeFiles/check.dir/all] Error 2
make[2]: Leaving directory `/mesos/build'
make[1]: *** [CMakeFiles/check.dir/rule] Error 2
make[1]: Leaving directory `/mesos/build'
make: *** [check] Error 2
+ docker rmi mesos-1505885267-3998
Untagged: mesos-1505885267-3998:latest
Deleted: sha256:98a19beb378d5233e938f25ddeaa0cc10ee23d28fa58bf6f10958e569f73f5fe
Deleted: sha256:6a5a1a5dfec0b686c55af9fa848ececa4d5b6a2a56f03400522518f0640f7c64
Deleted: sha256:adb632601f0d66e04e9f68afe29a1d4526e7db6cd34c9516104d7a614a8a9e0b
Deleted: sha256:ea75096867bfa26da51bb932023f5a7b6b2fbef7aa2fa9f23e14939dc25c3a61
Deleted: sha256:9af5f072d13ad3107f2eb4d2586865352c528ba105e167393be47ebdde98a8a0
Deleted: sha256:a2b2950e30e3c215a6c25c3a2c569e7528ce6b5e129ef04c99abf193ece4abe4
Deleted: sha256:f931dbd2e25f3d11bfcec67f2ebe7caf4a67a8adae00b4d4065fc93120752859
Deleted: sha256:e40c92959e7234bf94bbce89d6e7ebb2f4f622482d9440a9f2c149dd31ff0d00
Deleted: sha256:e7af32d803c98a09b31dd7bb937aea0132bd3bab46ef81dedcad7e5c3d587560
Deleted: sha256:c955e876412f31cf2626ef318e50065337cb74f2c348e183b00e4cf243a07091
Deleted: sha256:27c388011c8db9fc50b2e0b4722da2a9d83677023fe19eecf88e7917b543fea7
Deleted: sha256:087e0b325e8ff79b17b07aba442416ddec504cb9947cd2a799d4d80166300000
Deleted: sha256:40df8f838bab2bc83f8e40e7ccdb292c555ddf1d5fe67138b81d506f0cd8d184
Deleted: sha256:6455f55b72f45a6e011976bbfda47bc8812572f84a4c5034c710f142e55794d3
Deleted: sha256:cfc55cfad70f748206733b2e3ebb06a6a0fff4d1ebb1b673087b10a1e8004205
Deleted: sha256:c234545571fb97e49f636c21b67107ca3c16dab196ead23400df131bf0835b41
Deleted: sha256:6b57f96238982801b2a5ed135c5e133cb2ec428b488da022d001801887e01899
Deleted: sha256:4dc6fe7a67dae14d2f264398e9b02f8213b8e2aae0b61df3c58af7dfbcfc1ca7
Deleted: sha256:e9d2e74152ca2909d6646614c5e14982a48cdc755a2bb177b1e8844b010dd36b
Deleted: sha256:0a6a0d6851559c9d3a1c07ef8338874ee2f8fff3e048726ab85b33e4ee5c994f
Deleted: sha256:c7f4173592460664c76e3be907764fd88463bdecc9808adef4e71b754a5c8881
Deleted: sha256:74f27454af11066f752feb66b4d7ffce2cbab95d54962eb25d0a2cba1a4457d9
Deleted: sha256:d2f9b513b6566febdf600a51b427418121692a9c6a4f6decb4d145a25d86742d
Deleted: sha256:f4b9921415c232ea4b8263242b216277f981ae9d444af58bad5ffda112a0e103
Deleted: sha256:3c930f7ca048666f7d2003489ac3cda969ab6cc67c37e5dbcee8fe0625ce5fbe
Deleted: sha256:f03f8ede1fbcb03ffa9f1067c4daadd0d2b689e18770bf2d845cbb5e2a1d93b8
Deleted: sha256:d21b47b33072b34396f672b77e969a32e65b5412cd54a7dc13159f524f548fac
Deleted: sha256:622b9efd488a203f0191af6178fe9f4cbd59fc6d6f0f1b595c57363d9d52bc56
Build step 'Execute shell' marked build as failure

Mime
View raw message