mesos-builds mailing list archives

Site index · List index
Message view « Date » · « Thread »
Top « Date » · « Thread »
From Apache Jenkins Server <jenk...@builds.apache.org>
Subject Build failed in Jenkins: Mesos-Reviewbot #19610
Date Thu, 28 Sep 2017 16:07:58 GMT
See <https://builds.apache.org/job/Mesos-Reviewbot/19610/display/redirect>

------------------------------------------
[...truncated 31.59 MB...]
I0928 16:07:52.550354  5796 http.cpp:1045] Creating default 'basic' HTTP authenticator for
realm 'mesos-agent-readonly'
I0928 16:07:52.550540  5796 http.cpp:1045] Creating default 'basic' HTTP authenticator for
realm 'mesos-agent-readwrite'
I0928 16:07:52.552726  5796 slave.cpp:585] Agent resources: [{"name":"cpus","scalar":{"value":2.0},"type":"SCALAR"},{"name":"mem","scalar":{"value":1024.0},"type":"SCALAR"},{"name":"disk","scalar":{"value":1024.0},"type":"SCALAR"},{"name":"ports","ranges":{"range":[{"begin":31000,"end":32000}]},"type":"RANGES"}]
I0928 16:07:52.553140  5796 slave.cpp:593] Agent attributes: [  ]
I0928 16:07:52.553176  5796 slave.cpp:602] Agent hostname: 808e10247f67
I0928 16:07:52.553366  5805 status_update_manager.cpp:177] Pausing sending status updates
I0928 16:07:52.555685  5801 state.cpp:64] Recovering state from '/tmp/Endpoint_SlaveEndpointTest_AuthorizedRequest_2_bXUXJK/meta'
I0928 16:07:52.556171  5807 status_update_manager.cpp:203] Recovering status update manager
I0928 16:07:52.556478  5792 containerizer.cpp:648] Recovering containerizer
I0928 16:07:52.558136  5798 provisioner.cpp:416] Provisioner recovery complete
I0928 16:07:52.558593  5798 slave.cpp:6322] Finished recovery
I0928 16:07:52.559121  5798 slave.cpp:6504] Querying resource estimator for oversubscribable
resources
I0928 16:07:52.559379  5801 slave.cpp:6518] Received oversubscribable resources {} from the
resource estimator
I0928 16:07:52.562234  5795 process.cpp:3929] Handling HTTP event for process 'slave(811)'
with path: '/slave(811)/containers'
I0928 16:07:52.564040  5814 http.cpp:1185] HTTP GET for /slave(811)/containers from 172.17.0.2:44868
I0928 16:07:52.564144  5814 http.cpp:976] Authorizing principal 'test-principal' to GET the
'/containers' endpoint
I0928 16:07:52.569547  5773 slave.cpp:869] Agent terminating
[       OK ] Endpoint/SlaveEndpointTest.AuthorizedRequest/2 (42 ms)
[ RUN      ] Endpoint/SlaveEndpointTest.UnauthorizedRequest/0
I0928 16:07:52.584990  5773 containerizer.cpp:292] Using isolation { environment_secret, posix/cpu,
posix/mem, filesystem/posix, network/cni }
W0928 16:07:52.585646  5773 backend.cpp:76] Failed to create 'aufs' backend: AufsBackend requires
root privileges
W0928 16:07:52.585815  5773 backend.cpp:76] Failed to create 'bind' backend: BindBackend requires
root privileges
I0928 16:07:52.585845  5773 provisioner.cpp:255] Using default backend 'copy'
I0928 16:07:52.592376  5810 slave.cpp:254] Mesos agent started on (812)@172.17.0.2:41520
I0928 16:07:52.592407  5810 slave.cpp:255] Flags at startup: --acls="" --appc_simple_discovery_uri_prefix="http://"
--appc_store_dir="/tmp/Endpoint_SlaveEndpointTest_UnauthorizedRequest_0_GjNh0Z/store/appc"
--authenticate_http_readonly="true" --authenticate_http_readwrite="true" --authenticatee="crammd5"
--authentication_backoff_factor="1secs" --authorizer="local" --cgroups_cpu_enable_pids_and_tids_count="false"
--cgroups_enable_cfs="false" --cgroups_hierarchy="/sys/fs/cgroup" --cgroups_limit_swap="false"
--cgroups_root="mesos" --container_disk_watch_interval="15secs" --containerizers="mesos" --credential="/tmp/Endpoint_SlaveEndpointTest_UnauthorizedRequest_0_GjNh0Z/credential"
--default_role="*" --disallow_sharing_agent_pid_namespace="false" --disk_watch_interval="1mins"
--docker="docker" --docker_kill_orphans="true" --docker_registry="https://registry-1.docker.io"
--docker_remove_delay="6hrs" --docker_socket="/var/run/docker.sock" --docker_stop_timeout="0ns"
--docker_store_dir="/tmp/Endpoint_SlaveEndpointTest_UnauthorizedRequest_0_GjNh0Z/store/docker"
--docker_volume_checkpoint_dir="/var/run/mesos/isolators/docker/volume" --enforce_container_disk_quota="false"
--executor_registration_timeout="1mins" --executor_reregistration_timeout="2secs" --executor_shutdown_grace_period="5secs"
--fetcher_cache_dir="/tmp/Endpoint_SlaveEndpointTest_UnauthorizedRequest_0_GjNh0Z/fetch" --fetcher_cache_size="2GB"
--frameworks_home="" --gc_delay="1weeks" --gc_disk_headroom="0.1" --hadoop_home="" --help="false"
--hostname_lookup="true" --http_command_executor="false" --http_credentials="/tmp/Endpoint_SlaveEndpointTest_UnauthorizedRequest_0_GjNh0Z/http_credentials"
--http_heartbeat_interval="30secs" --initialize_driver_logging="true" --isolation="posix/cpu,posix/mem"
--launcher="posix" --launcher_dir="/mesos/mesos-1.5.0/_build/src" --logbufsecs="0" --logging_level="INFO"
--max_completed_executors_per_framework="150" --oversubscribed_resources_interval="15secs"
--perf_duration="10secs" --perf_interval="1mins" --port="5051" --qos_correction_interval_min="0ns"
--quiet="false" --recover="reconnect" --recovery_timeout="15mins" --registration_backoff_factor="10ms"
--resources="cpus:2;gpus:0;mem:1024;disk:1024;ports:[31000-32000]" --revocable_cpu_low_priority="true"
--runtime_dir="/tmp/Endpoint_SlaveEndpointTest_UnauthorizedRequest_0_GjNh0Z" --sandbox_directory="/mnt/mesos/sandbox"
--strict="true" --switch_user="true" --systemd_enable_support="true" --systemd_runtime_directory="/run/systemd/system"
--version="false" --work_dir="/tmp/Endpoint_SlaveEndpointTest_UnauthorizedRequest_0_hQ6CIl"
--zk_session_timeout="10secs"
I0928 16:07:52.592944  5810 credentials.hpp:86] Loading credential for authentication from
'/tmp/Endpoint_SlaveEndpointTest_UnauthorizedRequest_0_GjNh0Z/credential'
I0928 16:07:52.593152  5810 slave.cpp:287] Agent using credential for: test-principal
I0928 16:07:52.593179  5810 credentials.hpp:37] Loading credentials for authentication from
'/tmp/Endpoint_SlaveEndpointTest_UnauthorizedRequest_0_GjNh0Z/http_credentials'
I0928 16:07:52.593462  5810 http.cpp:1045] Creating default 'basic' HTTP authenticator for
realm 'mesos-agent-readonly'
I0928 16:07:52.593673  5810 http.cpp:1045] Creating default 'basic' HTTP authenticator for
realm 'mesos-agent-readwrite'
I0928 16:07:52.595324  5810 slave.cpp:585] Agent resources: [{"name":"cpus","scalar":{"value":2.0},"type":"SCALAR"},{"name":"mem","scalar":{"value":1024.0},"type":"SCALAR"},{"name":"disk","scalar":{"value":1024.0},"type":"SCALAR"},{"name":"ports","ranges":{"range":[{"begin":31000,"end":32000}]},"type":"RANGES"}]
I0928 16:07:52.595588  5810 slave.cpp:593] Agent attributes: [  ]
I0928 16:07:52.595603  5810 slave.cpp:602] Agent hostname: 808e10247f67
I0928 16:07:52.595829  5796 status_update_manager.cpp:177] Pausing sending status updates
I0928 16:07:52.597291  5807 state.cpp:64] Recovering state from '/tmp/Endpoint_SlaveEndpointTest_UnauthorizedRequest_0_hQ6CIl/meta'
I0928 16:07:52.597591  5807 status_update_manager.cpp:203] Recovering status update manager
I0928 16:07:52.597884  5815 containerizer.cpp:648] Recovering containerizer
I0928 16:07:52.599637  5801 provisioner.cpp:416] Provisioner recovery complete
I0928 16:07:52.600167  5796 slave.cpp:6322] Finished recovery
I0928 16:07:52.600788  5796 slave.cpp:6504] Querying resource estimator for oversubscribable
resources
I0928 16:07:52.601184  5803 slave.cpp:6518] Received oversubscribable resources {} from the
resource estimator
I0928 16:07:52.603917  5792 process.cpp:3929] Handling HTTP event for process 'slave(812)'
with path: '/slave(812)/monitor/statistics'
I0928 16:07:52.605650  5814 http.cpp:1185] HTTP GET for /slave(812)/monitor/statistics from
172.17.0.2:44870
I0928 16:07:52.605732  5814 http.cpp:976] Authorizing principal 'test-principal' to GET the
'/monitor/statistics' endpoint
I0928 16:07:52.609104  5773 slave.cpp:869] Agent terminating
[       OK ] Endpoint/SlaveEndpointTest.UnauthorizedRequest/0 (38 ms)
[ RUN      ] Endpoint/SlaveEndpointTest.UnauthorizedRequest/1
I0928 16:07:52.625206  5773 containerizer.cpp:292] Using isolation { environment_secret, posix/cpu,
posix/mem, filesystem/posix, network/cni }
W0928 16:07:52.625875  5773 backend.cpp:76] Failed to create 'aufs' backend: AufsBackend requires
root privileges
W0928 16:07:52.626037  5773 backend.cpp:76] Failed to create 'bind' backend: BindBackend requires
root privileges
I0928 16:07:52.626075  5773 provisioner.cpp:255] Using default backend 'copy'
I0928 16:07:52.630842  5794 slave.cpp:254] Mesos agent started on (813)@172.17.0.2:41520
I0928 16:07:52.630879  5794 slave.cpp:255] Flags at startup: --acls="" --appc_simple_discovery_uri_prefix="http://"
--appc_store_dir="/tmp/Endpoint_SlaveEndpointTest_UnauthorizedRequest_1_S35ZsB/store/appc"
--authenticate_http_readonly="true" --authenticate_http_readwrite="true" --authenticatee="crammd5"
--authentication_backoff_factor="1secs" --authorizer="local" --cgroups_cpu_enable_pids_and_tids_count="false"
--cgroups_enable_cfs="false" --cgroups_hierarchy="/sys/fs/cgroup" --cgroups_limit_swap="false"
--cgroups_root="mesos" --container_disk_watch_interval="15secs" --containerizers="mesos" --credential="/tmp/Endpoint_SlaveEndpointTest_UnauthorizedRequest_1_S35ZsB/credential"
--default_role="*" --disallow_sharing_agent_pid_namespace="false" --disk_watch_interval="1mins"
--docker="docker" --docker_kill_orphans="true" --docker_registry="https://registry-1.docker.io"
--docker_remove_delay="6hrs" --docker_socket="/var/run/docker.sock" --docker_stop_timeout="0ns"
--docker_store_dir="/tmp/Endpoint_SlaveEndpointTest_UnauthorizedRequest_1_S35ZsB/store/docker"
--docker_volume_checkpoint_dir="/var/run/mesos/isolators/docker/volume" --enforce_container_disk_quota="false"
--executor_registration_timeout="1mins" --executor_reregistration_timeout="2secs" --executor_shutdown_grace_period="5secs"
--fetcher_cache_dir="/tmp/Endpoint_SlaveEndpointTest_UnauthorizedRequest_1_S35ZsB/fetch" --fetcher_cache_size="2GB"
--frameworks_home="" --gc_delay="1weeks" --gc_disk_headroom="0.1" --hadoop_home="" --help="false"
--hostname_lookup="true" --http_command_executor="false" --http_credentials="/tmp/Endpoint_SlaveEndpointTest_UnauthorizedRequest_1_S35ZsB/http_credentials"
--http_heartbeat_interval="30secs" --initialize_driver_logging="true" --isolation="posix/cpu,posix/mem"
--launcher="posix" --launcher_dir="/mesos/mesos-1.5.0/_build/src" --logbufsecs="0" --logging_level="INFO"
--max_completed_executors_per_framework="150" --oversubscribed_resources_interval="15secs"
--perf_duration="10secs" --perf_interval="1mins" --port="5051" --qos_correction_interval_min="0ns"
--quiet="false" --recover="reconnect" --recovery_timeout="15mins" --registration_backoff_factor="10ms"
--resources="cpus:2;gpus:0;mem:1024;disk:1024;ports:[31000-32000]" --revocable_cpu_low_priority="true"
--runtime_dir="/tmp/Endpoint_SlaveEndpointTest_UnauthorizedRequest_1_S35ZsB" --sandbox_directory="/mnt/mesos/sandbox"
--strict="true" --switch_user="true" --systemd_enable_support="true" --systemd_runtime_directory="/run/systemd/system"
--version="false" --work_dir="/tmp/Endpoint_SlaveEndpointTest_UnauthorizedRequest_1_TDeq5W"
--zk_session_timeout="10secs"
I0928 16:07:52.631319  5794 credentials.hpp:86] Loading credential for authentication from
'/tmp/Endpoint_SlaveEndpointTest_UnauthorizedRequest_1_S35ZsB/credential'
I0928 16:07:52.631503  5794 slave.cpp:287] Agent using credential for: test-principal
I0928 16:07:52.631541  5794 credentials.hpp:37] Loading credentials for authentication from
'/tmp/Endpoint_SlaveEndpointTest_UnauthorizedRequest_1_S35ZsB/http_credentials'
I0928 16:07:52.631867  5794 http.cpp:1045] Creating default 'basic' HTTP authenticator for
realm 'mesos-agent-readonly'
I0928 16:07:52.632046  5794 http.cpp:1045] Creating default 'basic' HTTP authenticator for
realm 'mesos-agent-readwrite'
I0928 16:07:52.633852  5794 slave.cpp:585] Agent resources: [{"name":"cpus","scalar":{"value":2.0},"type":"SCALAR"},{"name":"mem","scalar":{"value":1024.0},"type":"SCALAR"},{"name":"disk","scalar":{"value":1024.0},"type":"SCALAR"},{"name":"ports","ranges":{"range":[{"begin":31000,"end":32000}]},"type":"RANGES"}]
I0928 16:07:52.634150  5794 slave.cpp:593] Agent attributes: [  ]
I0928 16:07:52.634166  5794 slave.cpp:602] Agent hostname: 808e10247f67
I0928 16:07:52.634425  5815 status_update_manager.cpp:177] Pausing sending status updates
I0928 16:07:52.636204  5800 state.cpp:64] Recovering state from '/tmp/Endpoint_SlaveEndpointTest_UnauthorizedRequest_1_TDeq5W/meta'
I0928 16:07:52.636674  5801 status_update_manager.cpp:203] Recovering status update manager
I0928 16:07:52.636962  5801 containerizer.cpp:648] Recovering containerizer
I0928 16:07:52.638586  5792 provisioner.cpp:416] Provisioner recovery complete
I0928 16:07:52.639068  5815 slave.cpp:6322] Finished recovery
I0928 16:07:52.639561  5815 slave.cpp:6504] Querying resource estimator for oversubscribable
resources
I0928 16:07:52.639854  5808 slave.cpp:6518] Received oversubscribable resources {} from the
resource estimator
I0928 16:07:52.642853  5795 process.cpp:3929] Handling HTTP event for process 'slave(813)'
with path: '/slave(813)/monitor/statistics.json'
I0928 16:07:52.644433  5803 http.cpp:1185] HTTP GET for /slave(813)/monitor/statistics.json
from 172.17.0.2:44872
I0928 16:07:52.644520  5803 http.cpp:976] Authorizing principal 'test-principal' to GET the
'/monitor/statistics.json' endpoint
I0928 16:07:52.647991  5773 slave.cpp:869] Agent terminating
[       OK ] Endpoint/SlaveEndpointTest.UnauthorizedRequest/1 (38 ms)
[ RUN      ] Endpoint/SlaveEndpointTest.UnauthorizedRequest/2
I0928 16:07:52.663862  5773 containerizer.cpp:292] Using isolation { environment_secret, posix/cpu,
posix/mem, filesystem/posix, network/cni }
W0928 16:07:52.664477  5773 backend.cpp:76] Failed to create 'aufs' backend: AufsBackend requires
root privileges
W0928 16:07:52.664597  5773 backend.cpp:76] Failed to create 'bind' backend: BindBackend requires
root privileges
I0928 16:07:52.664649  5773 provisioner.cpp:255] Using default backend 'copy'
I0928 16:07:52.669502  5793 slave.cpp:254] Mesos agent started on (814)@172.17.0.2:41520
I0928 16:07:52.669529  5793 slave.cpp:255] Flags at startup: --acls="" --appc_simple_discovery_uri_prefix="http://"
--appc_store_dir="/tmp/Endpoint_SlaveEndpointTest_UnauthorizedRequest_2_msXGid/store/appc"
--authenticate_http_readonly="true" --authenticate_http_readwrite="true" --authenticatee="crammd5"
--authentication_backoff_factor="1secs" --authorizer="local" --cgroups_cpu_enable_pids_and_tids_count="false"
--cgroups_enable_cfs="false" --cgroups_hierarchy="/sys/fs/cgroup" --cgroups_limit_swap="false"
--cgroups_root="mesos" --container_disk_watch_interval="15secs" --containerizers="mesos" --credential="/tmp/Endpoint_SlaveEndpointTest_UnauthorizedRequest_2_msXGid/credential"
--default_role="*" --disallow_sharing_agent_pid_namespace="false" --disk_watch_interval="1mins"
--docker="docker" --docker_kill_orphans="true" --docker_registry="https://registry-1.docker.io"
--docker_remove_delay="6hrs" --docker_socket="/var/run/docker.sock" --docker_stop_timeout="0ns"
--docker_store_dir="/tmp/Endpoint_SlaveEndpointTest_UnauthorizedRequest_2_msXGid/store/docker"
--docker_volume_checkpoint_dir="/var/run/mesos/isolators/docker/volume" --enforce_container_disk_quota="false"
--executor_registration_timeout="1mins" --executor_reregistration_timeout="2secs" --executor_shutdown_grace_period="5secs"
--fetcher_cache_dir="/tmp/Endpoint_SlaveEndpointTest_UnauthorizedRequest_2_msXGid/fetch" --fetcher_cache_size="2GB"
--frameworks_home="" --gc_delay="1weeks" --gc_disk_headroom="0.1" --hadoop_home="" --help="false"
--hostname_lookup="true" --http_command_executor="false" --http_credentials="/tmp/Endpoint_SlaveEndpointTest_UnauthorizedRequest_2_msXGid/http_credentials"
--http_heartbeat_interval="30secs" --initialize_driver_logging="true" --isolation="posix/cpu,posix/mem"
--launcher="posix" --launcher_dir="/mesos/mesos-1.5.0/_build/src" --logbufsecs="0" --logging_level="INFO"
--max_completed_executors_per_framework="150" --oversubscribed_resources_interval="15secs"
--perf_duration="10secs" --perf_interval="1mins" --port="5051" --qos_correction_interval_min="0ns"
--quiet="false" --recover="reconnect" --recovery_timeout="15mins" --registration_backoff_factor="10ms"
--resources="cpus:2;gpus:0;mem:1024;disk:1024;ports:[31000-32000]" --revocable_cpu_low_priority="true"
--runtime_dir="/tmp/Endpoint_SlaveEndpointTest_UnauthorizedRequest_2_msXGid" --sandbox_directory="/mnt/mesos/sandbox"
--strict="true" --switch_user="true" --systemd_enable_support="true" --systemd_runtime_directory="/run/systemd/system"
--version="false" --work_dir="/tmp/Endpoint_SlaveEndpointTest_UnauthorizedRequest_2_ZE2nPy"
--zk_session_timeout="10secs"
I0928 16:07:52.669947  5793 credentials.hpp:86] Loading credential for authentication from
'/tmp/Endpoint_SlaveEndpointTest_UnauthorizedRequest_2_msXGid/credential'
I0928 16:07:52.670126  5793 slave.cpp:287] Agent using credential for: test-principal
I0928 16:07:52.670151  5793 credentials.hpp:37] Loading credentials for authentication from
'/tmp/Endpoint_SlaveEndpointTest_UnauthorizedRequest_2_msXGid/http_credentials'
I0928 16:07:52.670472  5793 http.cpp:1045] Creating default 'basic' HTTP authenticator for
realm 'mesos-agent-readonly'
I0928 16:07:52.670672  5793 http.cpp:1045] Creating default 'basic' HTTP authenticator for
realm 'mesos-agent-readwrite'
I0928 16:07:52.672107  5793 slave.cpp:585] Agent resources: [{"name":"cpus","scalar":{"value":2.0},"type":"SCALAR"},{"name":"mem","scalar":{"value":1024.0},"type":"SCALAR"},{"name":"disk","scalar":{"value":1024.0},"type":"SCALAR"},{"name":"ports","ranges":{"range":[{"begin":31000,"end":32000}]},"type":"RANGES"}]
I0928 16:07:52.672353  5793 slave.cpp:593] Agent attributes: [  ]
I0928 16:07:52.672366  5793 slave.cpp:602] Agent hostname: 808e10247f67
I0928 16:07:52.672546  5797 status_update_manager.cpp:177] Pausing sending status updates
I0928 16:07:52.673915  5803 state.cpp:64] Recovering state from '/tmp/Endpoint_SlaveEndpointTest_UnauthorizedRequest_2_ZE2nPy/meta'
I0928 16:07:52.674219  5805 status_update_manager.cpp:203] Recovering status update manager
I0928 16:07:52.674487  5811 containerizer.cpp:648] Recovering containerizer
I0928 16:07:52.675789  5806 provisioner.cpp:416] Provisioner recovery complete
I0928 16:07:52.676185  5795 slave.cpp:6322] Finished recovery
I0928 16:07:52.676699  5795 slave.cpp:6504] Querying resource estimator for oversubscribable
resources
I0928 16:07:52.676996  5813 slave.cpp:6518] Received oversubscribable resources {} from the
resource estimator
I0928 16:07:52.679888  5812 process.cpp:3929] Handling HTTP event for process 'slave(814)'
with path: '/slave(814)/containers'
I0928 16:07:52.681118  5812 http.cpp:1185] HTTP GET for /slave(814)/containers from 172.17.0.2:44874
I0928 16:07:52.681190  5812 http.cpp:976] Authorizing principal 'test-principal' to GET the
'/containers' endpoint
I0928 16:07:52.683699  5773 slave.cpp:869] Agent terminating
[       OK ] Endpoint/SlaveEndpointTest.UnauthorizedRequest/2 (36 ms)
[ RUN      ] Endpoint/SlaveEndpointTest.NoAuthorizer/0
I0928 16:07:52.702447  5773 containerizer.cpp:292] Using isolation { environment_secret, posix/cpu,
posix/mem, filesystem/posix, network/cni }
W0928 16:07:52.703357  5773 backend.cpp:76] Failed to create 'aufs' backend: AufsBackend requires
root privileges
W0928 16:07:52.703565  5773 backend.cpp:76] Failed to create 'bind' backend: BindBackend requires
root privileges
I0928 16:07:52.703625  5773 provisioner.cpp:255] Using default backend 'copy'
I0928 16:07:52.706495  5773 cluster.cpp:448] Creating default 'local' authorizer
I0928 16:07:52.709733  5805 slave.cpp:254] Mesos agent started on (815)@172.17.0.2:41520
I0928 16:07:52.709772  5805 slave.cpp:255] Flags at startup: --acls="" --appc_simple_discovery_uri_prefix="http://"
--appc_store_dir="/tmp/Endpoint_SlaveEndpointTest_NoAuthorizer_0_ei1JuP/store/appc" --authenticate_http_readonly="true"
--authenticate_http_readwrite="true" --authenticatee="crammd5" --authentication_backoff_factor="1secs"
--authorizer="local" --cgroups_cpu_enable_pids_and_tids_count="false" --cgroups_enable_cfs="false"
--cgroups_hierarchy="/sys/fs/cgroup" --cgroups_limit_swap="false" --cgroups_root="mesos" --container_disk_watch_interval="15secs"
--containerizers="mesos" --credential="/tmp/Endpoint_SlaveEndpointTest_NoAuthorizer_0_ei1JuP/credential"
--default_role="*" --disallow_sharing_agent_pid_namespace="false" --disk_watch_interval="1mins"
--docker="docker" --docker_kill_orphans="true" --docker_registry="https://registry-1.docker.io"
--docker_remove_delay="6hrs" --docker_socket="/var/run/docker.sock" --docker_stop_timeout="0ns"
--docker_store_dir="/tmp/Endpoint_SlaveEndpointTest_NoAuthorizer_0_ei1JuP/store/docker" --docker_volume_checkpoint_dir="/var/run/mesos/isolators/docker/volume"
--enforce_container_disk_quota="false" --executor_registration_timeout="1mins" --executor_reregistration_timeout="2secs"
--executor_shutdown_grace_period="5secs" --fetcher_cache_dir="/tmp/Endpoint_SlaveEndpointTest_NoAuthorizer_0_ei1JuP/fetch"
--fetcher_cache_size="2GB" --frameworks_home="" --gc_delay="1weeks" --gc_disk_headroom="0.1"
--hadoop_home="" --help="false" --hostname_lookup="true" --http_command_executor="false" --http_credentials="/tmp/Endpoint_SlaveEndpointTest_NoAuthorizer_0_ei1JuP/http_credentials"
--http_heartbeat_interval="30secs" --initialize_driver_logging="true" --isolation="posix/cpu,posix/mem"
--launcher="posix" --launcher_dir="/mesos/mesos-1.5.0/_build/src" --logbufsecs="0" --logging_level="INFO"
--max_completed_executors_per_framework="150" --oversubscribed_resources_interval="15secs"
--perf_duration="10secs" --perf_interval="1mins" --port="5051" --qos_correction_interval_min="0ns"
--quiet="false" --recover="reconnect" --recovery_timeout="15mins" --registration_backoff_factor="10ms"
--resources="cpus:2;gpus:0;mem:1024;disk:1024;ports:[31000-32000]" --revocable_cpu_low_priority="true"
--runtime_dir="/tmp/Endpoint_SlaveEndpointTest_NoAuthorizer_0_ei1JuP" --sandbox_directory="/mnt/mesos/sandbox"
--strict="true" --switch_user="true" --systemd_enable_support="true" --systemd_runtime_directory="/run/systemd/system"
--version="false" --work_dir="/tmp/Endpoint_SlaveEndpointTest_NoAuthorizer_0_sH7NVa" --zk_session_timeout="10secs"
I0928 16:07:52.710330  5805 credentials.hpp:86] Loading credential for authentication from
'/tmp/Endpoint_SlaveEndpointTest_NoAuthorizer_0_ei1JuP/credential'
I0928 16:07:52.710579  5805 slave.cpp:287] Agent using credential for: test-principal
I0928 16:07:52.710619  5805 credentials.hpp:37] Loading credentials for authentication from
'/tmp/Endpoint_SlaveEndpointTest_NoAuthorizer_0_ei1JuP/http_credentials'
I0928 16:07:52.710952  5805 http.cpp:1045] Creating default 'basic' HTTP authenticator for
realm 'mesos-agent-readonly'
I0928 16:07:52.711221  5805 http.cpp:1045] Creating default 'basic' HTTP authenticator for
realm 'mesos-agent-readwrite'
I0928 16:07:52.713382  5805 slave.cpp:585] Agent resources: [{"name":"cpus","scalar":{"value":2.0},"type":"SCALAR"},{"name":"mem","scalar":{"value":1024.0},"type":"SCALAR"},{"name":"disk","scalar":{"value":1024.0},"type":"SCALAR"},{"name":"ports","ranges":{"range":[{"begin":31000,"end":32000}]},"type":"RANGES"}]
I0928 16:07:52.713752  5805 slave.cpp:593] Agent attributes: [  ]
I0928 16:07:52.713773  5805 slave.cpp:602] Agent hostname: 808e10247f67
I0928 16:07:52.714030  5802 status_update_manager.cpp:177] Pausing sending status updates
I0928 16:07:52.716084  5794 state.cpp:64] Recovering state from '/tmp/Endpoint_SlaveEndpointTest_NoAuthorizer_0_sH7NVa/meta'
I0928 16:07:52.716627  5812 status_update_manager.cpp:203] Recovering status update manager
I0928 16:07:52.716949  5797 containerizer.cpp:648] Recovering containerizer
I0928 16:07:52.719350  5811 provisioner.cpp:416] Provisioner recovery complete
I0928 16:07:52.719926  5810 slave.cpp:6322] Finished recovery
I0928 16:07:52.720651  5810 slave.cpp:6504] Querying resource estimator for oversubscribable
resources
I0928 16:07:52.721076  5815 slave.cpp:6518] Received oversubscribable resources {} from the
resource estimator
I0928 16:07:52.725158  5809 process.cpp:3929] Handling HTTP event for process 'slave(815)'
with path: '/slave(815)/monitor/statistics'
I0928 16:07:52.726922  5808 http.cpp:1185] HTTP GET for /slave(815)/monitor/statistics from
172.17.0.2:44876
I0928 16:07:52.727062  5808 http.cpp:976] Authorizing principal 'test-principal' to GET the
'/monitor/statistics' endpoint
I0928 16:07:52.732130  5799 slave.cpp:869] Agent terminating
[       OK ] Endpoint/SlaveEndpointTest.NoAuthorizer/0 (47 ms)
[ RUN      ] Endpoint/SlaveEndpointTest.NoAuthorizer/1
I0928 16:07:52.747287  5773 containerizer.cpp:292] Using isolation { environment_secret, posix/cpu,
posix/mem, filesystem/posix, network/cni }
W0928 16:07:52.747900  5773 backend.cpp:76] Failed to create 'aufs' backend: AufsBackend requires
root privileges
W0928 16:07:52.748044  5773 backend.cpp:76] Failed to create 'bind' backend: BindBackend requires
root privileges
I0928 16:07:52.748092  5773 provisioner.cpp:255] Using default backend 'copy'
I0928 16:07:52.750272  5773 cluster.cpp:448] Creating default 'local' authorizer
I0928 16:07:52.752717  5803 slave.cpp:254] Mesos agent started on (816)@172.17.0.2:41520
I0928 16:07:52.752749  5803 slave.cpp:255] Flags at startup: --acls="" --appc_simple_discovery_uri_prefix="http://"
--appc_store_dir="/tmp/Endpoint_SlaveEndpointTest_NoAuthorizer_1_Cmf27r/store/appc" --authenticate_http_readonly="true"
--authenticate_http_readwrite="true" --authenticatee="crammd5" --authentication_backoff_factor="1secs"
--authorizer="local" --cgroups_cpu_enable_pids_and_tids_count="false" --cgroups_enable_cfs="false"
--cgroups_hierarchy="/sys/fs/cgroup" --cgroups_limit_swap="false" --cgroups_root="mesos" --container_disk_watch_interval="15secs"
--containerizers="mesos" --credential="/tmp/Endpoint_SlaveEndpointTest_NoAuthorizer_1_Cmf27r/credential"
--default_role="*" --disallow_sharing_agent_pid_namespace="false" --disk_watch_interval="1mins"
--docker="docker" --docker_kill_orphans="true" --docker_registry="https://registry-1.docker.io"
--docker_remove_delay="6hrs" --docker_socket="/var/run/docker.sock" --docker_stop_timeout="0ns"
--docker_store_dir="/tmp/Endpoint_SlaveEndpointTest_NoAuthorizer_1_Cmf27r/store/docker" --docker_volume_checkpoint_dir="/var/run/mesos/isolators/docker/volume"
--enforce_container_disk_quota="false" --executor_registration_timeout="1mins" --executor_reregistration_timeout="2secs"
--executor_shutdown_grace_period="5secs" --fetcher_cache_dir="/tmp/Endpoint_SlaveEndpointTest_NoAuthorizer_1_Cmf27r/fetch"
--fetcher_cache_size="2GB" --frameworks_home="" --gc_delay="1weeks" --gc_disk_headroom="0.1"
--hadoop_home="" --help="false" --hostname_lookup="true" --http_command_executor="false" --http_credentials="/tmp/Endpoint_SlaveEndpointTest_NoAuthorizer_1_Cmf27r/http_credentials"
--http_heartbeat_interval="30secs" --initialize_driver_logging="true" --isolation="posix/cpu,posix/mem"
--launcher="posix" --launcher_dir="/mesos/mesos-1.5.0/_build/src" --logbufsecs="0" --logging_level="INFO"
--max_completed_executors_per_framework="150" --oversubscribed_resources_interval="15secs"
--perf_duration="10secs" --perf_interval="1mins" --port="5051" --qos_correction_interval_min="0ns"
--quiet="false" --recover="reconnect" --recovery_timeout="15mins" --registration_backoff_factor="10ms"
--resources="cpus:2;gpus:0;mem:1024;disk:1024;ports:[31000-32000]" --revocable_cpu_low_priority="true"
--runtime_dir="/tmp/Endpoint_SlaveEndpointTest_NoAuthorizer_1_Cmf27r" --sandbox_directory="/mnt/mesos/sandbox"
--strict="true" --switch_user="true" --systemd_enable_support="true" --systemd_runtime_directory="/run/systemd/system"
--version="false" --work_dir="/tmp/Endpoint_SlaveEndpointTest_NoAuthorizer_1_3GBfsN" --zk_session_timeout="10secs"
I0928 16:07:52.753243  5803 credentials.hpp:86] Loading credential for authentication from
'/tmp/Endpoint_SlaveEndpointTest_NoAuthorizer_1_Cmf27r/credential'
I0928 16:07:52.753455  5803 slave.cpp:287] Agent using credential for: test-principal
I0928 16:07:52.753485  5803 credentials.hpp:37] Loading credentials for authentication from
'/tmp/Endpoint_SlaveEndpointTest_NoAuthorizer_1_Cmf27r/http_credentials'
I0928 16:07:52.753793  5803 http.cpp:1045] Creating default 'basic' HTTP authenticator for
realm 'mesos-agent-readonly'
I0928 16:07:52.753991  5803 http.cpp:1045] Creating default 'basic' HTTP authenticator for
realm 'mesos-agent-readwrite'
I0928 16:07:52.755718  5803 slave.cpp:585] Agent resources: [{"name":"cpus","scalar":{"value":2.0},"type":"SCALAR"},{"name":"mem","scalar":{"value":1024.0},"type":"SCALAR"},{"name":"disk","scalar":{"value":1024.0},"type":"SCALAR"},{"name":"ports","ranges":{"range":[{"begin":31000,"end":32000}]},"type":"RANGES"}]
I0928 16:07:52.756003  5803 slave.cpp:593] Agent attributes: [  ]
I0928 16:07:52.756021  5803 slave.cpp:602] Agent hostname: 808e10247f67
I0928 16:07:52.756170  5812 status_update_manager.cpp:177] Pausing sending status updates
I0928 16:07:52.757777  5805 state.cpp:64] Recovering state from '/tmp/Endpoint_SlaveEndpointTest_NoAuthorizer_1_3GBfsN/meta'
I0928 16:07:52.758213  5799 status_update_manager.cpp:203] Recovering status update manager
I0928 16:07:52.758486  5800 containerizer.cpp:648] Recovering containerizer
I0928 16:07:52.760258  5795 provisioner.cpp:416] Provisioner recovery complete
I0928 16:07:52.760712  5809 slave.cpp:6322] Finished recovery
I0928 16:07:52.761232  5809 slave.cpp:6504] Querying resource estimator for oversubscribable
resources
I0928 16:07:52.761531  5811 slave.cpp:6518] Received oversubscribable resources {} from the
resource estimator
I0928 16:07:52.764302  5796 process.cpp:3929] Handling HTTP event for process 'slave(816)'
with path: '/slave(816)/monitor/statistics.json'
I0928 16:07:52.765734  5807 http.cpp:1185] HTTP GET for /slave(816)/monitor/statistics.json
from 172.17.0.2:44878
I0928 16:07:52.765811  5807 http.cpp:976] Authorizing principal 'test-principal' to GET the
'/monitor/statistics.json' endpoint
I0928 16:07:52.770355  5773 slave.cpp:869] Agent terminating
[       OK ] Endpoint/SlaveEndpointTest.NoAuthorizer/1 (37 ms)
[ RUN      ] Endpoint/SlaveEndpointTest.NoAuthorizer/2
I0928 16:07:52.784274  5773 containerizer.cpp:292] Using isolation { environment_secret, posix/cpu,
posix/mem, filesystem/posix, network/cni }
W0928 16:07:52.784849  5773 backend.cpp:76] Failed to create 'aufs' backend: AufsBackend requires
root privileges
W0928 16:07:52.784977  5773 backend.cpp:76] Failed to create 'bind' backend: BindBackend requires
root privileges
I0928 16:07:52.785015  5773 provisioner.cpp:255] Using default backend 'copy'
I0928 16:07:52.787020  5773 cluster.cpp:448] Creating default 'local' authorizer
I0928 16:07:52.789486  5794 slave.cpp:254] Mesos agent started on (817)@172.17.0.2:41520
I0928 16:07:52.789516  5794 slave.cpp:255] Flags at startup: --acls="" --appc_simple_discovery_uri_prefix="http://"
--appc_store_dir="/tmp/Endpoint_SlaveEndpointTest_NoAuthorizer_2_i5F674/store/appc" --authenticate_http_readonly="true"
--authenticate_http_readwrite="true" --authenticatee="crammd5" --authentication_backoff_factor="1secs"
--authorizer="local" --cgroups_cpu_enable_pids_and_tids_count="false" --cgroups_enable_cfs="false"
--cgroups_hierarchy="/sys/fs/cgroup" --cgroups_limit_swap="false" --cgroups_root="mesos" --container_disk_watch_interval="15secs"
--containerizers="mesos" --credential="/tmp/Endpoint_SlaveEndpointTest_NoAuthorizer_2_i5F674/credential"
--default_role="*" --disallow_sharing_agent_pid_namespace="false" --disk_watch_interval="1mins"
--docker="docker" --docker_kill_orphans="true" --docker_registry="https://registry-1.docker.io"
--docker_remove_delay="6hrs" --docker_socket="/var/run/docker.sock" --docker_stop_timeout="0ns"
--docker_store_dir="/tmp/Endpoint_SlaveEndpointTest_NoAuthorizer_2_i5F674/store/docker" --docker_volume_checkpoint_dir="/var/run/mesos/isolators/docker/volume"
--enforce_container_disk_quota="false" --executor_registration_timeout="1mins" --executor_reregistration_timeout="2secs"
--executor_shutdown_grace_period="5secs" --fetcher_cache_dir="/tmp/Endpoint_SlaveEndpointTest_NoAuthorizer_2_i5F674/fetch"
--fetcher_cache_size="2GB" --frameworks_home="" --gc_delay="1weeks" --gc_disk_headroom="0.1"
--hadoop_home="" --help="false" --hostname_lookup="true" --http_command_executor="false" --http_credentials="/tmp/Endpoint_SlaveEndpointTest_NoAuthorizer_2_i5F674/http_credentials"
--http_heartbeat_interval="30secs" --initialize_driver_logging="true" --isolation="posix/cpu,posix/mem"
--launcher="posix" --launcher_dir="/mesos/mesos-1.5.0/_build/src" --logbufsecs="0" --logging_level="INFO"
--max_completed_executors_per_framework="150" --oversubscribed_resources_interval="15secs"
--perf_duration="10secs" --perf_interval="1mins" --port="5051" --qos_correction_interval_min="0ns"
--quiet="false" --recover="reconnect" --recovery_timeout="15mins" --registration_backoff_factor="10ms"
--resources="cpus:2;gpus:0;mem:1024;disk:1024;ports:[31000-32000]" --revocable_cpu_low_priority="true"
--runtime_dir="/tmp/Endpoint_SlaveEndpointTest_NoAuthorizer_2_i5F674" --sandbox_directory="/mnt/mesos/sandbox"
--strict="true" --switch_user="true" --systemd_enable_support="true" --systemd_runtime_directory="/run/systemd/system"
--version="false" --work_dir="/tmp/Endpoint_SlaveEndpointTest_NoAuthorizer_2_LinLmq" --zk_session_timeout="10secs"
I0928 16:07:52.789965  5794 credentials.hpp:86] Loading credential for authentication from
'/tmp/Endpoint_SlaveEndpointTest_NoAuthorizer_2_i5F674/credential'
I0928 16:07:52.790163  5794 slave.cpp:287] Agent using credential for: test-principal
I0928 16:07:52.790189  5794 credentials.hpp:37] Loading credentials for authentication from
'/tmp/Endpoint_SlaveEndpointTest_NoAuthorizer_2_i5F674/http_credentials'
I0928 16:07:52.790495  5794 http.cpp:1045] Creating default 'basic' HTTP authenticator for
realm 'mesos-agent-readonly'
I0928 16:07:52.790729  5794 http.cpp:1045] Creating default 'basic' HTTP authenticator for
realm 'mesos-agent-readwrite'
I0928 16:07:52.792886  5794 slave.cpp:585] Agent resources: [{"name":"cpus","scalar":{"value":2.0},"type":"SCALAR"},{"name":"mem","scalar":{"value":1024.0},"type":"SCALAR"},{"name":"disk","scalar":{"value":1024.0},"type":"SCALAR"},{"name":"ports","ranges":{"range":[{"begin":31000,"end":32000}]},"type":"RANGES"}]
I0928 16:07:52.793287  5794 slave.cpp:593] Agent attributes: [  ]
I0928 16:07:52.793310  5794 slave.cpp:602] Agent hostname: 808e10247f67
I0928 16:07:52.793483  5800 status_update_manager.cpp:177] Pausing sending status updates
I0928 16:07:52.795603  5813 state.cpp:64] Recovering state from '/tmp/Endpoint_SlaveEndpointTest_NoAuthorizer_2_LinLmq/meta'
I0928 16:07:52.795934  5805 status_update_manager.cpp:203] Recovering status update manager
I0928 16:07:52.796136  5805 containerizer.cpp:648] Recovering containerizer
I0928 16:07:52.797957  5801 provisioner.cpp:416] Provisioner recovery complete
I0928 16:07:52.798331  5800 slave.cpp:6322] Finished recovery
I0928 16:07:52.798805  5800 slave.cpp:6504] Querying resource estimator for oversubscribable
resources
I0928 16:07:52.799104  5803 slave.cpp:6518] Received oversubscribable resources {} from the
resource estimator
I0928 16:07:52.801996  5805 process.cpp:3929] Handling HTTP event for process 'slave(817)'
with path: '/slave(817)/containers'
I0928 16:07:52.803548  5814 http.cpp:1185] HTTP GET for /slave(817)/containers from 172.17.0.2:44880
I0928 16:07:52.803638  5814 http.cpp:976] Authorizing principal 'test-principal' to GET the
'/containers' endpoint
I0928 16:07:52.808605  5773 slave.cpp:869] Agent terminating
[       OK ] Endpoint/SlaveEndpointTest.NoAuthorizer/2 (38 ms)
[----------] 9 tests from Endpoint/SlaveEndpointTest (356 ms total)

[----------] 2 tests from ContainerizerType/DefaultContainerDNSFlagTest
[ RUN      ] ContainerizerType/DefaultContainerDNSFlagTest.ValidateFlag/0
[       OK ] ContainerizerType/DefaultContainerDNSFlagTest.ValidateFlag/0 (18 ms)
[ RUN      ] ContainerizerType/DefaultContainerDNSFlagTest.ValidateFlag/1
[       OK ] ContainerizerType/DefaultContainerDNSFlagTest.ValidateFlag/1 (15 ms)
[----------] 2 tests from ContainerizerType/DefaultContainerDNSFlagTest (33 ms total)

[----------] Global test environment tear-down
[==========] 1676 tests from 184 test cases ran. (620423 ms total)
[  PASSED  ] 1674 tests.
[  FAILED  ] 2 tests, listed below:
[  FAILED  ] ExamplesTest.JavaFramework
[  FAILED  ] ExamplesTest.V1JavaFramework

 2 FAILED TESTS
  YOU HAVE 20 DISABLED TESTS

I0928 16:07:52.925511  5816 process.cpp:1068] Failed to accept socket: future discarded
make[4]: *** [check-local] Error 1
make[4]: Leaving directory `/mesos/mesos-1.5.0/_build/src'
make[3]: *** [check-am] Error 2
make[3]: Leaving directory `/mesos/mesos-1.5.0/_build/src'
make[2]: *** [check] Error 2
make[2]: Leaving directory `/mesos/mesos-1.5.0/_build/src'
make[1]: *** [check-recursive] Error 1
make[1]: Leaving directory `/mesos/mesos-1.5.0/_build'
make: *** [distcheck] Error 1
+ docker rmi mesos-1506611488-2176
Untagged: mesos-1506611488-2176:latest
Deleted: sha256:df1f399ac9a17e1030afaa629a93b237ea4d8d16f8523cd24e0ed6460e9204cf
Deleted: sha256:32c40349611b987fa4dda4be893042e57df1fe35628bbba0702dcf1339548142
Deleted: sha256:51bd403348efbff0852a5e028fbe03e6e59644e605743153daf7568048718d74
Deleted: sha256:4f3a3f845cb6e08a2c10cfc116927783a6e12ae7fbb565874aaf00f823899f41
Deleted: sha256:735b102a24f191e29a73ec7e1407367147c747a42e36a66d38682c6533329db3
Deleted: sha256:c491e9330e09c2d0aaad8dc8f1595161cabc030fbc1a65d06726742971110037
Deleted: sha256:bbafc32b61b6f43ade5eee11d3b769b76328a0d2b8f05a0a94e8cfe12552a71f
Deleted: sha256:87f52a2af50888bd815763fa63f6a194a8beca16cef090a7e1b2bf8db91acecd
Deleted: sha256:6f8bad887c3e0b8c119179515bc743c42212525adc845aacb672f6bf689d7d82
Deleted: sha256:35ed14167434a408960272fd3ca29d9f278e61068ccf8fb7cbfe8ac21a5a5e1e
Deleted: sha256:9e59843a9336f8e883c5e2cd5340e747fc688db16df3292656b231a869b81766
Deleted: sha256:717e101b805d1d0833c2d3d11c1fd3fa299563dc7b6bbc1f65f10b310bf9af59
Deleted: sha256:c017dccc9a256546fa3f40681d43cffa0389bb520870829b192a530aa1ab48ac
Deleted: sha256:5076aa429e5d1c302f9d55eefaebb010e31c61c2af2d74a740083c67616111cb
Deleted: sha256:7b353e91859bc98a7402d14aac149ddf544597a9960e9a1ced9cce6a1fc1b754
Deleted: sha256:eec834255a510ef86845aa5cbfc55a739010a38ab908d2c01f078440b9a4b7dc
Deleted: sha256:e67ca5ece8eb196bc5eea4931f8a059d022288094a8340668d0c58a055468610
Deleted: sha256:c7b489efc975f4edde739ef42ff390d8283ef49930115f5657b6e87aaaf52387
Deleted: sha256:420a189873e1f2539fe62dd15311aa273829045884c433b290be08f4f7ded650
Deleted: sha256:a936e34ba97e977d9c6581691b9b3e801adda8392de61c17c927e161a58291a9
Deleted: sha256:0f17f557149edf195da4600b6ecd9770ce486f126b5634e12d4dfc1583ef2d9a
Deleted: sha256:a5b068123b95a2f146dc4b852780867ac41eec31777fbbdf73b9ff574471ac2f
Deleted: sha256:b776b35ed23a20ceabb2b2d90cab1263064a26d48cd5a4b5edebce5d9803ac56
Deleted: sha256:848a3c6ac51bf50123e8054ea7fb1be7eb045aac9bbcc5a0450e48489d29daea
Deleted: sha256:8b2e0c93209da211607d440836e5367ba06817dd780ba2125365886d4f227927
Deleted: sha256:cdb0dca53129a69eae775b1bb4fe0e6a507e0f97fbcfac564fc4c00e30ebc598
Deleted: sha256:51c70c72c13621783fb51f124e2a6bcbc30f528129ffaa731fe6cffcdc9a2116
Deleted: sha256:1d93b457b1cc8b1b7c680fda39a4c07c75501307f6a2f1beb44459aae6e7908c
Build step 'Execute shell' marked build as failure

Mime
View raw message