mesos-builds mailing list archives

Site index · List index
Message view « Date » · « Thread »
Top « Date » · « Thread »
From Apache Jenkins Server <jenk...@builds.apache.org>
Subject Build failed in Jenkins: Mesos-Buildbot » cmake,gcc,--verbose --enable-libevent --enable-ssl,GLOG_v=1 MESOS_VERBOSE=1,centos:7,(ubuntu)&&(!ubuntu-us1)&&(!ubuntu-eu2) #4186
Date Fri, 01 Sep 2017 23:10:31 GMT
See <https://builds.apache.org/job/Mesos-Buildbot/BUILDTOOL=cmake,COMPILER=gcc,CONFIGURATION=--verbose%20--enable-libevent%20--enable-ssl,ENVIRONMENT=GLOG_v=1%20MESOS_VERBOSE=1,OS=centos%3A7,label_exp=(ubuntu)&&(!ubuntu-us1)&&(!ubuntu-eu2)/4186/display/redirect>

------------------------------------------
[...truncated 16.97 MB...]
I0901 23:10:23.900163   988 state.cpp:64] Recovering state from '/tmp/MasterTest_AgentDomainMismatch_yVVzIo/meta'
I0901 23:10:23.900565   988 status_update_manager.cpp:203] Recovering status update manager
I0901 23:10:23.900755   984 containerizer.cpp:646] Recovering containerizer
I0901 23:10:23.902395   978 provisioner.cpp:416] Provisioner recovery complete
I0901 23:10:23.902693   988 slave.cpp:6296] Finished recovery
I0901 23:10:23.903183   988 slave.cpp:6478] Querying resource estimator for oversubscribable
resources
I0901 23:10:23.903533   980 slave.cpp:6492] Received oversubscribable resources {} from the
resource estimator
I0901 23:10:23.903717   991 status_update_manager.cpp:177] Pausing sending status updates
I0901 23:10:23.903743   980 slave.cpp:987] New master detected at master@172.17.0.5:48673
I0901 23:10:23.903856   980 slave.cpp:1022] Detecting new master
I0901 23:10:23.903995   980 slave.cpp:1049] Authenticating with master master@172.17.0.5:48673
I0901 23:10:23.904086   980 slave.cpp:1060] Using default CRAM-MD5 authenticatee
I0901 23:10:23.904340   977 authenticatee.cpp:121] Creating new client SASL connection
I0901 23:10:23.904636   989 master.cpp:7834] Authenticating slave(400)@172.17.0.5:48673
I0901 23:10:23.904841   976 authenticator.cpp:414] Starting authentication session for crammd5-authenticatee(837)@172.17.0.5:48673
I0901 23:10:23.905078   985 authenticator.cpp:98] Creating new server SASL connection
I0901 23:10:23.905328   983 authenticatee.cpp:213] Received SASL authentication mechanisms:
CRAM-MD5
I0901 23:10:23.905354   983 authenticatee.cpp:239] Attempting to authenticate with mechanism
'CRAM-MD5'
I0901 23:10:23.905493   983 authenticator.cpp:204] Received SASL authentication start
I0901 23:10:23.905550   983 authenticator.cpp:326] Authentication requires more steps
I0901 23:10:23.905658   983 authenticatee.cpp:259] Received SASL authentication step
I0901 23:10:23.905788   978 authenticator.cpp:232] Received SASL authentication step
I0901 23:10:23.905819   978 auxprop.cpp:109] Request to lookup properties for user: 'test-principal'
realm: 'e10a4c741143' server FQDN: 'e10a4c741143' SASL_AUXPROP_VERIFY_AGAINST_HASH: false
SASL_AUXPROP_OVERRIDE: false SASL_AUXPROP_AUTHZID: false 
I0901 23:10:23.905838   978 auxprop.cpp:181] Looking up auxiliary property '*userPassword'
I0901 23:10:23.905882   978 auxprop.cpp:181] Looking up auxiliary property '*cmusaslsecretCRAM-MD5'
I0901 23:10:23.905915   978 auxprop.cpp:109] Request to lookup properties for user: 'test-principal'
realm: 'e10a4c741143' server FQDN: 'e10a4c741143' SASL_AUXPROP_VERIFY_AGAINST_HASH: false
SASL_AUXPROP_OVERRIDE: false SASL_AUXPROP_AUTHZID: true 
I0901 23:10:23.905930   978 auxprop.cpp:131] Skipping auxiliary property '*userPassword' since
SASL_AUXPROP_AUTHZID == true
I0901 23:10:23.905939   978 auxprop.cpp:131] Skipping auxiliary property '*cmusaslsecretCRAM-MD5'
since SASL_AUXPROP_AUTHZID == true
I0901 23:10:23.905961   978 authenticator.cpp:318] Authentication success
I0901 23:10:23.906075   988 authenticatee.cpp:299] Authentication success
I0901 23:10:23.906200   981 master.cpp:7864] Successfully authenticated principal 'test-principal'
at slave(400)@172.17.0.5:48673
I0901 23:10:23.906205   978 authenticator.cpp:432] Authentication session cleanup for crammd5-authenticatee(837)@172.17.0.5:48673
I0901 23:10:23.906527   990 slave.cpp:1144] Successfully authenticated with master master@172.17.0.5:48673
I0901 23:10:23.906791   990 slave.cpp:1623] Will retry registration in 8.944736ms if necessary
I0901 23:10:23.907227   977 master.cpp:5717] Received register agent message from slave(400)@172.17.0.5:48673
(e10a4c741143)
I0901 23:10:23.907359   977 master.cpp:3806] Authorizing agent with principal 'test-principal'
I0901 23:10:23.907788   976 master.cpp:5777] Authorized registration of agent at slave(400)@172.17.0.5:48673
(e10a4c741143)
W0901 23:10:23.907866   976 master.cpp:5825] Agent at slave(400)@172.17.0.5:48673 is configured
with domain {"fault_domain":{"region":{"name":"region-abc"},"zone":{"name":"zone-456"}}} but
the master has no configured domain. Ignoring agent registration attempt
I0901 23:10:23.909191   975 slave.cpp:859] Agent terminating
I0901 23:10:23.915632   988 master.cpp:1163] Master terminating
[       OK ] MasterTest.AgentDomainMismatch (48 ms)
[ RUN      ] MasterTest.AgentDomainMismatchOnReregister
I0901 23:10:23.921921   975 cluster.cpp:162] Creating default 'local' authorizer
I0901 23:10:23.925730   984 master.cpp:445] Master 32d1a064-830d-411d-8b16-138535329153 (e10a4c741143)
started on 172.17.0.5:48673
I0901 23:10:23.925747   984 master.cpp:447] Flags at startup: --acls="" --agent_ping_timeout="15secs"
--agent_reregister_timeout="10mins" --allocation_interval="1secs" --allocator="HierarchicalDRF"
--authenticate_agents="true" --authenticate_frameworks="true" --authenticate_http_frameworks="true"
--authenticate_http_readonly="true" --authenticate_http_readwrite="true" --authenticators="crammd5"
--authorizers="local" --credentials="/tmp/XckFOz/credentials" --domain="{"fault_domain":{"region":{"name":"region-abc"},"zone":{"name":"zone-123"}}}"
--filter_gpu_resources="true" --framework_sorter="drf" --help="false" --hostname_lookup="true"
--http_authenticators="basic" --http_framework_authenticators="basic" --initialize_driver_logging="true"
--log_auto_initialize="true" --logbufsecs="0" --logging_level="INFO" --max_agent_ping_timeouts="5"
--max_completed_frameworks="50" --max_completed_tasks_per_framework="1000" --max_unreachable_tasks_per_framework="1000"
--port="5050" --quiet="false" --recovery_agent_removal_limit="100%" --registry="in_memory"
--registry_fetch_timeout="1mins" --registry_gc_interval="15mins" --registry_max_agent_age="2weeks"
--registry_max_agent_count="102400" --registry_store_timeout="100secs" --registry_strict="false"
--root_submissions="true" --user_sorter="drf" --version="false" --webui_dir="/usr/local/share/mesos/webui"
--work_dir="/tmp/XckFOz/master" --zk_session_timeout="10secs"
I0901 23:10:23.926141   984 master.cpp:497] Master only allowing authenticated frameworks
to register
I0901 23:10:23.926149   984 master.cpp:511] Master only allowing authenticated agents to register
I0901 23:10:23.926153   984 master.cpp:524] Master only allowing authenticated HTTP frameworks
to register
I0901 23:10:23.926159   984 credentials.hpp:37] Loading credentials for authentication from
'/tmp/XckFOz/credentials'
I0901 23:10:23.926422   984 master.cpp:569] Using default 'crammd5' authenticator
I0901 23:10:23.926626   984 http.cpp:1045] Creating default 'basic' HTTP authenticator for
realm 'mesos-master-readonly'
I0901 23:10:23.926831   984 http.cpp:1045] Creating default 'basic' HTTP authenticator for
realm 'mesos-master-readwrite'
I0901 23:10:23.926986   984 http.cpp:1045] Creating default 'basic' HTTP authenticator for
realm 'mesos-master-scheduler'
I0901 23:10:23.927135   984 master.cpp:649] Authorization enabled
I0901 23:10:23.927397   989 hierarchical.cpp:171] Initialized hierarchical allocator process
I0901 23:10:23.927436   988 whitelist_watcher.cpp:77] No whitelist given
I0901 23:10:23.931469   990 master.cpp:2166] Elected as the leading master!
I0901 23:10:23.931504   990 master.cpp:1705] Recovering from registrar
I0901 23:10:23.931675   979 registrar.cpp:347] Recovering registrar
I0901 23:10:23.932534   979 registrar.cpp:391] Successfully fetched the registry (0B) in 0ns
I0901 23:10:23.932734   979 registrar.cpp:495] Applied 1 operations in 46511ns; attempting
to update the registry
I0901 23:10:23.933483   979 registrar.cpp:552] Successfully updated the registry in 0ns
I0901 23:10:23.933643   979 registrar.cpp:424] Successfully recovered registrar
I0901 23:10:23.934034   990 hierarchical.cpp:209] Skipping recovery of hierarchical allocator:
nothing to recover
I0901 23:10:23.934023   991 master.cpp:1804] Recovered 0 agents from the registry (161B);
allowing 10mins for agents to re-register
W0901 23:10:23.941602   975 process.cpp:3240] Attempted to spawn already running process files@172.17.0.5:48673
I0901 23:10:23.943042   975 containerizer.cpp:290] Using isolation { environment_secret, posix/cpu,
posix/mem, filesystem/posix, network/cni }
W0901 23:10:23.943763   975 backend.cpp:76] Failed to create 'aufs' backend: AufsBackend requires
root privileges
W0901 23:10:23.943918   975 backend.cpp:76] Failed to create 'bind' backend: BindBackend requires
root privileges
I0901 23:10:23.944067   975 provisioner.cpp:255] Using default backend 'copy'
I0901 23:10:23.946738   975 cluster.cpp:448] Creating default 'local' authorizer
I0901 23:10:23.950016   976 slave.cpp:252] Mesos agent started on (401)@172.17.0.5:48673
I0901 23:10:23.950038   976 slave.cpp:253] Flags at startup: --acls="" --appc_simple_discovery_uri_prefix="http://"
--appc_store_dir="/tmp/MasterTest_AgentDomainMismatchOnReregister_t3CgJm/store/appc" --authenticate_http_executors="true"
--authenticate_http_readonly="true" --authenticate_http_readwrite="true" --authenticatee="crammd5"
--authentication_backoff_factor="1secs" --authorizer="local" --cgroups_cpu_enable_pids_and_tids_count="false"
--cgroups_enable_cfs="false" --cgroups_hierarchy="/sys/fs/cgroup" --cgroups_limit_swap="false"
--cgroups_root="mesos" --container_disk_watch_interval="15secs" --containerizers="mesos" --credential="/tmp/MasterTest_AgentDomainMismatchOnReregister_t3CgJm/credential"
--default_role="*" --disallow_sharing_agent_pid_namespace="false" --disk_watch_interval="1mins"
--docker="docker" --docker_kill_orphans="true" --docker_registry="https://registry-1.docker.io"
--docker_remove_delay="6hrs" --docker_socket="/var/run/docker.sock" --docker_stop_timeout="0ns"
--docker_store_dir="/tmp/MasterTest_AgentDomainMismatchOnReregister_t3CgJm/store/docker" --docker_volume_checkpoint_dir="/var/run/mesos/isolators/docker/volume"
--domain="{"fault_domain":{"region":{"name":"region-abc"},"zone":{"name":"zone-456"}}}" --enforce_container_disk_quota="false"
--executor_registration_timeout="1mins" --executor_reregistration_timeout="2secs" --executor_secret_key="/tmp/MasterTest_AgentDomainMismatchOnReregister_t3CgJm/executor_secret_key"
--executor_shutdown_grace_period="5secs" --fetcher_cache_dir="/tmp/MasterTest_AgentDomainMismatchOnReregister_t3CgJm/fetch"
--fetcher_cache_size="2GB" --frameworks_home="" --gc_delay="1weeks" --gc_disk_headroom="0.1"
--hadoop_home="" --help="false" --hostname_lookup="true" --http_command_executor="false" --http_credentials="/tmp/MasterTest_AgentDomainMismatchOnReregister_t3CgJm/http_credentials"
--http_heartbeat_interval="30secs" --initialize_driver_logging="true" --isolation="posix/cpu,posix/mem"
--launcher="posix" --launcher_dir="/mesos/build/src" --logbufsecs="0" --logging_level="INFO"
--max_completed_executors_per_framework="150" --oversubscribed_resources_interval="15secs"
--perf_duration="10secs" --perf_interval="1mins" --port="5051" --qos_correction_interval_min="0ns"
--quiet="false" --recover="reconnect" --recovery_timeout="15mins" --registration_backoff_factor="10ms"
--resources="cpus:2;gpus:0;mem:1024;disk:1024;ports:[31000-32000]" --revocable_cpu_low_priority="true"
--runtime_dir="/tmp/MasterTest_AgentDomainMismatchOnReregister_t3CgJm" --sandbox_directory="/mnt/mesos/sandbox"
--strict="true" --switch_user="true" --systemd_enable_support="true" --systemd_runtime_directory="/run/systemd/system"
--version="false" --work_dir="/tmp/MasterTest_AgentDomainMismatchOnReregister_apbXgY" --zk_session_timeout="10secs"
I0901 23:10:23.950503   976 credentials.hpp:86] Loading credential for authentication from
'/tmp/MasterTest_AgentDomainMismatchOnReregister_t3CgJm/credential'
I0901 23:10:23.950706   976 slave.cpp:285] Agent using credential for: test-principal
I0901 23:10:23.950724   976 credentials.hpp:37] Loading credentials for authentication from
'/tmp/MasterTest_AgentDomainMismatchOnReregister_t3CgJm/http_credentials'
I0901 23:10:23.951014   976 http.cpp:1045] Creating default 'basic' HTTP authenticator for
realm 'mesos-agent-executor'
I0901 23:10:23.951179   976 http.cpp:1066] Creating default 'jwt' HTTP authenticator for realm
'mesos-agent-executor'
I0901 23:10:23.951478   976 http.cpp:1045] Creating default 'basic' HTTP authenticator for
realm 'mesos-agent-readonly'
I0901 23:10:23.951681   976 http.cpp:1066] Creating default 'jwt' HTTP authenticator for realm
'mesos-agent-readonly'
I0901 23:10:23.951925   976 http.cpp:1045] Creating default 'basic' HTTP authenticator for
realm 'mesos-agent-readwrite'
I0901 23:10:23.952201   976 http.cpp:1066] Creating default 'jwt' HTTP authenticator for realm
'mesos-agent-readwrite'
I0901 23:10:23.953685   976 slave.cpp:581] Agent resources: [{"name":"cpus","scalar":{"value":2.0},"type":"SCALAR"},{"name":"mem","scalar":{"value":1024.0},"type":"SCALAR"},{"name":"disk","scalar":{"value":1024.0},"type":"SCALAR"},{"name":"ports","ranges":{"range":[{"begin":31000,"end":32000}]},"type":"RANGES"}]
I0901 23:10:23.953863   976 slave.cpp:589] Agent attributes: [  ]
I0901 23:10:23.953914   976 slave.cpp:598] Agent hostname: e10a4c741143
I0901 23:10:23.954149   980 status_update_manager.cpp:177] Pausing sending status updates
I0901 23:10:23.955866   982 state.cpp:64] Recovering state from '/tmp/MasterTest_AgentDomainMismatchOnReregister_apbXgY/meta'
I0901 23:10:23.956238   982 status_update_manager.cpp:203] Recovering status update manager
I0901 23:10:23.956442   988 containerizer.cpp:646] Recovering containerizer
I0901 23:10:23.958232   976 provisioner.cpp:416] Provisioner recovery complete
I0901 23:10:23.958652   976 slave.cpp:6296] Finished recovery
I0901 23:10:23.959275   976 slave.cpp:6478] Querying resource estimator for oversubscribable
resources
I0901 23:10:23.959611   988 slave.cpp:987] New master detected at master@172.17.0.5:48673
I0901 23:10:23.959687   980 status_update_manager.cpp:177] Pausing sending status updates
I0901 23:10:23.959909   988 slave.cpp:1022] Detecting new master
I0901 23:10:23.960286   988 slave.cpp:6492] Received oversubscribable resources {} from the
resource estimator
I0901 23:10:23.960512   988 slave.cpp:1049] Authenticating with master master@172.17.0.5:48673
I0901 23:10:23.960710   988 slave.cpp:1060] Using default CRAM-MD5 authenticatee
I0901 23:10:23.961055   982 authenticatee.cpp:121] Creating new client SASL connection
I0901 23:10:23.961448   979 master.cpp:7834] Authenticating slave(401)@172.17.0.5:48673
I0901 23:10:23.961669   979 authenticator.cpp:414] Starting authentication session for crammd5-authenticatee(838)@172.17.0.5:48673
I0901 23:10:23.961941   984 authenticator.cpp:98] Creating new server SASL connection
I0901 23:10:23.962136   991 authenticatee.cpp:213] Received SASL authentication mechanisms:
CRAM-MD5
I0901 23:10:23.962270   991 authenticatee.cpp:239] Attempting to authenticate with mechanism
'CRAM-MD5'
I0901 23:10:23.962467   991 authenticator.cpp:204] Received SASL authentication start
I0901 23:10:23.962527   991 authenticator.cpp:326] Authentication requires more steps
I0901 23:10:23.962666   991 authenticatee.cpp:259] Received SASL authentication step
I0901 23:10:23.962802   991 authenticator.cpp:232] Received SASL authentication step
I0901 23:10:23.962832   991 auxprop.cpp:109] Request to lookup properties for user: 'test-principal'
realm: 'e10a4c741143' server FQDN: 'e10a4c741143' SASL_AUXPROP_VERIFY_AGAINST_HASH: false
SASL_AUXPROP_OVERRIDE: false SASL_AUXPROP_AUTHZID: false 
I0901 23:10:23.962847   991 auxprop.cpp:181] Looking up auxiliary property '*userPassword'
I0901 23:10:23.962896   991 auxprop.cpp:181] Looking up auxiliary property '*cmusaslsecretCRAM-MD5'
I0901 23:10:23.962930   991 auxprop.cpp:109] Request to lookup properties for user: 'test-principal'
realm: 'e10a4c741143' server FQDN: 'e10a4c741143' SASL_AUXPROP_VERIFY_AGAINST_HASH: false
SASL_AUXPROP_OVERRIDE: false SASL_AUXPROP_AUTHZID: true 
I0901 23:10:23.962944   991 auxprop.cpp:131] Skipping auxiliary property '*userPassword' since
SASL_AUXPROP_AUTHZID == true
I0901 23:10:23.962952   991 auxprop.cpp:131] Skipping auxiliary property '*cmusaslsecretCRAM-MD5'
since SASL_AUXPROP_AUTHZID == true
I0901 23:10:23.962985   991 authenticator.cpp:318] Authentication success
I0901 23:10:23.963201   983 authenticatee.cpp:299] Authentication success
I0901 23:10:23.963318   986 master.cpp:7864] Successfully authenticated principal 'test-principal'
at slave(401)@172.17.0.5:48673
I0901 23:10:23.963428   991 authenticator.cpp:432] Authentication session cleanup for crammd5-authenticatee(838)@172.17.0.5:48673
I0901 23:10:23.963907   976 slave.cpp:1144] Successfully authenticated with master master@172.17.0.5:48673
I0901 23:10:23.964193   976 slave.cpp:1623] Will retry registration in 5.616408ms if necessary
I0901 23:10:23.964437   982 master.cpp:5717] Received register agent message from slave(401)@172.17.0.5:48673
(e10a4c741143)
I0901 23:10:23.964589   982 master.cpp:3806] Authorizing agent with principal 'test-principal'
I0901 23:10:23.965078   981 master.cpp:5777] Authorized registration of agent at slave(401)@172.17.0.5:48673
(e10a4c741143)
I0901 23:10:23.965209   981 master.cpp:5870] Registering agent at slave(401)@172.17.0.5:48673
(e10a4c741143) with id 32d1a064-830d-411d-8b16-138535329153-S0
I0901 23:10:23.965669   984 registrar.cpp:495] Applied 1 operations in 65995ns; attempting
to update the registry
I0901 23:10:23.966428   984 registrar.cpp:552] Successfully updated the registry in 0ns
I0901 23:10:23.966642   978 master.cpp:5917] Admitted agent 32d1a064-830d-411d-8b16-138535329153-S0
at slave(401)@172.17.0.5:48673 (e10a4c741143)
I0901 23:10:23.967264   991 slave.cpp:4963] Received ping from slave-observer(401)@172.17.0.5:48673
I0901 23:10:23.967667   980 hierarchical.cpp:593] Added agent 32d1a064-830d-411d-8b16-138535329153-S0
(e10a4c741143) with cpus:2; mem:1024; disk:1024; ports:[31000-32000] (allocated: {})
I0901 23:10:23.968041   991 slave.cpp:1190] Registered with master master@172.17.0.5:48673;
given agent ID 32d1a064-830d-411d-8b16-138535329153-S0
I0901 23:10:23.968364   980 hierarchical.cpp:1943] No allocations performed
I0901 23:10:23.968423   980 hierarchical.cpp:1486] Performed allocation for 1 agents in 196521ns
I0901 23:10:23.968552   980 status_update_manager.cpp:184] Resuming sending status updates
I0901 23:10:23.967756   978 master.cpp:5948] Registered agent 32d1a064-830d-411d-8b16-138535329153-S0
at slave(401)@172.17.0.5:48673 (e10a4c741143) with [{"name":"cpus","scalar":{"value":2.0},"type":"SCALAR"},{"name":"mem","scalar":{"value":1024.0},"type":"SCALAR"},{"name":"disk","scalar":{"value":1024.0},"type":"SCALAR"},{"name":"ports","ranges":{"range":[{"begin":31000,"end":32000}]},"type":"RANGES"}]
I0901 23:10:23.968878   991 slave.cpp:1210] Checkpointing SlaveInfo to '/tmp/MasterTest_AgentDomainMismatchOnReregister_apbXgY/meta/slaves/32d1a064-830d-411d-8b16-138535329153-S0/slave.info'
I0901 23:10:23.969314   991 slave.cpp:1259] Forwarding total oversubscribed resources {}
I0901 23:10:23.969506   991 master.cpp:6685] Received update of agent 32d1a064-830d-411d-8b16-138535329153-S0
at slave(401)@172.17.0.5:48673 (e10a4c741143) with total oversubscribed resources {}
I0901 23:10:23.969789   982 hierarchical.cpp:660] Agent 32d1a064-830d-411d-8b16-138535329153-S0
(e10a4c741143) updated with total resources cpus:2; mem:1024; disk:1024; ports:[31000-32000]
I0901 23:10:23.970005   985 master.cpp:1163] Master terminating
I0901 23:10:23.970538   977 hierarchical.cpp:626] Removed agent 32d1a064-830d-411d-8b16-138535329153-S0
I0901 23:10:23.980854   991 slave.cpp:5005] Got exited event for master@172.17.0.5:48673
W0901 23:10:23.980895   991 slave.cpp:5010] Master disconnected! Waiting for a new master
to be elected
I0901 23:10:23.986716   975 cluster.cpp:162] Creating default 'local' authorizer
I0901 23:10:23.991343   976 master.cpp:445] Master 8dd61e9e-5f5f-44ce-b436-4c28f48ae31f (e10a4c741143)
started on 172.17.0.5:48673
I0901 23:10:23.991365   976 master.cpp:447] Flags at startup: --acls="" --agent_ping_timeout="15secs"
--agent_reregister_timeout="10mins" --allocation_interval="1secs" --allocator="HierarchicalDRF"
--authenticate_agents="true" --authenticate_frameworks="true" --authenticate_http_frameworks="true"
--authenticate_http_readonly="true" --authenticate_http_readwrite="true" --authenticators="crammd5"
--authorizers="local" --credentials="/tmp/XckFOz/credentials" --filter_gpu_resources="true"
--framework_sorter="drf" --help="false" --hostname_lookup="true" --http_authenticators="basic"
--http_framework_authenticators="basic" --initialize_driver_logging="true" --log_auto_initialize="true"
--logbufsecs="0" --logging_level="INFO" --max_agent_ping_timeouts="5" --max_completed_frameworks="50"
--max_completed_tasks_per_framework="1000" --max_unreachable_tasks_per_framework="1000" --port="5050"
--quiet="false" --recovery_agent_removal_limit="100%" --registry="in_memory" --registry_fetch_timeout="1mins"
--registry_gc_interval="15mins" --registry_max_agent_age="2weeks" --registry_max_agent_count="102400"
--registry_store_timeout="100secs" --registry_strict="false" --root_submissions="true" --user_sorter="drf"
--version="false" --webui_dir="/usr/local/share/mesos/webui" --work_dir="/tmp/XckFOz/master"
--zk_session_timeout="10secs"
I0901 23:10:23.991662   976 master.cpp:497] Master only allowing authenticated frameworks
to register
I0901 23:10:23.991693   976 master.cpp:511] Master only allowing authenticated agents to register
I0901 23:10:23.991717   976 master.cpp:524] Master only allowing authenticated HTTP frameworks
to register
I0901 23:10:23.991745   976 credentials.hpp:37] Loading credentials for authentication from
'/tmp/XckFOz/credentials'
I0901 23:10:23.992038   976 master.cpp:569] Using default 'crammd5' authenticator
I0901 23:10:23.992245   976 http.cpp:1045] Creating default 'basic' HTTP authenticator for
realm 'mesos-master-readonly'
I0901 23:10:23.992440   976 http.cpp:1045] Creating default 'basic' HTTP authenticator for
realm 'mesos-master-readwrite'
I0901 23:10:23.992594   976 http.cpp:1045] Creating default 'basic' HTTP authenticator for
realm 'mesos-master-scheduler'
I0901 23:10:23.992748   976 master.cpp:649] Authorization enabled
I0901 23:10:23.993069   990 hierarchical.cpp:171] Initialized hierarchical allocator process
I0901 23:10:23.993311   980 whitelist_watcher.cpp:77] No whitelist given
I0901 23:10:23.996721   978 master.cpp:2166] Elected as the leading master!
I0901 23:10:23.996753   978 master.cpp:1705] Recovering from registrar
I0901 23:10:23.996935   979 registrar.cpp:347] Recovering registrar
I0901 23:10:23.997747   979 registrar.cpp:391] Successfully fetched the registry (0B) in 0ns
I0901 23:10:23.997881   979 registrar.cpp:495] Applied 1 operations in 38103ns; attempting
to update the registry
I0901 23:10:23.998591   979 registrar.cpp:552] Successfully updated the registry in 0ns
I0901 23:10:23.998728   979 registrar.cpp:424] Successfully recovered registrar
I0901 23:10:23.999084   985 hierarchical.cpp:209] Skipping recovery of hierarchical allocator:
nothing to recover
I0901 23:10:23.999080   981 master.cpp:1804] Recovered 0 agents from the registry (129B);
allowing 10mins for agents to re-register
I0901 23:10:24.000334   988 status_update_manager.cpp:177] Pausing sending status updates
I0901 23:10:24.000365   991 slave.cpp:987] New master detected at master@172.17.0.5:48673
I0901 23:10:24.000615   991 slave.cpp:1022] Detecting new master
I0901 23:10:24.000833   983 slave.cpp:1049] Authenticating with master master@172.17.0.5:48673
I0901 23:10:24.000965   983 slave.cpp:1060] Using default CRAM-MD5 authenticatee
I0901 23:10:24.001436   987 authenticatee.cpp:121] Creating new client SASL connection
I0901 23:10:24.001765   989 master.cpp:7834] Authenticating slave(401)@172.17.0.5:48673
I0901 23:10:24.001907   982 authenticator.cpp:414] Starting authentication session for crammd5-authenticatee(839)@172.17.0.5:48673
I0901 23:10:24.002176   990 authenticator.cpp:98] Creating new server SASL connection
I0901 23:10:24.002444   984 authenticatee.cpp:213] Received SASL authentication mechanisms:
CRAM-MD5
I0901 23:10:24.002465   984 authenticatee.cpp:239] Attempting to authenticate with mechanism
'CRAM-MD5'
I0901 23:10:24.002563   980 authenticator.cpp:204] Received SASL authentication start
I0901 23:10:24.002612   980 authenticator.cpp:326] Authentication requires more steps
I0901 23:10:24.002717   980 authenticatee.cpp:259] Received SASL authentication step
I0901 23:10:24.002838   980 authenticator.cpp:232] Received SASL authentication step
I0901 23:10:24.002867   980 auxprop.cpp:109] Request to lookup properties for user: 'test-principal'
realm: 'e10a4c741143' server FQDN: 'e10a4c741143' SASL_AUXPROP_VERIFY_AGAINST_HASH: false
SASL_AUXPROP_OVERRIDE: false SASL_AUXPROP_AUTHZID: false 
I0901 23:10:24.002884   980 auxprop.cpp:181] Looking up auxiliary property '*userPassword'
I0901 23:10:24.002933   980 auxprop.cpp:181] Looking up auxiliary property '*cmusaslsecretCRAM-MD5'
I0901 23:10:24.002960   980 auxprop.cpp:109] Request to lookup properties for user: 'test-principal'
realm: 'e10a4c741143' server FQDN: 'e10a4c741143' SASL_AUXPROP_VERIFY_AGAINST_HASH: false
SASL_AUXPROP_OVERRIDE: false SASL_AUXPROP_AUTHZID: true 
I0901 23:10:24.002979   980 auxprop.cpp:131] Skipping auxiliary property '*userPassword' since
SASL_AUXPROP_AUTHZID == true
I0901 23:10:24.002988   980 auxprop.cpp:131] Skipping auxiliary property '*cmusaslsecretCRAM-MD5'
since SASL_AUXPROP_AUTHZID == true
I0901 23:10:24.003006   980 authenticator.cpp:318] Authentication success
I0901 23:10:24.003108   979 authenticatee.cpp:299] Authentication success
I0901 23:10:24.003231   976 master.cpp:7864] Successfully authenticated principal 'test-principal'
at slave(401)@172.17.0.5:48673
I0901 23:10:24.003314   980 authenticator.cpp:432] Authentication session cleanup for crammd5-authenticatee(839)@172.17.0.5:48673
I0901 23:10:24.003491   985 slave.cpp:1144] Successfully authenticated with master master@172.17.0.5:48673
I0901 23:10:24.003834   985 slave.cpp:1623] Will retry registration in 15.552607ms if necessary
I0901 23:10:24.004379   987 master.cpp:6017] Received re-register agent message from agent
32d1a064-830d-411d-8b16-138535329153-S0 at slave(401)@172.17.0.5:48673 (e10a4c741143)
I0901 23:10:24.004577   987 master.cpp:3806] Authorizing agent with principal 'test-principal'
I0901 23:10:24.005080   990 master.cpp:6086] Authorized re-registration of agent 32d1a064-830d-411d-8b16-138535329153-S0
at slave(401)@172.17.0.5:48673 (e10a4c741143)
W0901 23:10:24.005180   990 master.cpp:6134] Agent at slave(401)@172.17.0.5:48673 is configured
with domain {"fault_domain":{"region":{"name":"region-abc"},"zone":{"name":"zone-456"}}} but
the master has no configured domain.Ignoring agent re-registration attempt
I0901 23:10:24.006551   976 slave.cpp:859] Agent terminating
*** Aborted at 1504307424 (unix time) try "date -d @1504307424" if you are using GNU date
***
PC: @     0x7fc85aa510ae process::EventQueue::Consumer::empty()
*** SIGSEGV (@0x8) received by PID 975 (TID 0x7fc8499d7700) from PID 8; stack trace: ***
I0901 23:10:24.014961   975 master.cpp:1163] Master terminating
    @     0x7fc855fa9370 (unknown)
    @     0x7fc85aa510ae process::EventQueue::Consumer::empty()
[       OK ] MasterTest.AgentDomainMismatchOnReregister (101 ms)
[ RUN      ] MasterTest.IgnoreOldAgentRegistration
    @     0x7fc85aa39f46 process::ProcessManager::resume()
    @     0x7fc85aa365ce _ZZN7process14ProcessManager12init_threadsEvENKUlvE_clEv
    @     0x7fc85aa481be _ZNSt12_Bind_simpleIFZN7process14ProcessManager12init_threadsEvEUlvE_vEE9_M_invokeIIEEEvSt12_Index_tupleIIXspT_EEE
    @     0x7fc85aa48115 _ZNSt12_Bind_simpleIFZN7process14ProcessManager12init_threadsEvEUlvE_vEEclEv
I0901 23:10:24.025144   975 cluster.cpp:162] Creating default 'local' authorizer
    @     0x7fc85aa480ae _ZNSt6thread5_ImplISt12_Bind_simpleIFZN7process14ProcessManager12init_threadsEvEUlvE_vEEE6_M_runEv
    @     0x7fc855d46230 (unknown)
    @     0x7fc855fa1dc5 start_thread
    @     0x7fc8554af76d __clone
make[3]: *** [CMakeFiles/check] Segmentation fault
make[3]: Leaving directory `/mesos/build'
make[2]: *** [CMakeFiles/check.dir/all] Error 2
make[2]: Leaving directory `/mesos/build'
make[1]: *** [CMakeFiles/check.dir/rule] Error 2
make[1]: Leaving directory `/mesos/build'
make: *** [check] Error 2
+ docker rmi mesos-1504304437-17377
Untagged: mesos-1504304437-17377:latest
Deleted: sha256:629010f19edc578debd97ef681f2cc19f3b5c2f1910fa3d4b58e95c8288bae53
Deleted: sha256:155521f5dd3f27e4af2d74b7150cf18865ed4bc8f8a60f3157c30b70fecf78eb
Deleted: sha256:550aab3902b793e6715ba2aab6e7c008cca8ef59bc431aada14de581710df439
Deleted: sha256:e951c303efeb18d697d64ab067c54709080b70276f10e8e9abcf6cf674aaefc6
Deleted: sha256:28f377fcd70105a0e4c176683df6f20b36df0a061cce790e7924259d215684f9
Deleted: sha256:e1b577e21ed74e824635725e3ebac8fb49fd52ae51c578a2b38d2162b31a62ab
Deleted: sha256:1c3f047ee7764e37c5a02978612826c63f0fac82d77c45359ce8be570cc63c3e
Deleted: sha256:ae232f8387fa58c6a9241d1bc4f9c3456af0f9f0c664f7e29f52bad443b716a0
Deleted: sha256:2fcc4e1d336bdedd735bdd887d923c9d58ed9c391df5537fd2069e85796b37a0
Deleted: sha256:2785dca1f1c2f6b1ea6af5ba0180148d4327b1c84334757e4d551d33bb5c6e65
Deleted: sha256:c6d6b7f354f8c215f93f1973f1c34f9429ec1ed4a63b021101ddb10af0a6bacc
Deleted: sha256:6bccf320a7d74130eded3ccf78bc4536320504527e5096df9655e491f916b66f
Deleted: sha256:00c5dc677461cf63f519e3ac759882d216cc2a80ed87cb149dae829853661bbb
Deleted: sha256:101c615dcbe94eb1fe65bbd05dd59f63f7ac65395e52a6bfe84f35f5dfd41cbc
Deleted: sha256:e6cd6e4402810c95c97c0f6f83d77a3f11d78970149150e67871cec65c69bda8
Deleted: sha256:7779d651c7b54b6fea38fb614defa708614cc956cb1486ffcf39c8488fc20301
Deleted: sha256:64093742bcb7603b68d88cb977c3c4f9a7c102ee760002384bd779c69e5d741d
Deleted: sha256:ec4b68c483def1e267e7bc155742d2927106bb1de012e4765a9bad133e5890fb
Deleted: sha256:cd9791c83432e118a952e4025627880d706edcbdda13a37265d8335049b32cd7
Deleted: sha256:7c41b2f9d40113d80a4ac58928637195855b4ea1a38e1287db7d99619c41ab5d
Deleted: sha256:f87e1d566397bc46732f46ba79d6b2a47ccb2828e485f421d18d54ce8eb8fc5e
Deleted: sha256:106fbe1e1142dab7a5516ed2f70cef35b86884dae30ec4fc4e1573da4fbae0a7
Deleted: sha256:1c1b3f2c76fafacc561e85082a754ec04f48835f223d1ce3e530ae6f7355b319
Deleted: sha256:1ef13103112ac8930e42d62f35de8b0c100d90b35cfc2948fe904847264770d7
Deleted: sha256:07564adfdbb44384b2f9fac407e97d1b0f928e4f16a015f616ab7cf48cdffd8c
Build step 'Execute shell' marked build as failure

Mime
View raw message