mesos-builds mailing list archives

Site index · List index
Message view « Date » · « Thread »
Top « Date » · « Thread »
From Apache Jenkins Server <jenk...@builds.apache.org>
Subject Build failed in Jenkins: Mesos-Buildbot » autotools,clang,--verbose --enable-libevent --enable-ssl,GLOG_v=1 MESOS_VERBOSE=1,ubuntu:14.04,(ubuntu)&&(!ubuntu-us1)&&(!ubuntu-eu2)&&(!qnode3)&&(!H23) #4248
Date Thu, 21 Sep 2017 06:21:59 GMT
See <https://builds.apache.org/job/Mesos-Buildbot/BUILDTOOL=autotools,COMPILER=clang,CONFIGURATION=--verbose%20--enable-libevent%20--enable-ssl,ENVIRONMENT=GLOG_v=1%20MESOS_VERBOSE=1,OS=ubuntu%3A14.04,label_exp=(ubuntu)&&(!ubuntu-us1)&&(!ubuntu-eu2)&&(!qnode3)&&(!H23)/4248/display/redirect>

------------------------------------------
[...truncated 32.94 MB...]
I0921 06:21:53.591370 27955 slave.cpp:253] Flags at startup: --acls="" --appc_simple_discovery_uri_prefix="http://"
--appc_store_dir="/tmp/Endpoint_SlaveEndpointTest_UnauthorizedRequest_0_w1I5Je/store/appc"
--authenticate_http_executors="true" --authenticate_http_readonly="true" --authenticate_http_readwrite="true"
--authenticatee="crammd5" --authentication_backoff_factor="1secs" --authorizer="local" --cgroups_cpu_enable_pids_and_tids_count="false"
--cgroups_enable_cfs="false" --cgroups_hierarchy="/sys/fs/cgroup" --cgroups_limit_swap="false"
--cgroups_root="mesos" --container_disk_watch_interval="15secs" --containerizers="mesos" --credential="/tmp/Endpoint_SlaveEndpointTest_UnauthorizedRequest_0_w1I5Je/credential"
--default_role="*" --disallow_sharing_agent_pid_namespace="false" --disk_watch_interval="1mins"
--docker="docker" --docker_kill_orphans="true" --docker_registry="https://registry-1.docker.io"
--docker_remove_delay="6hrs" --docker_socket="/var/run/docker.sock" --docker_stop_timeout="0ns"
--docker_store_dir="/tmp/Endpoint_SlaveEndpointTest_UnauthorizedRequest_0_w1I5Je/store/docker"
--docker_volume_checkpoint_dir="/var/run/mesos/isolators/docker/volume" --enforce_container_disk_quota="false"
--executor_registration_timeout="1mins" --executor_reregistration_timeout="2secs" --executor_secret_key="/tmp/Endpoint_SlaveEndpointTest_UnauthorizedRequest_0_w1I5Je/executor_secret_key"
--executor_shutdown_grace_period="5secs" --fetcher_cache_dir="/tmp/Endpoint_SlaveEndpointTest_UnauthorizedRequest_0_w1I5Je/fetch"
--fetcher_cache_size="2GB" --frameworks_home="" --gc_delay="1weeks" --gc_disk_headroom="0.1"
--hadoop_home="" --help="false" --hostname_lookup="true" --http_command_executor="false" --http_credentials="/tmp/Endpoint_SlaveEndpointTest_UnauthorizedRequest_0_w1I5Je/http_credentials"
--http_heartbeat_interval="30secs" --initialize_driver_logging="true" --isolation="posix/cpu,posix/mem"
--launcher="posix" --launcher_dir="/mesos/mesos-1.5.0/_build/src" --logbufsecs="0" --logging_level="INFO"
--max_completed_executors_per_framework="150" --oversubscribed_resources_interval="15secs"
--perf_duration="10secs" --perf_interval="1mins" --port="5051" --qos_correction_interval_min="0ns"
--quiet="false" --recover="reconnect" --recovery_timeout="15mins" --registration_backoff_factor="10ms"
--resources="cpus:2;gpus:0;mem:1024;disk:1024;ports:[31000-32000]" --revocable_cpu_low_priority="true"
--runtime_dir="/tmp/Endpoint_SlaveEndpointTest_UnauthorizedRequest_0_w1I5Je" --sandbox_directory="/mnt/mesos/sandbox"
--strict="true" --switch_user="true" --systemd_enable_support="true" --systemd_runtime_directory="/run/systemd/system"
--version="false" --work_dir="/tmp/Endpoint_SlaveEndpointTest_UnauthorizedRequest_0_Ue0krT"
--zk_session_timeout="10secs"
I0921 06:21:53.591918 27955 credentials.hpp:86] Loading credential for authentication from
'/tmp/Endpoint_SlaveEndpointTest_UnauthorizedRequest_0_w1I5Je/credential'
I0921 06:21:53.592144 27955 slave.cpp:285] Agent using credential for: test-principal
I0921 06:21:53.592170 27955 credentials.hpp:37] Loading credentials for authentication from
'/tmp/Endpoint_SlaveEndpointTest_UnauthorizedRequest_0_w1I5Je/http_credentials'
I0921 06:21:53.592494 27955 http.cpp:1045] Creating default 'basic' HTTP authenticator for
realm 'mesos-agent-executor'
I0921 06:21:53.592655 27955 http.cpp:1066] Creating default 'jwt' HTTP authenticator for realm
'mesos-agent-executor'
I0921 06:21:53.592900 27955 http.cpp:1045] Creating default 'basic' HTTP authenticator for
realm 'mesos-agent-readonly'
I0921 06:21:53.593009 27955 http.cpp:1066] Creating default 'jwt' HTTP authenticator for realm
'mesos-agent-readonly'
I0921 06:21:53.593204 27955 http.cpp:1045] Creating default 'basic' HTTP authenticator for
realm 'mesos-agent-readwrite'
I0921 06:21:53.593310 27955 http.cpp:1066] Creating default 'jwt' HTTP authenticator for realm
'mesos-agent-readwrite'
I0921 06:21:53.594974 27955 slave.cpp:583] Agent resources: [{"name":"cpus","scalar":{"value":2.0},"type":"SCALAR"},{"name":"mem","scalar":{"value":1024.0},"type":"SCALAR"},{"name":"disk","scalar":{"value":1024.0},"type":"SCALAR"},{"name":"ports","ranges":{"range":[{"begin":31000,"end":32000}]},"type":"RANGES"}]
I0921 06:21:53.595233 27955 slave.cpp:591] Agent attributes: [  ]
I0921 06:21:53.595250 27955 slave.cpp:600] Agent hostname: d3489d434990
I0921 06:21:53.595422 27936 status_update_manager.cpp:177] Pausing sending status updates
I0921 06:21:53.597280 27945 state.cpp:64] Recovering state from '/tmp/Endpoint_SlaveEndpointTest_UnauthorizedRequest_0_Ue0krT/meta'
I0921 06:21:53.597702 27957 status_update_manager.cpp:203] Recovering status update manager
I0921 06:21:53.597995 27937 containerizer.cpp:648] Recovering containerizer
I0921 06:21:53.599617 27948 provisioner.cpp:416] Provisioner recovery complete
I0921 06:21:53.600023 27939 slave.cpp:6320] Finished recovery
I0921 06:21:53.600677 27939 slave.cpp:6502] Querying resource estimator for oversubscribable
resources
I0921 06:21:53.600996 27957 slave.cpp:6516] Received oversubscribable resources {} from the
resource estimator
I0921 06:21:53.603814 27944 process.cpp:3929] Handling HTTP event for process 'slave(818)'
with path: '/slave(818)/monitor/statistics'
I0921 06:21:53.605789 27948 http.cpp:1185] HTTP GET for /slave(818)/monitor/statistics from
172.17.0.3:43572
I0921 06:21:53.605885 27948 http.cpp:976] Authorizing principal 'test-principal' to GET the
'/monitor/statistics' endpoint
I0921 06:21:53.608165 27936 slave.cpp:867] Agent terminating
[       OK ] Endpoint/SlaveEndpointTest.UnauthorizedRequest/0 (34 ms)
[ RUN      ] Endpoint/SlaveEndpointTest.UnauthorizedRequest/1
I0921 06:21:53.622912  6894 containerizer.cpp:292] Using isolation { environment_secret, posix/cpu,
posix/mem, filesystem/posix, network/cni }
W0921 06:21:53.623632  6894 backend.cpp:76] Failed to create 'aufs' backend: AufsBackend requires
root privileges
W0921 06:21:53.623781  6894 backend.cpp:76] Failed to create 'bind' backend: BindBackend requires
root privileges
I0921 06:21:53.623826  6894 provisioner.cpp:255] Using default backend 'copy'
I0921 06:21:53.628799 27944 slave.cpp:252] Mesos agent started on (819)@172.17.0.3:37845
I0921 06:21:53.628845 27944 slave.cpp:253] Flags at startup: --acls="" --appc_simple_discovery_uri_prefix="http://"
--appc_store_dir="/tmp/Endpoint_SlaveEndpointTest_UnauthorizedRequest_1_c7RGeC/store/appc"
--authenticate_http_executors="true" --authenticate_http_readonly="true" --authenticate_http_readwrite="true"
--authenticatee="crammd5" --authentication_backoff_factor="1secs" --authorizer="local" --cgroups_cpu_enable_pids_and_tids_count="false"
--cgroups_enable_cfs="false" --cgroups_hierarchy="/sys/fs/cgroup" --cgroups_limit_swap="false"
--cgroups_root="mesos" --container_disk_watch_interval="15secs" --containerizers="mesos" --credential="/tmp/Endpoint_SlaveEndpointTest_UnauthorizedRequest_1_c7RGeC/credential"
--default_role="*" --disallow_sharing_agent_pid_namespace="false" --disk_watch_interval="1mins"
--docker="docker" --docker_kill_orphans="true" --docker_registry="https://registry-1.docker.io"
--docker_remove_delay="6hrs" --docker_socket="/var/run/docker.sock" --docker_stop_timeout="0ns"
--docker_store_dir="/tmp/Endpoint_SlaveEndpointTest_UnauthorizedRequest_1_c7RGeC/store/docker"
--docker_volume_checkpoint_dir="/var/run/mesos/isolators/docker/volume" --enforce_container_disk_quota="false"
--executor_registration_timeout="1mins" --executor_reregistration_timeout="2secs" --executor_secret_key="/tmp/Endpoint_SlaveEndpointTest_UnauthorizedRequest_1_c7RGeC/executor_secret_key"
--executor_shutdown_grace_period="5secs" --fetcher_cache_dir="/tmp/Endpoint_SlaveEndpointTest_UnauthorizedRequest_1_c7RGeC/fetch"
--fetcher_cache_size="2GB" --frameworks_home="" --gc_delay="1weeks" --gc_disk_headroom="0.1"
--hadoop_home="" --help="false" --hostname_lookup="true" --http_command_executor="false" --http_credentials="/tmp/Endpoint_SlaveEndpointTest_UnauthorizedRequest_1_c7RGeC/http_credentials"
--http_heartbeat_interval="30secs" --initialize_driver_logging="true" --isolation="posix/cpu,posix/mem"
--launcher="posix" --launcher_dir="/mesos/mesos-1.5.0/_build/src" --logbufsecs="0" --logging_level="INFO"
--max_completed_executors_per_framework="150" --oversubscribed_resources_interval="15secs"
--perf_duration="10secs" --perf_interval="1mins" --port="5051" --qos_correction_interval_min="0ns"
--quiet="false" --recover="reconnect" --recovery_timeout="15mins" --registration_backoff_factor="10ms"
--resources="cpus:2;gpus:0;mem:1024;disk:1024;ports:[31000-32000]" --revocable_cpu_low_priority="true"
--runtime_dir="/tmp/Endpoint_SlaveEndpointTest_UnauthorizedRequest_1_c7RGeC" --sandbox_directory="/mnt/mesos/sandbox"
--strict="true" --switch_user="true" --systemd_enable_support="true" --systemd_runtime_directory="/run/systemd/system"
--version="false" --work_dir="/tmp/Endpoint_SlaveEndpointTest_UnauthorizedRequest_1_gHVIQg"
--zk_session_timeout="10secs"
I0921 06:21:53.629295 27944 credentials.hpp:86] Loading credential for authentication from
'/tmp/Endpoint_SlaveEndpointTest_UnauthorizedRequest_1_c7RGeC/credential'
I0921 06:21:53.629505 27944 slave.cpp:285] Agent using credential for: test-principal
I0921 06:21:53.629528 27944 credentials.hpp:37] Loading credentials for authentication from
'/tmp/Endpoint_SlaveEndpointTest_UnauthorizedRequest_1_c7RGeC/http_credentials'
I0921 06:21:53.629863 27944 http.cpp:1045] Creating default 'basic' HTTP authenticator for
realm 'mesos-agent-executor'
I0921 06:21:53.630051 27944 http.cpp:1066] Creating default 'jwt' HTTP authenticator for realm
'mesos-agent-executor'
I0921 06:21:53.630314 27944 http.cpp:1045] Creating default 'basic' HTTP authenticator for
realm 'mesos-agent-readonly'
I0921 06:21:53.630419 27944 http.cpp:1066] Creating default 'jwt' HTTP authenticator for realm
'mesos-agent-readonly'
I0921 06:21:53.630614 27944 http.cpp:1045] Creating default 'basic' HTTP authenticator for
realm 'mesos-agent-readwrite'
I0921 06:21:53.630714 27944 http.cpp:1066] Creating default 'jwt' HTTP authenticator for realm
'mesos-agent-readwrite'
I0921 06:21:53.632309 27944 slave.cpp:583] Agent resources: [{"name":"cpus","scalar":{"value":2.0},"type":"SCALAR"},{"name":"mem","scalar":{"value":1024.0},"type":"SCALAR"},{"name":"disk","scalar":{"value":1024.0},"type":"SCALAR"},{"name":"ports","ranges":{"range":[{"begin":31000,"end":32000}]},"type":"RANGES"}]
I0921 06:21:53.632553 27944 slave.cpp:591] Agent attributes: [  ]
I0921 06:21:53.632568 27944 slave.cpp:600] Agent hostname: d3489d434990
I0921 06:21:53.632767 27947 status_update_manager.cpp:177] Pausing sending status updates
I0921 06:21:53.634726 27935 state.cpp:64] Recovering state from '/tmp/Endpoint_SlaveEndpointTest_UnauthorizedRequest_1_gHVIQg/meta'
I0921 06:21:53.635077 27935 status_update_manager.cpp:203] Recovering status update manager
I0921 06:21:53.635270 27935 containerizer.cpp:648] Recovering containerizer
I0921 06:21:53.636729 27940 provisioner.cpp:416] Provisioner recovery complete
I0921 06:21:53.637117 27947 slave.cpp:6320] Finished recovery
I0921 06:21:53.637789 27947 slave.cpp:6502] Querying resource estimator for oversubscribable
resources
I0921 06:21:53.638165 27943 slave.cpp:6516] Received oversubscribable resources {} from the
resource estimator
I0921 06:21:53.641161 27955 process.cpp:3929] Handling HTTP event for process 'slave(819)'
with path: '/slave(819)/monitor/statistics.json'
I0921 06:21:53.643215 27940 http.cpp:1185] HTTP GET for /slave(819)/monitor/statistics.json
from 172.17.0.3:43574
I0921 06:21:53.643311 27940 http.cpp:976] Authorizing principal 'test-principal' to GET the
'/monitor/statistics.json' endpoint
I0921 06:21:53.645315 27955 slave.cpp:867] Agent terminating
[       OK ] Endpoint/SlaveEndpointTest.UnauthorizedRequest/1 (38 ms)
[ RUN      ] Endpoint/SlaveEndpointTest.UnauthorizedRequest/2
I0921 06:21:53.660092  6894 containerizer.cpp:292] Using isolation { environment_secret, posix/cpu,
posix/mem, filesystem/posix, network/cni }
W0921 06:21:53.660655  6894 backend.cpp:76] Failed to create 'aufs' backend: AufsBackend requires
root privileges
W0921 06:21:53.660796  6894 backend.cpp:76] Failed to create 'bind' backend: BindBackend requires
root privileges
I0921 06:21:53.660836  6894 provisioner.cpp:255] Using default backend 'copy'
I0921 06:21:53.664734 27935 slave.cpp:252] Mesos agent started on (820)@172.17.0.3:37845
I0921 06:21:53.664778 27935 slave.cpp:253] Flags at startup: --acls="" --appc_simple_discovery_uri_prefix="http://"
--appc_store_dir="/tmp/Endpoint_SlaveEndpointTest_UnauthorizedRequest_2_4ECN5Z/store/appc"
--authenticate_http_executors="true" --authenticate_http_readonly="true" --authenticate_http_readwrite="true"
--authenticatee="crammd5" --authentication_backoff_factor="1secs" --authorizer="local" --cgroups_cpu_enable_pids_and_tids_count="false"
--cgroups_enable_cfs="false" --cgroups_hierarchy="/sys/fs/cgroup" --cgroups_limit_swap="false"
--cgroups_root="mesos" --container_disk_watch_interval="15secs" --containerizers="mesos" --credential="/tmp/Endpoint_SlaveEndpointTest_UnauthorizedRequest_2_4ECN5Z/credential"
--default_role="*" --disallow_sharing_agent_pid_namespace="false" --disk_watch_interval="1mins"
--docker="docker" --docker_kill_orphans="true" --docker_registry="https://registry-1.docker.io"
--docker_remove_delay="6hrs" --docker_socket="/var/run/docker.sock" --docker_stop_timeout="0ns"
--docker_store_dir="/tmp/Endpoint_SlaveEndpointTest_UnauthorizedRequest_2_4ECN5Z/store/docker"
--docker_volume_checkpoint_dir="/var/run/mesos/isolators/docker/volume" --enforce_container_disk_quota="false"
--executor_registration_timeout="1mins" --executor_reregistration_timeout="2secs" --executor_secret_key="/tmp/Endpoint_SlaveEndpointTest_UnauthorizedRequest_2_4ECN5Z/executor_secret_key"
--executor_shutdown_grace_period="5secs" --fetcher_cache_dir="/tmp/Endpoint_SlaveEndpointTest_UnauthorizedRequest_2_4ECN5Z/fetch"
--fetcher_cache_size="2GB" --frameworks_home="" --gc_delay="1weeks" --gc_disk_headroom="0.1"
--hadoop_home="" --help="false" --hostname_lookup="true" --http_command_executor="false" --http_credentials="/tmp/Endpoint_SlaveEndpointTest_UnauthorizedRequest_2_4ECN5Z/http_credentials"
--http_heartbeat_interval="30secs" --initialize_driver_logging="true" --isolation="posix/cpu,posix/mem"
--launcher="posix" --launcher_dir="/mesos/mesos-1.5.0/_build/src" --logbufsecs="0" --logging_level="INFO"
--max_completed_executors_per_framework="150" --oversubscribed_resources_interval="15secs"
--perf_duration="10secs" --perf_interval="1mins" --port="5051" --qos_correction_interval_min="0ns"
--quiet="false" --recover="reconnect" --recovery_timeout="15mins" --registration_backoff_factor="10ms"
--resources="cpus:2;gpus:0;mem:1024;disk:1024;ports:[31000-32000]" --revocable_cpu_low_priority="true"
--runtime_dir="/tmp/Endpoint_SlaveEndpointTest_UnauthorizedRequest_2_4ECN5Z" --sandbox_directory="/mnt/mesos/sandbox"
--strict="true" --switch_user="true" --systemd_enable_support="true" --systemd_runtime_directory="/run/systemd/system"
--version="false" --work_dir="/tmp/Endpoint_SlaveEndpointTest_UnauthorizedRequest_2_YdjbCE"
--zk_session_timeout="10secs"
I0921 06:21:53.665230 27935 credentials.hpp:86] Loading credential for authentication from
'/tmp/Endpoint_SlaveEndpointTest_UnauthorizedRequest_2_4ECN5Z/credential'
I0921 06:21:53.665436 27935 slave.cpp:285] Agent using credential for: test-principal
I0921 06:21:53.665458 27935 credentials.hpp:37] Loading credentials for authentication from
'/tmp/Endpoint_SlaveEndpointTest_UnauthorizedRequest_2_4ECN5Z/http_credentials'
I0921 06:21:53.665783 27935 http.cpp:1045] Creating default 'basic' HTTP authenticator for
realm 'mesos-agent-executor'
I0921 06:21:53.665956 27935 http.cpp:1066] Creating default 'jwt' HTTP authenticator for realm
'mesos-agent-executor'
I0921 06:21:53.666200 27935 http.cpp:1045] Creating default 'basic' HTTP authenticator for
realm 'mesos-agent-readonly'
I0921 06:21:53.666298 27935 http.cpp:1066] Creating default 'jwt' HTTP authenticator for realm
'mesos-agent-readonly'
I0921 06:21:53.666473 27935 http.cpp:1045] Creating default 'basic' HTTP authenticator for
realm 'mesos-agent-readwrite'
I0921 06:21:53.666569 27935 http.cpp:1066] Creating default 'jwt' HTTP authenticator for realm
'mesos-agent-readwrite'
I0921 06:21:53.668129 27935 slave.cpp:583] Agent resources: [{"name":"cpus","scalar":{"value":2.0},"type":"SCALAR"},{"name":"mem","scalar":{"value":1024.0},"type":"SCALAR"},{"name":"disk","scalar":{"value":1024.0},"type":"SCALAR"},{"name":"ports","ranges":{"range":[{"begin":31000,"end":32000}]},"type":"RANGES"}]
I0921 06:21:53.668359 27935 slave.cpp:591] Agent attributes: [  ]
I0921 06:21:53.668375 27935 slave.cpp:600] Agent hostname: d3489d434990
I0921 06:21:53.668552 27951 status_update_manager.cpp:177] Pausing sending status updates
I0921 06:21:53.670409 27954 state.cpp:64] Recovering state from '/tmp/Endpoint_SlaveEndpointTest_UnauthorizedRequest_2_YdjbCE/meta'
I0921 06:21:53.670779 27945 status_update_manager.cpp:203] Recovering status update manager
I0921 06:21:53.671030 27952 containerizer.cpp:648] Recovering containerizer
I0921 06:21:53.672525 27944 provisioner.cpp:416] Provisioner recovery complete
I0921 06:21:53.672941 27944 slave.cpp:6320] Finished recovery
I0921 06:21:53.673496 27944 slave.cpp:6502] Querying resource estimator for oversubscribable
resources
I0921 06:21:53.673765 27941 slave.cpp:6516] Received oversubscribable resources {} from the
resource estimator
I0921 06:21:53.676393 27938 process.cpp:3929] Handling HTTP event for process 'slave(820)'
with path: '/slave(820)/containers'
I0921 06:21:53.678300 27942 http.cpp:1185] HTTP GET for /slave(820)/containers from 172.17.0.3:43576
I0921 06:21:53.678381 27942 http.cpp:976] Authorizing principal 'test-principal' to GET the
'/containers' endpoint
I0921 06:21:53.680588 27957 slave.cpp:867] Agent terminating
[       OK ] Endpoint/SlaveEndpointTest.UnauthorizedRequest/2 (31 ms)
[ RUN      ] Endpoint/SlaveEndpointTest.NoAuthorizer/0
I0921 06:21:53.691234  6894 containerizer.cpp:292] Using isolation { environment_secret, posix/cpu,
posix/mem, filesystem/posix, network/cni }
W0921 06:21:53.691702  6894 backend.cpp:76] Failed to create 'aufs' backend: AufsBackend requires
root privileges
W0921 06:21:53.691809  6894 backend.cpp:76] Failed to create 'bind' backend: BindBackend requires
root privileges
I0921 06:21:53.691841  6894 provisioner.cpp:255] Using default backend 'copy'
I0921 06:21:53.693392  6894 cluster.cpp:448] Creating default 'local' authorizer
I0921 06:21:53.695282 27940 slave.cpp:252] Mesos agent started on (821)@172.17.0.3:37845
I0921 06:21:53.695323 27940 slave.cpp:253] Flags at startup: --acls="" --appc_simple_discovery_uri_prefix="http://"
--appc_store_dir="/tmp/Endpoint_SlaveEndpointTest_NoAuthorizer_0_Id2kgo/store/appc" --authenticate_http_executors="true"
--authenticate_http_readonly="true" --authenticate_http_readwrite="true" --authenticatee="crammd5"
--authentication_backoff_factor="1secs" --authorizer="local" --cgroups_cpu_enable_pids_and_tids_count="false"
--cgroups_enable_cfs="false" --cgroups_hierarchy="/sys/fs/cgroup" --cgroups_limit_swap="false"
--cgroups_root="mesos" --container_disk_watch_interval="15secs" --containerizers="mesos" --credential="/tmp/Endpoint_SlaveEndpointTest_NoAuthorizer_0_Id2kgo/credential"
--default_role="*" --disallow_sharing_agent_pid_namespace="false" --disk_watch_interval="1mins"
--docker="docker" --docker_kill_orphans="true" --docker_registry="https://registry-1.docker.io"
--docker_remove_delay="6hrs" --docker_socket="/var/run/docker.sock" --docker_stop_timeout="0ns"
--docker_store_dir="/tmp/Endpoint_SlaveEndpointTest_NoAuthorizer_0_Id2kgo/store/docker" --docker_volume_checkpoint_dir="/var/run/mesos/isolators/docker/volume"
--enforce_container_disk_quota="false" --executor_registration_timeout="1mins" --executor_reregistration_timeout="2secs"
--executor_secret_key="/tmp/Endpoint_SlaveEndpointTest_NoAuthorizer_0_Id2kgo/executor_secret_key"
--executor_shutdown_grace_period="5secs" --fetcher_cache_dir="/tmp/Endpoint_SlaveEndpointTest_NoAuthorizer_0_Id2kgo/fetch"
--fetcher_cache_size="2GB" --frameworks_home="" --gc_delay="1weeks" --gc_disk_headroom="0.1"
--hadoop_home="" --help="false" --hostname_lookup="true" --http_command_executor="false" --http_credentials="/tmp/Endpoint_SlaveEndpointTest_NoAuthorizer_0_Id2kgo/http_credentials"
--http_heartbeat_interval="30secs" --initialize_driver_logging="true" --isolation="posix/cpu,posix/mem"
--launcher="posix" --launcher_dir="/mesos/mesos-1.5.0/_build/src" --logbufsecs="0" --logging_level="INFO"
--max_completed_executors_per_framework="150" --oversubscribed_resources_interval="15secs"
--perf_duration="10secs" --perf_interval="1mins" --port="5051" --qos_correction_interval_min="0ns"
--quiet="false" --recover="reconnect" --recovery_timeout="15mins" --registration_backoff_factor="10ms"
--resources="cpus:2;gpus:0;mem:1024;disk:1024;ports:[31000-32000]" --revocable_cpu_low_priority="true"
--runtime_dir="/tmp/Endpoint_SlaveEndpointTest_NoAuthorizer_0_Id2kgo" --sandbox_directory="/mnt/mesos/sandbox"
--strict="true" --switch_user="true" --systemd_enable_support="true" --systemd_runtime_directory="/run/systemd/system"
--version="false" --work_dir="/tmp/Endpoint_SlaveEndpointTest_NoAuthorizer_0_IH23H2" --zk_session_timeout="10secs"
I0921 06:21:53.695719 27940 credentials.hpp:86] Loading credential for authentication from
'/tmp/Endpoint_SlaveEndpointTest_NoAuthorizer_0_Id2kgo/credential'
I0921 06:21:53.695874 27940 slave.cpp:285] Agent using credential for: test-principal
I0921 06:21:53.695896 27940 credentials.hpp:37] Loading credentials for authentication from
'/tmp/Endpoint_SlaveEndpointTest_NoAuthorizer_0_Id2kgo/http_credentials'
I0921 06:21:53.696182 27940 http.cpp:1045] Creating default 'basic' HTTP authenticator for
realm 'mesos-agent-executor'
I0921 06:21:53.696323 27940 http.cpp:1066] Creating default 'jwt' HTTP authenticator for realm
'mesos-agent-executor'
I0921 06:21:53.696537 27940 http.cpp:1045] Creating default 'basic' HTTP authenticator for
realm 'mesos-agent-readonly'
I0921 06:21:53.696640 27940 http.cpp:1066] Creating default 'jwt' HTTP authenticator for realm
'mesos-agent-readonly'
I0921 06:21:53.696827 27940 http.cpp:1045] Creating default 'basic' HTTP authenticator for
realm 'mesos-agent-readwrite'
I0921 06:21:53.696926 27940 http.cpp:1066] Creating default 'jwt' HTTP authenticator for realm
'mesos-agent-readwrite'
I0921 06:21:53.698321 27940 slave.cpp:583] Agent resources: [{"name":"cpus","scalar":{"value":2.0},"type":"SCALAR"},{"name":"mem","scalar":{"value":1024.0},"type":"SCALAR"},{"name":"disk","scalar":{"value":1024.0},"type":"SCALAR"},{"name":"ports","ranges":{"range":[{"begin":31000,"end":32000}]},"type":"RANGES"}]
I0921 06:21:53.698539 27940 slave.cpp:591] Agent attributes: [  ]
I0921 06:21:53.698562 27940 slave.cpp:600] Agent hostname: d3489d434990
I0921 06:21:53.698719 27936 status_update_manager.cpp:177] Pausing sending status updates
I0921 06:21:53.700095 27948 state.cpp:64] Recovering state from '/tmp/Endpoint_SlaveEndpointTest_NoAuthorizer_0_IH23H2/meta'
I0921 06:21:53.700428 27957 status_update_manager.cpp:203] Recovering status update manager
I0921 06:21:53.700606 27947 containerizer.cpp:648] Recovering containerizer
I0921 06:21:53.701827 27941 provisioner.cpp:416] Provisioner recovery complete
I0921 06:21:53.702167 27952 slave.cpp:6320] Finished recovery
I0921 06:21:53.702600 27952 slave.cpp:6502] Querying resource estimator for oversubscribable
resources
I0921 06:21:53.702838 27957 slave.cpp:6516] Received oversubscribable resources {} from the
resource estimator
I0921 06:21:53.704543 27935 process.cpp:3929] Handling HTTP event for process 'slave(821)'
with path: '/slave(821)/monitor/statistics'
I0921 06:21:53.706107 27945 http.cpp:1185] HTTP GET for /slave(821)/monitor/statistics from
172.17.0.3:43578
I0921 06:21:53.706178 27945 http.cpp:976] Authorizing principal 'test-principal' to GET the
'/monitor/statistics' endpoint
I0921 06:21:53.709025  6894 slave.cpp:867] Agent terminating
[       OK ] Endpoint/SlaveEndpointTest.NoAuthorizer/0 (28 ms)
[ RUN      ] Endpoint/SlaveEndpointTest.NoAuthorizer/1
I0921 06:21:53.719588  6894 containerizer.cpp:292] Using isolation { environment_secret, posix/cpu,
posix/mem, filesystem/posix, network/cni }
W0921 06:21:53.720051  6894 backend.cpp:76] Failed to create 'aufs' backend: AufsBackend requires
root privileges
W0921 06:21:53.720157  6894 backend.cpp:76] Failed to create 'bind' backend: BindBackend requires
root privileges
I0921 06:21:53.720190  6894 provisioner.cpp:255] Using default backend 'copy'
I0921 06:21:53.721783  6894 cluster.cpp:448] Creating default 'local' authorizer
I0921 06:21:53.723582 27934 slave.cpp:252] Mesos agent started on (822)@172.17.0.3:37845
I0921 06:21:53.723629 27934 slave.cpp:253] Flags at startup: --acls="" --appc_simple_discovery_uri_prefix="http://"
--appc_store_dir="/tmp/Endpoint_SlaveEndpointTest_NoAuthorizer_1_qknTHM/store/appc" --authenticate_http_executors="true"
--authenticate_http_readonly="true" --authenticate_http_readwrite="true" --authenticatee="crammd5"
--authentication_backoff_factor="1secs" --authorizer="local" --cgroups_cpu_enable_pids_and_tids_count="false"
--cgroups_enable_cfs="false" --cgroups_hierarchy="/sys/fs/cgroup" --cgroups_limit_swap="false"
--cgroups_root="mesos" --container_disk_watch_interval="15secs" --containerizers="mesos" --credential="/tmp/Endpoint_SlaveEndpointTest_NoAuthorizer_1_qknTHM/credential"
--default_role="*" --disallow_sharing_agent_pid_namespace="false" --disk_watch_interval="1mins"
--docker="docker" --docker_kill_orphans="true" --docker_registry="https://registry-1.docker.io"
--docker_remove_delay="6hrs" --docker_socket="/var/run/docker.sock" --docker_stop_timeout="0ns"
--docker_store_dir="/tmp/Endpoint_SlaveEndpointTest_NoAuthorizer_1_qknTHM/store/docker" --docker_volume_checkpoint_dir="/var/run/mesos/isolators/docker/volume"
--enforce_container_disk_quota="false" --executor_registration_timeout="1mins" --executor_reregistration_timeout="2secs"
--executor_secret_key="/tmp/Endpoint_SlaveEndpointTest_NoAuthorizer_1_qknTHM/executor_secret_key"
--executor_shutdown_grace_period="5secs" --fetcher_cache_dir="/tmp/Endpoint_SlaveEndpointTest_NoAuthorizer_1_qknTHM/fetch"
--fetcher_cache_size="2GB" --frameworks_home="" --gc_delay="1weeks" --gc_disk_headroom="0.1"
--hadoop_home="" --help="false" --hostname_lookup="true" --http_command_executor="false" --http_credentials="/tmp/Endpoint_SlaveEndpointTest_NoAuthorizer_1_qknTHM/http_credentials"
--http_heartbeat_interval="30secs" --initialize_driver_logging="true" --isolation="posix/cpu,posix/mem"
--launcher="posix" --launcher_dir="/mesos/mesos-1.5.0/_build/src" --logbufsecs="0" --logging_level="INFO"
--max_completed_executors_per_framework="150" --oversubscribed_resources_interval="15secs"
--perf_duration="10secs" --perf_interval="1mins" --port="5051" --qos_correction_interval_min="0ns"
--quiet="false" --recover="reconnect" --recovery_timeout="15mins" --registration_backoff_factor="10ms"
--resources="cpus:2;gpus:0;mem:1024;disk:1024;ports:[31000-32000]" --revocable_cpu_low_priority="true"
--runtime_dir="/tmp/Endpoint_SlaveEndpointTest_NoAuthorizer_1_qknTHM" --sandbox_directory="/mnt/mesos/sandbox"
--strict="true" --switch_user="true" --systemd_enable_support="true" --systemd_runtime_directory="/run/systemd/system"
--version="false" --work_dir="/tmp/Endpoint_SlaveEndpointTest_NoAuthorizer_1_CXIo5q" --zk_session_timeout="10secs"
I0921 06:21:53.724035 27934 credentials.hpp:86] Loading credential for authentication from
'/tmp/Endpoint_SlaveEndpointTest_NoAuthorizer_1_qknTHM/credential'
I0921 06:21:53.724177 27934 slave.cpp:285] Agent using credential for: test-principal
I0921 06:21:53.724197 27934 credentials.hpp:37] Loading credentials for authentication from
'/tmp/Endpoint_SlaveEndpointTest_NoAuthorizer_1_qknTHM/http_credentials'
I0921 06:21:53.724467 27934 http.cpp:1045] Creating default 'basic' HTTP authenticator for
realm 'mesos-agent-executor'
I0921 06:21:53.724593 27934 http.cpp:1066] Creating default 'jwt' HTTP authenticator for realm
'mesos-agent-executor'
I0921 06:21:53.724789 27934 http.cpp:1045] Creating default 'basic' HTTP authenticator for
realm 'mesos-agent-readonly'
I0921 06:21:53.724884 27934 http.cpp:1066] Creating default 'jwt' HTTP authenticator for realm
'mesos-agent-readonly'
I0921 06:21:53.725054 27934 http.cpp:1045] Creating default 'basic' HTTP authenticator for
realm 'mesos-agent-readwrite'
I0921 06:21:53.725149 27934 http.cpp:1066] Creating default 'jwt' HTTP authenticator for realm
'mesos-agent-readwrite'
I0921 06:21:53.726557 27934 slave.cpp:583] Agent resources: [{"name":"cpus","scalar":{"value":2.0},"type":"SCALAR"},{"name":"mem","scalar":{"value":1024.0},"type":"SCALAR"},{"name":"disk","scalar":{"value":1024.0},"type":"SCALAR"},{"name":"ports","ranges":{"range":[{"begin":31000,"end":32000}]},"type":"RANGES"}]
I0921 06:21:53.726771 27934 slave.cpp:591] Agent attributes: [  ]
I0921 06:21:53.726788 27934 slave.cpp:600] Agent hostname: d3489d434990
I0921 06:21:53.726914 27955 status_update_manager.cpp:177] Pausing sending status updates
I0921 06:21:53.728269 27941 state.cpp:64] Recovering state from '/tmp/Endpoint_SlaveEndpointTest_NoAuthorizer_1_CXIo5q/meta'
I0921 06:21:53.728549 27952 status_update_manager.cpp:203] Recovering status update manager
I0921 06:21:53.728694 27957 containerizer.cpp:648] Recovering containerizer
I0921 06:21:53.729799 27951 provisioner.cpp:416] Provisioner recovery complete
I0921 06:21:53.730075 27955 slave.cpp:6320] Finished recovery
I0921 06:21:53.730499 27955 slave.cpp:6502] Querying resource estimator for oversubscribable
resources
I0921 06:21:53.730723 27946 slave.cpp:6516] Received oversubscribable resources {} from the
resource estimator
I0921 06:21:53.732445 27938 process.cpp:3929] Handling HTTP event for process 'slave(822)'
with path: '/slave(822)/monitor/statistics.json'
I0921 06:21:53.734158 27951 http.cpp:1185] HTTP GET for /slave(822)/monitor/statistics.json
from 172.17.0.3:43580
I0921 06:21:53.734227 27951 http.cpp:976] Authorizing principal 'test-principal' to GET the
'/monitor/statistics.json' endpoint
I0921 06:21:53.736574 27949 slave.cpp:867] Agent terminating
[       OK ] Endpoint/SlaveEndpointTest.NoAuthorizer/1 (27 ms)
[ RUN      ] Endpoint/SlaveEndpointTest.NoAuthorizer/2
I0921 06:21:53.746879  6894 containerizer.cpp:292] Using isolation { environment_secret, posix/cpu,
posix/mem, filesystem/posix, network/cni }
W0921 06:21:53.747354  6894 backend.cpp:76] Failed to create 'aufs' backend: AufsBackend requires
root privileges
W0921 06:21:53.747468  6894 backend.cpp:76] Failed to create 'bind' backend: BindBackend requires
root privileges
I0921 06:21:53.747500  6894 provisioner.cpp:255] Using default backend 'copy'
I0921 06:21:53.749058  6894 cluster.cpp:448] Creating default 'local' authorizer
I0921 06:21:53.750777 27951 slave.cpp:252] Mesos agent started on (823)@172.17.0.3:37845
I0921 06:21:53.750813 27951 slave.cpp:253] Flags at startup: --acls="" --appc_simple_discovery_uri_prefix="http://"
--appc_store_dir="/tmp/Endpoint_SlaveEndpointTest_NoAuthorizer_2_WTjNpb/store/appc" --authenticate_http_executors="true"
--authenticate_http_readonly="true" --authenticate_http_readwrite="true" --authenticatee="crammd5"
--authentication_backoff_factor="1secs" --authorizer="local" --cgroups_cpu_enable_pids_and_tids_count="false"
--cgroups_enable_cfs="false" --cgroups_hierarchy="/sys/fs/cgroup" --cgroups_limit_swap="false"
--cgroups_root="mesos" --container_disk_watch_interval="15secs" --containerizers="mesos" --credential="/tmp/Endpoint_SlaveEndpointTest_NoAuthorizer_2_WTjNpb/credential"
--default_role="*" --disallow_sharing_agent_pid_namespace="false" --disk_watch_interval="1mins"
--docker="docker" --docker_kill_orphans="true" --docker_registry="https://registry-1.docker.io"
--docker_remove_delay="6hrs" --docker_socket="/var/run/docker.sock" --docker_stop_timeout="0ns"
--docker_store_dir="/tmp/Endpoint_SlaveEndpointTest_NoAuthorizer_2_WTjNpb/store/docker" --docker_volume_checkpoint_dir="/var/run/mesos/isolators/docker/volume"
--enforce_container_disk_quota="false" --executor_registration_timeout="1mins" --executor_reregistration_timeout="2secs"
--executor_secret_key="/tmp/Endpoint_SlaveEndpointTest_NoAuthorizer_2_WTjNpb/executor_secret_key"
--executor_shutdown_grace_period="5secs" --fetcher_cache_dir="/tmp/Endpoint_SlaveEndpointTest_NoAuthorizer_2_WTjNpb/fetch"
--fetcher_cache_size="2GB" --frameworks_home="" --gc_delay="1weeks" --gc_disk_headroom="0.1"
--hadoop_home="" --help="false" --hostname_lookup="true" --http_command_executor="false" --http_credentials="/tmp/Endpoint_SlaveEndpointTest_NoAuthorizer_2_WTjNpb/http_credentials"
--http_heartbeat_interval="30secs" --initialize_driver_logging="true" --isolation="posix/cpu,posix/mem"
--launcher="posix" --launcher_dir="/mesos/mesos-1.5.0/_build/src" --logbufsecs="0" --logging_level="INFO"
--max_completed_executors_per_framework="150" --oversubscribed_resources_interval="15secs"
--perf_duration="10secs" --perf_interval="1mins" --port="5051" --qos_correction_interval_min="0ns"
--quiet="false" --recover="reconnect" --recovery_timeout="15mins" --registration_backoff_factor="10ms"
--resources="cpus:2;gpus:0;mem:1024;disk:1024;ports:[31000-32000]" --revocable_cpu_low_priority="true"
--runtime_dir="/tmp/Endpoint_SlaveEndpointTest_NoAuthorizer_2_WTjNpb" --sandbox_directory="/mnt/mesos/sandbox"
--strict="true" --switch_user="true" --systemd_enable_support="true" --systemd_runtime_directory="/run/systemd/system"
--version="false" --work_dir="/tmp/Endpoint_SlaveEndpointTest_NoAuthorizer_2_ADHeJP" --zk_session_timeout="10secs"
I0921 06:21:53.751179 27951 credentials.hpp:86] Loading credential for authentication from
'/tmp/Endpoint_SlaveEndpointTest_NoAuthorizer_2_WTjNpb/credential'
I0921 06:21:53.751343 27951 slave.cpp:285] Agent using credential for: test-principal
I0921 06:21:53.751364 27951 credentials.hpp:37] Loading credentials for authentication from
'/tmp/Endpoint_SlaveEndpointTest_NoAuthorizer_2_WTjNpb/http_credentials'
I0921 06:21:53.751643 27951 http.cpp:1045] Creating default 'basic' HTTP authenticator for
realm 'mesos-agent-executor'
I0921 06:21:53.751761 27951 http.cpp:1066] Creating default 'jwt' HTTP authenticator for realm
'mesos-agent-executor'
I0921 06:21:53.751976 27951 http.cpp:1045] Creating default 'basic' HTTP authenticator for
realm 'mesos-agent-readonly'
I0921 06:21:53.752077 27951 http.cpp:1066] Creating default 'jwt' HTTP authenticator for realm
'mesos-agent-readonly'
I0921 06:21:53.752257 27951 http.cpp:1045] Creating default 'basic' HTTP authenticator for
realm 'mesos-agent-readwrite'
I0921 06:21:53.752355 27951 http.cpp:1066] Creating default 'jwt' HTTP authenticator for realm
'mesos-agent-readwrite'
I0921 06:21:53.753700 27951 slave.cpp:583] Agent resources: [{"name":"cpus","scalar":{"value":2.0},"type":"SCALAR"},{"name":"mem","scalar":{"value":1024.0},"type":"SCALAR"},{"name":"disk","scalar":{"value":1024.0},"type":"SCALAR"},{"name":"ports","ranges":{"range":[{"begin":31000,"end":32000}]},"type":"RANGES"}]
I0921 06:21:53.753933 27951 slave.cpp:591] Agent attributes: [  ]
I0921 06:21:53.753958 27951 slave.cpp:600] Agent hostname: d3489d434990
I0921 06:21:53.754101 27953 status_update_manager.cpp:177] Pausing sending status updates
I0921 06:21:53.755573 27949 state.cpp:64] Recovering state from '/tmp/Endpoint_SlaveEndpointTest_NoAuthorizer_2_ADHeJP/meta'
I0921 06:21:53.755807 27946 status_update_manager.cpp:203] Recovering status update manager
I0921 06:21:53.755986 27945 containerizer.cpp:648] Recovering containerizer
I0921 06:21:53.757091 27948 provisioner.cpp:416] Provisioner recovery complete
I0921 06:21:53.757355 27953 slave.cpp:6320] Finished recovery
I0921 06:21:53.757791 27953 slave.cpp:6502] Querying resource estimator for oversubscribable
resources
I0921 06:21:53.757992 27947 slave.cpp:6516] Received oversubscribable resources {} from the
resource estimator
I0921 06:21:53.759765 27954 process.cpp:3929] Handling HTTP event for process 'slave(823)'
with path: '/slave(823)/containers'
I0921 06:21:53.761255 27948 http.cpp:1185] HTTP GET for /slave(823)/containers from 172.17.0.3:43582
I0921 06:21:53.761322 27948 http.cpp:976] Authorizing principal 'test-principal' to GET the
'/containers' endpoint
I0921 06:21:53.764447  6894 slave.cpp:867] Agent terminating
[       OK ] Endpoint/SlaveEndpointTest.NoAuthorizer/2 (27 ms)
[----------] 9 tests from Endpoint/SlaveEndpointTest (281 ms total)

[----------] 2 tests from ContainerizerType/DefaultContainerDNSFlagTest
[ RUN      ] ContainerizerType/DefaultContainerDNSFlagTest.ValidateFlag/0
[       OK ] ContainerizerType/DefaultContainerDNSFlagTest.ValidateFlag/0 (16 ms)
[ RUN      ] ContainerizerType/DefaultContainerDNSFlagTest.ValidateFlag/1
[       OK ] ContainerizerType/DefaultContainerDNSFlagTest.ValidateFlag/1 (14 ms)
[----------] 2 tests from ContainerizerType/DefaultContainerDNSFlagTest (30 ms total)

[----------] Global test environment tear-down
[==========] 1676 tests from 185 test cases ran. (610508 ms total)
[  PASSED  ] 1674 tests.
[  FAILED  ] 2 tests, listed below:
[  FAILED  ] ExamplesTest.DynamicReservationFramework
[  FAILED  ] ExamplesTest.PythonFramework

 2 FAILED TESTS
  YOU HAVE 20 DISABLED TESTS

I0921 06:21:53.871603 27958 process.cpp:1068] Failed to accept socket: future discarded
make[4]: *** [check-local] Error 1
make[4]: Leaving directory `/mesos/mesos-1.5.0/_build/src'
make[3]: *** [check-am] Error 2
make[3]: Leaving directory `/mesos/mesos-1.5.0/_build/src'
make[2]: *** [check] Error 2
make[2]: Leaving directory `/mesos/mesos-1.5.0/_build/src'
make[1]: *** [check-recursive] Error 1
make[1]: Leaving directory `/mesos/mesos-1.5.0/_build'
make: *** [distcheck] Error 1
+ docker rmi mesos-1505971518-16838
Untagged: mesos-1505971518-16838:latest
Deleted: sha256:1a0c3b7290efed8ecb350d5774fec458ad13add0dd00e45d91d6d96a71e9c609
Deleted: sha256:7a3ce2e08d6d8b499d41befb40fe628b93c5a32c65c7c023b9e8428bf3cb8723
Deleted: sha256:69bbeb545ca32bbe65a23f5333e874db02fc7cebe5ae0712d3a16ea200c3c913
Deleted: sha256:cb81c46ca717ba9a1e2b2f48d2c56c9a4638be792b4b62fa59c781a54b27a636
Deleted: sha256:2b0e4182880dac938e816147bd83c8bbee2f12f8dab99cfea747c332742d141b
Deleted: sha256:106bf3ccff9d11c8a54e1db10fe185c6004e60229cc7590fabeca90a60c3a286
Deleted: sha256:e07f6ede1f340c930fde6285c4ad40d604dcdc9bea2c537e2c495ec1f175522d
Deleted: sha256:b2c510b65107f32a986e481eacdbb292c1fe0f67cc9ee0344883142652c0e061
Deleted: sha256:816bdfd18bd358396e3c6f14ca258d72c90f3d1b06a5cccca8733350f658d8b5
Deleted: sha256:e36e83f580bc244466e0e63122b3f2a4537b0f62f2e32e9c4923ff787cc994ed
Deleted: sha256:1ae02a0aba16e356ade6cda40b4bc5125054c67cdddfb1a0fb7ac1f5140b5595
Deleted: sha256:951d512eb7ec3e073a4f755a247f3105495390060ef6d8ce8a0fe8dc2382aab1
Deleted: sha256:0c89e7d557ecb5037a7d34e0ec76bb59537bcfcc573d2b8a6c7eee25dfb7b9b9
Deleted: sha256:a3d3f8074a9c1535e7e57c6c2a7533b8d55e891121eaff52f1a90a4d8c75c867
Deleted: sha256:271c035aef996ba1f83d3c6cfffb7466df1ac1203bbf4a6b244478b529a0bc04
Deleted: sha256:1cf964a08f01938d2c566d3b55602ce1517ef37cc2f1b2f364abcb20aa20d23b
Deleted: sha256:1e4833638ffc38bbee67f68cb69749e3d9c6affa7b88c9467e7ddb03f53963be
Deleted: sha256:fe8ac43a8636bd2b6601b3cf768e5c3e4b3dd3caeb3b0dd04744807d4c9d2422
Deleted: sha256:b479c17cb871ca912ab8aa09f61501f6492f50e0d2fd5ac12db889ce42bc2e15
Deleted: sha256:ec280ce072cef5f7c6fcef1bf4953359bcc0ad9c409f7ff6811dd08ad3d8828d
Deleted: sha256:5210af8fcf12c6514e544c892f3ef74d0757a7cb737d1fa28c5958306dcc6e25
Deleted: sha256:afff85c2263bd63f681b89f91528182b9c1cc1fc80b198564888d2426e3ce741
Deleted: sha256:f62b1761216c73bdfad923cc84a70698b92825fa49cac331cd7612af4ba78a7e
Deleted: sha256:099a9cb335782fce2d39c3e424fcd1c5264994328a78b247b3b87c51006eaf95
Deleted: sha256:615cf222e285507f7971ae764cacb6f33bb33b295f3421a8878ddf67f5079e75
Deleted: sha256:7d41e5cbc49d6db89e76cb466fc8c356363a5cbe1ebc2e689d4d28570e669e0e
Deleted: sha256:dc2871db0dbe8f9a9ec33136f1cc8d35455ef546186955de03ee7c445d5f4f4a
Deleted: sha256:e337fdf1384e912b5117db15ce665e3bd37033a780fa08dd1ea1abeebab06e34
Build step 'Execute shell' marked build as failure

Mime
View raw message