mesos-builds mailing list archives

Site index · List index
Message view « Date » · « Thread »
Top « Date » · « Thread »
From Apache Jenkins Server <jenk...@builds.apache.org>
Subject Build failed in Jenkins: Mesos-Buildbot » autotools,gcc,--verbose --enable-libevent --enable-ssl,GLOG_v=1 MESOS_VERBOSE=1,ubuntu:14.04,(ubuntu)&&(!ubuntu-us1)&&(!ubuntu-eu2)&&(!qnode3)&&(!H23) #4274
Date Fri, 29 Sep 2017 20:23:11 GMT
See <https://builds.apache.org/job/Mesos-Buildbot/BUILDTOOL=autotools,COMPILER=gcc,CONFIGURATION=--verbose%20--enable-libevent%20--enable-ssl,ENVIRONMENT=GLOG_v=1%20MESOS_VERBOSE=1,OS=ubuntu%3A14.04,label_exp=(ubuntu)&&(!ubuntu-us1)&&(!ubuntu-eu2)&&(!qnode3)&&(!H23)/4274/display/redirect?page=changes>

Changes:

[vinodkone] Added a test using a file URI and the DefaultExecutor.

[vinodkone] Added a test using Docker, a file URI, and the DefaultExecutor.

------------------------------------------
[...truncated 33.24 MB...]
I0929 20:22:49.048537 30321 http.cpp:1045] Creating default 'basic' HTTP authenticator for
realm 'mesos-agent-executor'
I0929 20:22:49.048712 30321 http.cpp:1066] Creating default 'jwt' HTTP authenticator for realm
'mesos-agent-executor'
I0929 20:22:49.049017 30321 http.cpp:1045] Creating default 'basic' HTTP authenticator for
realm 'mesos-agent-readonly'
I0929 20:22:49.049157 30321 http.cpp:1066] Creating default 'jwt' HTTP authenticator for realm
'mesos-agent-readonly'
I0929 20:22:49.049401 30321 http.cpp:1045] Creating default 'basic' HTTP authenticator for
realm 'mesos-agent-readwrite'
I0929 20:22:49.049512 30321 http.cpp:1066] Creating default 'jwt' HTTP authenticator for realm
'mesos-agent-readwrite'
I0929 20:22:49.050981 30321 slave.cpp:585] Agent resources: [{"name":"cpus","scalar":{"value":2.0},"type":"SCALAR"},{"name":"mem","scalar":{"value":1024.0},"type":"SCALAR"},{"name":"disk","scalar":{"value":1024.0},"type":"SCALAR"},{"name":"ports","ranges":{"range":[{"begin":31000,"end":32000}]},"type":"RANGES"}]
I0929 20:22:49.051234 30321 slave.cpp:593] Agent attributes: [  ]
I0929 20:22:49.051261 30321 slave.cpp:602] Agent hostname: 2cc0175fb182
I0929 20:22:49.051420 30301 status_update_manager.cpp:177] Pausing sending status updates
I0929 20:22:49.053046 30314 state.cpp:64] Recovering state from '/tmp/Endpoint_SlaveEndpointTest_UnauthorizedRequest_0_tKa0ud/meta'
I0929 20:22:49.053320 30314 status_update_manager.cpp:203] Recovering status update manager
I0929 20:22:49.053545 30302 containerizer.cpp:648] Recovering containerizer
I0929 20:22:49.054797 30308 provisioner.cpp:416] Provisioner recovery complete
I0929 20:22:49.055106 30301 slave.cpp:6322] Finished recovery
I0929 20:22:49.055585 30301 slave.cpp:6504] Querying resource estimator for oversubscribable
resources
I0929 20:22:49.055815 30314 slave.cpp:6518] Received oversubscribable resources {} from the
resource estimator
I0929 20:22:49.057960 30307 process.cpp:3929] Handling HTTP event for process 'slave(819)'
with path: '/slave(819)/monitor/statistics'
I0929 20:22:49.059705 30308 http.cpp:1185] HTTP GET for /slave(819)/monitor/statistics from
172.17.0.2:60468
I0929 20:22:49.059782 30308 http.cpp:976] Authorizing principal 'test-principal' to GET the
'/monitor/statistics' endpoint
I0929 20:22:49.061220 30319 slave.cpp:869] Agent terminating
[       OK ] Endpoint/SlaveEndpointTest.UnauthorizedRequest/0 (30 ms)
[ RUN      ] Endpoint/SlaveEndpointTest.UnauthorizedRequest/1
I0929 20:22:49.072382  8668 containerizer.cpp:292] Using isolation { environment_secret, posix/cpu,
posix/mem, filesystem/posix, network/cni }
W0929 20:22:49.072852  8668 backend.cpp:76] Failed to create 'aufs' backend: AufsBackend requires
root privileges
W0929 20:22:49.072962  8668 backend.cpp:76] Failed to create 'bind' backend: BindBackend requires
root privileges
I0929 20:22:49.072991  8668 provisioner.cpp:255] Using default backend 'copy'
I0929 20:22:49.076169 30320 slave.cpp:254] Mesos agent started on (820)@172.17.0.2:40988
I0929 20:22:49.076190 30320 slave.cpp:255] Flags at startup: --acls="" --appc_simple_discovery_uri_prefix="http://"
--appc_store_dir="/tmp/Endpoint_SlaveEndpointTest_UnauthorizedRequest_1_hXHKBs/store/appc"
--authenticate_http_executors="true" --authenticate_http_readonly="true" --authenticate_http_readwrite="true"
--authenticatee="crammd5" --authentication_backoff_factor="1secs" --authorizer="local" --cgroups_cpu_enable_pids_and_tids_count="false"
--cgroups_enable_cfs="false" --cgroups_hierarchy="/sys/fs/cgroup" --cgroups_limit_swap="false"
--cgroups_root="mesos" --container_disk_watch_interval="15secs" --containerizers="mesos" --credential="/tmp/Endpoint_SlaveEndpointTest_UnauthorizedRequest_1_hXHKBs/credential"
--default_role="*" --disallow_sharing_agent_pid_namespace="false" --disk_watch_interval="1mins"
--docker="docker" --docker_kill_orphans="true" --docker_registry="https://registry-1.docker.io"
--docker_remove_delay="6hrs" --docker_socket="/var/run/docker.sock" --docker_stop_timeout="0ns"
--docker_store_dir="/tmp/Endpoint_SlaveEndpointTest_UnauthorizedRequest_1_hXHKBs/store/docker"
--docker_volume_checkpoint_dir="/var/run/mesos/isolators/docker/volume" --enforce_container_disk_quota="false"
--executor_registration_timeout="1mins" --executor_reregistration_timeout="2secs" --executor_secret_key="/tmp/Endpoint_SlaveEndpointTest_UnauthorizedRequest_1_hXHKBs/executor_secret_key"
--executor_shutdown_grace_period="5secs" --fetcher_cache_dir="/tmp/Endpoint_SlaveEndpointTest_UnauthorizedRequest_1_hXHKBs/fetch"
--fetcher_cache_size="2GB" --frameworks_home="" --gc_delay="1weeks" --gc_disk_headroom="0.1"
--hadoop_home="" --help="false" --hostname_lookup="true" --http_command_executor="false" --http_credentials="/tmp/Endpoint_SlaveEndpointTest_UnauthorizedRequest_1_hXHKBs/http_credentials"
--http_heartbeat_interval="30secs" --initialize_driver_logging="true" --isolation="posix/cpu,posix/mem"
--launcher="posix" --launcher_dir="/mesos/mesos-1.5.0/_build/src" --logbufsecs="0" --logging_level="INFO"
--max_completed_executors_per_framework="150" --oversubscribed_resources_interval="15secs"
--perf_duration="10secs" --perf_interval="1mins" --port="5051" --qos_correction_interval_min="0ns"
--quiet="false" --recover="reconnect" --recovery_timeout="15mins" --registration_backoff_factor="10ms"
--resources="cpus:2;gpus:0;mem:1024;disk:1024;ports:[31000-32000]" --revocable_cpu_low_priority="true"
--runtime_dir="/tmp/Endpoint_SlaveEndpointTest_UnauthorizedRequest_1_hXHKBs" --sandbox_directory="/mnt/mesos/sandbox"
--strict="true" --switch_user="true" --systemd_enable_support="true" --systemd_runtime_directory="/run/systemd/system"
--version="false" --work_dir="/tmp/Endpoint_SlaveEndpointTest_UnauthorizedRequest_1_QmlBmO"
--zk_session_timeout="10secs"
I0929 20:22:49.076565 30320 credentials.hpp:86] Loading credential for authentication from
'/tmp/Endpoint_SlaveEndpointTest_UnauthorizedRequest_1_hXHKBs/credential'
I0929 20:22:49.076710 30320 slave.cpp:287] Agent using credential for: test-principal
I0929 20:22:49.076731 30320 credentials.hpp:37] Loading credentials for authentication from
'/tmp/Endpoint_SlaveEndpointTest_UnauthorizedRequest_1_hXHKBs/http_credentials'
I0929 20:22:49.076985 30320 http.cpp:1045] Creating default 'basic' HTTP authenticator for
realm 'mesos-agent-executor'
I0929 20:22:49.077107 30320 http.cpp:1066] Creating default 'jwt' HTTP authenticator for realm
'mesos-agent-executor'
I0929 20:22:49.077317 30320 http.cpp:1045] Creating default 'basic' HTTP authenticator for
realm 'mesos-agent-readonly'
I0929 20:22:49.077414 30320 http.cpp:1066] Creating default 'jwt' HTTP authenticator for realm
'mesos-agent-readonly'
I0929 20:22:49.077579 30320 http.cpp:1045] Creating default 'basic' HTTP authenticator for
realm 'mesos-agent-readwrite'
I0929 20:22:49.077667 30320 http.cpp:1066] Creating default 'jwt' HTTP authenticator for realm
'mesos-agent-readwrite'
I0929 20:22:49.078930 30320 slave.cpp:585] Agent resources: [{"name":"cpus","scalar":{"value":2.0},"type":"SCALAR"},{"name":"mem","scalar":{"value":1024.0},"type":"SCALAR"},{"name":"disk","scalar":{"value":1024.0},"type":"SCALAR"},{"name":"ports","ranges":{"range":[{"begin":31000,"end":32000}]},"type":"RANGES"}]
I0929 20:22:49.079146 30320 slave.cpp:593] Agent attributes: [  ]
I0929 20:22:49.079164 30320 slave.cpp:602] Agent hostname: 2cc0175fb182
I0929 20:22:49.079283 30317 status_update_manager.cpp:177] Pausing sending status updates
I0929 20:22:49.080626 30319 state.cpp:64] Recovering state from '/tmp/Endpoint_SlaveEndpointTest_UnauthorizedRequest_1_QmlBmO/meta'
I0929 20:22:49.080973 30319 status_update_manager.cpp:203] Recovering status update manager
I0929 20:22:49.081193 30316 containerizer.cpp:648] Recovering containerizer
I0929 20:22:49.082495 30304 provisioner.cpp:416] Provisioner recovery complete
I0929 20:22:49.082768 30318 slave.cpp:6322] Finished recovery
I0929 20:22:49.083197 30318 slave.cpp:6504] Querying resource estimator for oversubscribable
resources
I0929 20:22:49.083541 30322 slave.cpp:6518] Received oversubscribable resources {} from the
resource estimator
I0929 20:22:49.085898 30309 process.cpp:3929] Handling HTTP event for process 'slave(820)'
with path: '/slave(820)/monitor/statistics.json'
I0929 20:22:49.087584 30314 http.cpp:1185] HTTP GET for /slave(820)/monitor/statistics.json
from 172.17.0.2:60474
I0929 20:22:49.087643 30314 http.cpp:976] Authorizing principal 'test-principal' to GET the
'/monitor/statistics.json' endpoint
I0929 20:22:49.089615  8668 slave.cpp:869] Agent terminating
[       OK ] Endpoint/SlaveEndpointTest.UnauthorizedRequest/1 (28 ms)
[ RUN      ] Endpoint/SlaveEndpointTest.UnauthorizedRequest/2
I0929 20:22:49.100527  8668 containerizer.cpp:292] Using isolation { environment_secret, posix/cpu,
posix/mem, filesystem/posix, network/cni }
W0929 20:22:49.101037  8668 backend.cpp:76] Failed to create 'aufs' backend: AufsBackend requires
root privileges
W0929 20:22:49.101191  8668 backend.cpp:76] Failed to create 'bind' backend: BindBackend requires
root privileges
I0929 20:22:49.101222  8668 provisioner.cpp:255] Using default backend 'copy'
I0929 20:22:49.104648 30305 slave.cpp:254] Mesos agent started on (821)@172.17.0.2:40988
I0929 20:22:49.104667 30305 slave.cpp:255] Flags at startup: --acls="" --appc_simple_discovery_uri_prefix="http://"
--appc_store_dir="/tmp/Endpoint_SlaveEndpointTest_UnauthorizedRequest_2_3gmuO3/store/appc"
--authenticate_http_executors="true" --authenticate_http_readonly="true" --authenticate_http_readwrite="true"
--authenticatee="crammd5" --authentication_backoff_factor="1secs" --authorizer="local" --cgroups_cpu_enable_pids_and_tids_count="false"
--cgroups_enable_cfs="false" --cgroups_hierarchy="/sys/fs/cgroup" --cgroups_limit_swap="false"
--cgroups_root="mesos" --container_disk_watch_interval="15secs" --containerizers="mesos" --credential="/tmp/Endpoint_SlaveEndpointTest_UnauthorizedRequest_2_3gmuO3/credential"
--default_role="*" --disallow_sharing_agent_pid_namespace="false" --disk_watch_interval="1mins"
--docker="docker" --docker_kill_orphans="true" --docker_registry="https://registry-1.docker.io"
--docker_remove_delay="6hrs" --docker_socket="/var/run/docker.sock" --docker_stop_timeout="0ns"
--docker_store_dir="/tmp/Endpoint_SlaveEndpointTest_UnauthorizedRequest_2_3gmuO3/store/docker"
--docker_volume_checkpoint_dir="/var/run/mesos/isolators/docker/volume" --enforce_container_disk_quota="false"
--executor_registration_timeout="1mins" --executor_reregistration_timeout="2secs" --executor_secret_key="/tmp/Endpoint_SlaveEndpointTest_UnauthorizedRequest_2_3gmuO3/executor_secret_key"
--executor_shutdown_grace_period="5secs" --fetcher_cache_dir="/tmp/Endpoint_SlaveEndpointTest_UnauthorizedRequest_2_3gmuO3/fetch"
--fetcher_cache_size="2GB" --frameworks_home="" --gc_delay="1weeks" --gc_disk_headroom="0.1"
--hadoop_home="" --help="false" --hostname_lookup="true" --http_command_executor="false" --http_credentials="/tmp/Endpoint_SlaveEndpointTest_UnauthorizedRequest_2_3gmuO3/http_credentials"
--http_heartbeat_interval="30secs" --initialize_driver_logging="true" --isolation="posix/cpu,posix/mem"
--launcher="posix" --launcher_dir="/mesos/mesos-1.5.0/_build/src" --logbufsecs="0" --logging_level="INFO"
--max_completed_executors_per_framework="150" --oversubscribed_resources_interval="15secs"
--perf_duration="10secs" --perf_interval="1mins" --port="5051" --qos_correction_interval_min="0ns"
--quiet="false" --recover="reconnect" --recovery_timeout="15mins" --registration_backoff_factor="10ms"
--resources="cpus:2;gpus:0;mem:1024;disk:1024;ports:[31000-32000]" --revocable_cpu_low_priority="true"
--runtime_dir="/tmp/Endpoint_SlaveEndpointTest_UnauthorizedRequest_2_3gmuO3" --sandbox_directory="/mnt/mesos/sandbox"
--strict="true" --switch_user="true" --systemd_enable_support="true" --systemd_runtime_directory="/run/systemd/system"
--version="false" --work_dir="/tmp/Endpoint_SlaveEndpointTest_UnauthorizedRequest_2_sY99up"
--zk_session_timeout="10secs"
I0929 20:22:49.105082 30305 credentials.hpp:86] Loading credential for authentication from
'/tmp/Endpoint_SlaveEndpointTest_UnauthorizedRequest_2_3gmuO3/credential'
I0929 20:22:49.105286 30305 slave.cpp:287] Agent using credential for: test-principal
I0929 20:22:49.105309 30305 credentials.hpp:37] Loading credentials for authentication from
'/tmp/Endpoint_SlaveEndpointTest_UnauthorizedRequest_2_3gmuO3/http_credentials'
I0929 20:22:49.105603 30305 http.cpp:1045] Creating default 'basic' HTTP authenticator for
realm 'mesos-agent-executor'
I0929 20:22:49.105733 30305 http.cpp:1066] Creating default 'jwt' HTTP authenticator for realm
'mesos-agent-executor'
I0929 20:22:49.105953 30305 http.cpp:1045] Creating default 'basic' HTTP authenticator for
realm 'mesos-agent-readonly'
I0929 20:22:49.106077 30305 http.cpp:1066] Creating default 'jwt' HTTP authenticator for realm
'mesos-agent-readonly'
I0929 20:22:49.106293 30305 http.cpp:1045] Creating default 'basic' HTTP authenticator for
realm 'mesos-agent-readwrite'
I0929 20:22:49.106395 30305 http.cpp:1066] Creating default 'jwt' HTTP authenticator for realm
'mesos-agent-readwrite'
I0929 20:22:49.107664 30305 slave.cpp:585] Agent resources: [{"name":"cpus","scalar":{"value":2.0},"type":"SCALAR"},{"name":"mem","scalar":{"value":1024.0},"type":"SCALAR"},{"name":"disk","scalar":{"value":1024.0},"type":"SCALAR"},{"name":"ports","ranges":{"range":[{"begin":31000,"end":32000}]},"type":"RANGES"}]
I0929 20:22:49.107868 30305 slave.cpp:593] Agent attributes: [  ]
I0929 20:22:49.107882 30305 slave.cpp:602] Agent hostname: 2cc0175fb182
I0929 20:22:49.108033 30315 status_update_manager.cpp:177] Pausing sending status updates
I0929 20:22:49.109207 30321 state.cpp:64] Recovering state from '/tmp/Endpoint_SlaveEndpointTest_UnauthorizedRequest_2_sY99up/meta'
I0929 20:22:49.109444 30311 status_update_manager.cpp:203] Recovering status update manager
I0929 20:22:49.109679 30314 containerizer.cpp:648] Recovering containerizer
I0929 20:22:49.110779 30313 provisioner.cpp:416] Provisioner recovery complete
I0929 20:22:49.111069 30324 slave.cpp:6322] Finished recovery
I0929 20:22:49.111541 30324 slave.cpp:6504] Querying resource estimator for oversubscribable
resources
I0929 20:22:49.111737 30308 slave.cpp:6518] Received oversubscribable resources {} from the
resource estimator
I0929 20:22:49.113464 30322 process.cpp:3929] Handling HTTP event for process 'slave(821)'
with path: '/slave(821)/containers'
I0929 20:22:49.114900 30313 http.cpp:1185] HTTP GET for /slave(821)/containers from 172.17.0.2:60480
I0929 20:22:49.114967 30313 http.cpp:976] Authorizing principal 'test-principal' to GET the
'/containers' endpoint
I0929 20:22:49.116672 30322 slave.cpp:869] Agent terminating
[       OK ] Endpoint/SlaveEndpointTest.UnauthorizedRequest/2 (27 ms)
[ RUN      ] Endpoint/SlaveEndpointTest.NoAuthorizer/0
I0929 20:22:49.127807  8668 containerizer.cpp:292] Using isolation { environment_secret, posix/cpu,
posix/mem, filesystem/posix, network/cni }
W0929 20:22:49.128286  8668 backend.cpp:76] Failed to create 'aufs' backend: AufsBackend requires
root privileges
W0929 20:22:49.128401  8668 backend.cpp:76] Failed to create 'bind' backend: BindBackend requires
root privileges
I0929 20:22:49.128432  8668 provisioner.cpp:255] Using default backend 'copy'
I0929 20:22:49.130055  8668 cluster.cpp:448] Creating default 'local' authorizer
I0929 20:22:49.132117 30309 slave.cpp:254] Mesos agent started on (822)@172.17.0.2:40988
I0929 20:22:49.132138 30309 slave.cpp:255] Flags at startup: --acls="" --appc_simple_discovery_uri_prefix="http://"
--appc_store_dir="/tmp/Endpoint_SlaveEndpointTest_NoAuthorizer_0_92HzhF/store/appc" --authenticate_http_executors="true"
--authenticate_http_readonly="true" --authenticate_http_readwrite="true" --authenticatee="crammd5"
--authentication_backoff_factor="1secs" --authorizer="local" --cgroups_cpu_enable_pids_and_tids_count="false"
--cgroups_enable_cfs="false" --cgroups_hierarchy="/sys/fs/cgroup" --cgroups_limit_swap="false"
--cgroups_root="mesos" --container_disk_watch_interval="15secs" --containerizers="mesos" --credential="/tmp/Endpoint_SlaveEndpointTest_NoAuthorizer_0_92HzhF/credential"
--default_role="*" --disallow_sharing_agent_pid_namespace="false" --disk_watch_interval="1mins"
--docker="docker" --docker_kill_orphans="true" --docker_registry="https://registry-1.docker.io"
--docker_remove_delay="6hrs" --docker_socket="/var/run/docker.sock" --docker_stop_timeout="0ns"
--docker_store_dir="/tmp/Endpoint_SlaveEndpointTest_NoAuthorizer_0_92HzhF/store/docker" --docker_volume_checkpoint_dir="/var/run/mesos/isolators/docker/volume"
--enforce_container_disk_quota="false" --executor_registration_timeout="1mins" --executor_reregistration_timeout="2secs"
--executor_secret_key="/tmp/Endpoint_SlaveEndpointTest_NoAuthorizer_0_92HzhF/executor_secret_key"
--executor_shutdown_grace_period="5secs" --fetcher_cache_dir="/tmp/Endpoint_SlaveEndpointTest_NoAuthorizer_0_92HzhF/fetch"
--fetcher_cache_size="2GB" --frameworks_home="" --gc_delay="1weeks" --gc_disk_headroom="0.1"
--hadoop_home="" --help="false" --hostname_lookup="true" --http_command_executor="false" --http_credentials="/tmp/Endpoint_SlaveEndpointTest_NoAuthorizer_0_92HzhF/http_credentials"
--http_heartbeat_interval="30secs" --initialize_driver_logging="true" --isolation="posix/cpu,posix/mem"
--launcher="posix" --launcher_dir="/mesos/mesos-1.5.0/_build/src" --logbufsecs="0" --logging_level="INFO"
--max_completed_executors_per_framework="150" --oversubscribed_resources_interval="15secs"
--perf_duration="10secs" --perf_interval="1mins" --port="5051" --qos_correction_interval_min="0ns"
--quiet="false" --recover="reconnect" --recovery_timeout="15mins" --registration_backoff_factor="10ms"
--resources="cpus:2;gpus:0;mem:1024;disk:1024;ports:[31000-32000]" --revocable_cpu_low_priority="true"
--runtime_dir="/tmp/Endpoint_SlaveEndpointTest_NoAuthorizer_0_92HzhF" --sandbox_directory="/mnt/mesos/sandbox"
--strict="true" --switch_user="true" --systemd_enable_support="true" --systemd_runtime_directory="/run/systemd/system"
--version="false" --work_dir="/tmp/Endpoint_SlaveEndpointTest_NoAuthorizer_0_p4UdU0" --zk_session_timeout="10secs"
I0929 20:22:49.132513 30309 credentials.hpp:86] Loading credential for authentication from
'/tmp/Endpoint_SlaveEndpointTest_NoAuthorizer_0_92HzhF/credential'
I0929 20:22:49.132679 30309 slave.cpp:287] Agent using credential for: test-principal
I0929 20:22:49.132700 30309 credentials.hpp:37] Loading credentials for authentication from
'/tmp/Endpoint_SlaveEndpointTest_NoAuthorizer_0_92HzhF/http_credentials'
I0929 20:22:49.132961 30309 http.cpp:1045] Creating default 'basic' HTTP authenticator for
realm 'mesos-agent-executor'
I0929 20:22:49.133078 30309 http.cpp:1066] Creating default 'jwt' HTTP authenticator for realm
'mesos-agent-executor'
I0929 20:22:49.133277 30309 http.cpp:1045] Creating default 'basic' HTTP authenticator for
realm 'mesos-agent-readonly'
I0929 20:22:49.133368 30309 http.cpp:1066] Creating default 'jwt' HTTP authenticator for realm
'mesos-agent-readonly'
I0929 20:22:49.133530 30309 http.cpp:1045] Creating default 'basic' HTTP authenticator for
realm 'mesos-agent-readwrite'
I0929 20:22:49.133620 30309 http.cpp:1066] Creating default 'jwt' HTTP authenticator for realm
'mesos-agent-readwrite'
I0929 20:22:49.134891 30309 slave.cpp:585] Agent resources: [{"name":"cpus","scalar":{"value":2.0},"type":"SCALAR"},{"name":"mem","scalar":{"value":1024.0},"type":"SCALAR"},{"name":"disk","scalar":{"value":1024.0},"type":"SCALAR"},{"name":"ports","ranges":{"range":[{"begin":31000,"end":32000}]},"type":"RANGES"}]
I0929 20:22:49.135102 30309 slave.cpp:593] Agent attributes: [  ]
I0929 20:22:49.135114 30309 slave.cpp:602] Agent hostname: 2cc0175fb182
I0929 20:22:49.135231 30316 status_update_manager.cpp:177] Pausing sending status updates
I0929 20:22:49.136713 30315 state.cpp:64] Recovering state from '/tmp/Endpoint_SlaveEndpointTest_NoAuthorizer_0_p4UdU0/meta'
I0929 20:22:49.136970 30317 status_update_manager.cpp:203] Recovering status update manager
I0929 20:22:49.137202 30305 containerizer.cpp:648] Recovering containerizer
I0929 20:22:49.138370 30302 provisioner.cpp:416] Provisioner recovery complete
I0929 20:22:49.138620 30316 slave.cpp:6322] Finished recovery
I0929 20:22:49.138986 30316 slave.cpp:6504] Querying resource estimator for oversubscribable
resources
I0929 20:22:49.139210 30301 slave.cpp:6518] Received oversubscribable resources {} from the
resource estimator
I0929 20:22:49.140978 30321 process.cpp:3929] Handling HTTP event for process 'slave(822)'
with path: '/slave(822)/monitor/statistics'
I0929 20:22:49.142514 30302 http.cpp:1185] HTTP GET for /slave(822)/monitor/statistics from
172.17.0.2:60484
I0929 20:22:49.142582 30302 http.cpp:976] Authorizing principal 'test-principal' to GET the
'/monitor/statistics' endpoint
I0929 20:22:49.145011 30311 slave.cpp:869] Agent terminating
[       OK ] Endpoint/SlaveEndpointTest.NoAuthorizer/0 (28 ms)
[ RUN      ] Endpoint/SlaveEndpointTest.NoAuthorizer/1
I0929 20:22:49.155174  8668 containerizer.cpp:292] Using isolation { environment_secret, posix/cpu,
posix/mem, filesystem/posix, network/cni }
W0929 20:22:49.155622  8668 backend.cpp:76] Failed to create 'aufs' backend: AufsBackend requires
root privileges
W0929 20:22:49.155725  8668 backend.cpp:76] Failed to create 'bind' backend: BindBackend requires
root privileges
I0929 20:22:49.155753  8668 provisioner.cpp:255] Using default backend 'copy'
I0929 20:22:49.157202  8668 cluster.cpp:448] Creating default 'local' authorizer
I0929 20:22:49.158910 30322 slave.cpp:254] Mesos agent started on (823)@172.17.0.2:40988
I0929 20:22:49.158929 30322 slave.cpp:255] Flags at startup: --acls="" --appc_simple_discovery_uri_prefix="http://"
--appc_store_dir="/tmp/Endpoint_SlaveEndpointTest_NoAuthorizer_1_1hi30g/store/appc" --authenticate_http_executors="true"
--authenticate_http_readonly="true" --authenticate_http_readwrite="true" --authenticatee="crammd5"
--authentication_backoff_factor="1secs" --authorizer="local" --cgroups_cpu_enable_pids_and_tids_count="false"
--cgroups_enable_cfs="false" --cgroups_hierarchy="/sys/fs/cgroup" --cgroups_limit_swap="false"
--cgroups_root="mesos" --container_disk_watch_interval="15secs" --containerizers="mesos" --credential="/tmp/Endpoint_SlaveEndpointTest_NoAuthorizer_1_1hi30g/credential"
--default_role="*" --disallow_sharing_agent_pid_namespace="false" --disk_watch_interval="1mins"
--docker="docker" --docker_kill_orphans="true" --docker_registry="https://registry-1.docker.io"
--docker_remove_delay="6hrs" --docker_socket="/var/run/docker.sock" --docker_stop_timeout="0ns"
--docker_store_dir="/tmp/Endpoint_SlaveEndpointTest_NoAuthorizer_1_1hi30g/store/docker" --docker_volume_checkpoint_dir="/var/run/mesos/isolators/docker/volume"
--enforce_container_disk_quota="false" --executor_registration_timeout="1mins" --executor_reregistration_timeout="2secs"
--executor_secret_key="/tmp/Endpoint_SlaveEndpointTest_NoAuthorizer_1_1hi30g/executor_secret_key"
--executor_shutdown_grace_period="5secs" --fetcher_cache_dir="/tmp/Endpoint_SlaveEndpointTest_NoAuthorizer_1_1hi30g/fetch"
--fetcher_cache_size="2GB" --frameworks_home="" --gc_delay="1weeks" --gc_disk_headroom="0.1"
--hadoop_home="" --help="false" --hostname_lookup="true" --http_command_executor="false" --http_credentials="/tmp/Endpoint_SlaveEndpointTest_NoAuthorizer_1_1hi30g/http_credentials"
--http_heartbeat_interval="30secs" --initialize_driver_logging="true" --isolation="posix/cpu,posix/mem"
--launcher="posix" --launcher_dir="/mesos/mesos-1.5.0/_build/src" --logbufsecs="0" --logging_level="INFO"
--max_completed_executors_per_framework="150" --oversubscribed_resources_interval="15secs"
--perf_duration="10secs" --perf_interval="1mins" --port="5051" --qos_correction_interval_min="0ns"
--quiet="false" --recover="reconnect" --recovery_timeout="15mins" --registration_backoff_factor="10ms"
--resources="cpus:2;gpus:0;mem:1024;disk:1024;ports:[31000-32000]" --revocable_cpu_low_priority="true"
--runtime_dir="/tmp/Endpoint_SlaveEndpointTest_NoAuthorizer_1_1hi30g" --sandbox_directory="/mnt/mesos/sandbox"
--strict="true" --switch_user="true" --systemd_enable_support="true" --systemd_runtime_directory="/run/systemd/system"
--version="false" --work_dir="/tmp/Endpoint_SlaveEndpointTest_NoAuthorizer_1_RDzBzC" --zk_session_timeout="10secs"
I0929 20:22:49.159255 30322 credentials.hpp:86] Loading credential for authentication from
'/tmp/Endpoint_SlaveEndpointTest_NoAuthorizer_1_1hi30g/credential'
I0929 20:22:49.159379 30322 slave.cpp:287] Agent using credential for: test-principal
I0929 20:22:49.159400 30322 credentials.hpp:37] Loading credentials for authentication from
'/tmp/Endpoint_SlaveEndpointTest_NoAuthorizer_1_1hi30g/http_credentials'
I0929 20:22:49.159631 30322 http.cpp:1045] Creating default 'basic' HTTP authenticator for
realm 'mesos-agent-executor'
I0929 20:22:49.159740 30322 http.cpp:1066] Creating default 'jwt' HTTP authenticator for realm
'mesos-agent-executor'
I0929 20:22:49.159914 30322 http.cpp:1045] Creating default 'basic' HTTP authenticator for
realm 'mesos-agent-readonly'
I0929 20:22:49.159999 30322 http.cpp:1066] Creating default 'jwt' HTTP authenticator for realm
'mesos-agent-readonly'
I0929 20:22:49.160154 30322 http.cpp:1045] Creating default 'basic' HTTP authenticator for
realm 'mesos-agent-readwrite'
I0929 20:22:49.160243 30322 http.cpp:1066] Creating default 'jwt' HTTP authenticator for realm
'mesos-agent-readwrite'
I0929 20:22:49.161434 30322 slave.cpp:585] Agent resources: [{"name":"cpus","scalar":{"value":2.0},"type":"SCALAR"},{"name":"mem","scalar":{"value":1024.0},"type":"SCALAR"},{"name":"disk","scalar":{"value":1024.0},"type":"SCALAR"},{"name":"ports","ranges":{"range":[{"begin":31000,"end":32000}]},"type":"RANGES"}]
I0929 20:22:49.161633 30322 slave.cpp:593] Agent attributes: [  ]
I0929 20:22:49.161644 30322 slave.cpp:602] Agent hostname: 2cc0175fb182
I0929 20:22:49.161761 30323 status_update_manager.cpp:177] Pausing sending status updates
I0929 20:22:49.162981 30308 state.cpp:64] Recovering state from '/tmp/Endpoint_SlaveEndpointTest_NoAuthorizer_1_RDzBzC/meta'
I0929 20:22:49.163271 30308 status_update_manager.cpp:203] Recovering status update manager
I0929 20:22:49.163491 30317 containerizer.cpp:648] Recovering containerizer
I0929 20:22:49.164741 30305 provisioner.cpp:416] Provisioner recovery complete
I0929 20:22:49.165025 30323 slave.cpp:6322] Finished recovery
I0929 20:22:49.165498 30323 slave.cpp:6504] Querying resource estimator for oversubscribable
resources
I0929 20:22:49.165719 30304 slave.cpp:6518] Received oversubscribable resources {} from the
resource estimator
I0929 20:22:49.167558 30316 process.cpp:3929] Handling HTTP event for process 'slave(823)'
with path: '/slave(823)/monitor/statistics.json'
I0929 20:22:49.169164 30305 http.cpp:1185] HTTP GET for /slave(823)/monitor/statistics.json
from 172.17.0.2:60490
I0929 20:22:49.169235 30305 http.cpp:976] Authorizing principal 'test-principal' to GET the
'/monitor/statistics.json' endpoint
I0929 20:22:49.171555 30312 slave.cpp:869] Agent terminating
[       OK ] Endpoint/SlaveEndpointTest.NoAuthorizer/1 (27 ms)
[ RUN      ] Endpoint/SlaveEndpointTest.NoAuthorizer/2
I0929 20:22:49.182535  8668 containerizer.cpp:292] Using isolation { environment_secret, posix/cpu,
posix/mem, filesystem/posix, network/cni }
W0929 20:22:49.183028  8668 backend.cpp:76] Failed to create 'aufs' backend: AufsBackend requires
root privileges
W0929 20:22:49.183141  8668 backend.cpp:76] Failed to create 'bind' backend: BindBackend requires
root privileges
I0929 20:22:49.183184  8668 provisioner.cpp:255] Using default backend 'copy'
I0929 20:22:49.184826  8668 cluster.cpp:448] Creating default 'local' authorizer
I0929 20:22:49.186738 30321 slave.cpp:254] Mesos agent started on (824)@172.17.0.2:40988
I0929 20:22:49.186758 30321 slave.cpp:255] Flags at startup: --acls="" --appc_simple_discovery_uri_prefix="http://"
--appc_store_dir="/tmp/Endpoint_SlaveEndpointTest_NoAuthorizer_2_hqqB0S/store/appc" --authenticate_http_executors="true"
--authenticate_http_readonly="true" --authenticate_http_readwrite="true" --authenticatee="crammd5"
--authentication_backoff_factor="1secs" --authorizer="local" --cgroups_cpu_enable_pids_and_tids_count="false"
--cgroups_enable_cfs="false" --cgroups_hierarchy="/sys/fs/cgroup" --cgroups_limit_swap="false"
--cgroups_root="mesos" --container_disk_watch_interval="15secs" --containerizers="mesos" --credential="/tmp/Endpoint_SlaveEndpointTest_NoAuthorizer_2_hqqB0S/credential"
--default_role="*" --disallow_sharing_agent_pid_namespace="false" --disk_watch_interval="1mins"
--docker="docker" --docker_kill_orphans="true" --docker_registry="https://registry-1.docker.io"
--docker_remove_delay="6hrs" --docker_socket="/var/run/docker.sock" --docker_stop_timeout="0ns"
--docker_store_dir="/tmp/Endpoint_SlaveEndpointTest_NoAuthorizer_2_hqqB0S/store/docker" --docker_volume_checkpoint_dir="/var/run/mesos/isolators/docker/volume"
--enforce_container_disk_quota="false" --executor_registration_timeout="1mins" --executor_reregistration_timeout="2secs"
--executor_secret_key="/tmp/Endpoint_SlaveEndpointTest_NoAuthorizer_2_hqqB0S/executor_secret_key"
--executor_shutdown_grace_period="5secs" --fetcher_cache_dir="/tmp/Endpoint_SlaveEndpointTest_NoAuthorizer_2_hqqB0S/fetch"
--fetcher_cache_size="2GB" --frameworks_home="" --gc_delay="1weeks" --gc_disk_headroom="0.1"
--hadoop_home="" --help="false" --hostname_lookup="true" --http_command_executor="false" --http_credentials="/tmp/Endpoint_SlaveEndpointTest_NoAuthorizer_2_hqqB0S/http_credentials"
--http_heartbeat_interval="30secs" --initialize_driver_logging="true" --isolation="posix/cpu,posix/mem"
--launcher="posix" --launcher_dir="/mesos/mesos-1.5.0/_build/src" --logbufsecs="0" --logging_level="INFO"
--max_completed_executors_per_framework="150" --oversubscribed_resources_interval="15secs"
--perf_duration="10secs" --perf_interval="1mins" --port="5051" --qos_correction_interval_min="0ns"
--quiet="false" --recover="reconnect" --recovery_timeout="15mins" --registration_backoff_factor="10ms"
--resources="cpus:2;gpus:0;mem:1024;disk:1024;ports:[31000-32000]" --revocable_cpu_low_priority="true"
--runtime_dir="/tmp/Endpoint_SlaveEndpointTest_NoAuthorizer_2_hqqB0S" --sandbox_directory="/mnt/mesos/sandbox"
--strict="true" --switch_user="true" --systemd_enable_support="true" --systemd_runtime_directory="/run/systemd/system"
--version="false" --work_dir="/tmp/Endpoint_SlaveEndpointTest_NoAuthorizer_2_GKr6ue" --zk_session_timeout="10secs"
I0929 20:22:49.187228 30321 credentials.hpp:86] Loading credential for authentication from
'/tmp/Endpoint_SlaveEndpointTest_NoAuthorizer_2_hqqB0S/credential'
I0929 20:22:49.187388 30321 slave.cpp:287] Agent using credential for: test-principal
I0929 20:22:49.187407 30321 credentials.hpp:37] Loading credentials for authentication from
'/tmp/Endpoint_SlaveEndpointTest_NoAuthorizer_2_hqqB0S/http_credentials'
I0929 20:22:49.187716 30321 http.cpp:1045] Creating default 'basic' HTTP authenticator for
realm 'mesos-agent-executor'
I0929 20:22:49.187831 30321 http.cpp:1066] Creating default 'jwt' HTTP authenticator for realm
'mesos-agent-executor'
I0929 20:22:49.188067 30321 http.cpp:1045] Creating default 'basic' HTTP authenticator for
realm 'mesos-agent-readonly'
I0929 20:22:49.188177 30321 http.cpp:1066] Creating default 'jwt' HTTP authenticator for realm
'mesos-agent-readonly'
I0929 20:22:49.188405 30321 http.cpp:1045] Creating default 'basic' HTTP authenticator for
realm 'mesos-agent-readwrite'
I0929 20:22:49.188529 30321 http.cpp:1066] Creating default 'jwt' HTTP authenticator for realm
'mesos-agent-readwrite'
I0929 20:22:49.189960 30321 slave.cpp:585] Agent resources: [{"name":"cpus","scalar":{"value":2.0},"type":"SCALAR"},{"name":"mem","scalar":{"value":1024.0},"type":"SCALAR"},{"name":"disk","scalar":{"value":1024.0},"type":"SCALAR"},{"name":"ports","ranges":{"range":[{"begin":31000,"end":32000}]},"type":"RANGES"}]
I0929 20:22:49.190177 30321 slave.cpp:593] Agent attributes: [  ]
I0929 20:22:49.190191 30321 slave.cpp:602] Agent hostname: 2cc0175fb182
I0929 20:22:49.190348 30315 status_update_manager.cpp:177] Pausing sending status updates
I0929 20:22:49.191942 30307 state.cpp:64] Recovering state from '/tmp/Endpoint_SlaveEndpointTest_NoAuthorizer_2_GKr6ue/meta'
I0929 20:22:49.192294 30301 status_update_manager.cpp:203] Recovering status update manager
I0929 20:22:49.192512 30311 containerizer.cpp:648] Recovering containerizer
I0929 20:22:49.193789 30318 provisioner.cpp:416] Provisioner recovery complete
I0929 20:22:49.194145 30316 slave.cpp:6322] Finished recovery
I0929 20:22:49.194573 30316 slave.cpp:6504] Querying resource estimator for oversubscribable
resources
I0929 20:22:49.194818 30302 slave.cpp:6518] Received oversubscribable resources {} from the
resource estimator
I0929 20:22:49.196969 30322 process.cpp:3929] Handling HTTP event for process 'slave(824)'
with path: '/slave(824)/containers'
I0929 20:22:49.198674 30324 http.cpp:1185] HTTP GET for /slave(824)/containers from 172.17.0.2:60494
I0929 20:22:49.198745 30324 http.cpp:976] Authorizing principal 'test-principal' to GET the
'/containers' endpoint
I0929 20:22:49.202004  8668 slave.cpp:869] Agent terminating
[       OK ] Endpoint/SlaveEndpointTest.NoAuthorizer/2 (30 ms)
[----------] 9 tests from Endpoint/SlaveEndpointTest (253 ms total)

[----------] 2 tests from ContainerizerType/DefaultContainerDNSFlagTest
[ RUN      ] ContainerizerType/DefaultContainerDNSFlagTest.ValidateFlag/0
[       OK ] ContainerizerType/DefaultContainerDNSFlagTest.ValidateFlag/0 (9 ms)
[ RUN      ] ContainerizerType/DefaultContainerDNSFlagTest.ValidateFlag/1
[       OK ] ContainerizerType/DefaultContainerDNSFlagTest.ValidateFlag/1 (9 ms)
[----------] 2 tests from ContainerizerType/DefaultContainerDNSFlagTest (18 ms total)

[----------] Global test environment tear-down
[==========] 1685 tests from 186 test cases ran. (664382 ms total)
[  PASSED  ] 1680 tests.
[  FAILED  ] 5 tests, listed below:
[  FAILED  ] CommandExecutorCheckTest.CommandCheckDeliveredAndReconciled
[  FAILED  ] DefaultExecutorCheckTest.CommandCheckDeliveredAndReconciled
[  FAILED  ] DefaultExecutorCheckTest.CommandCheckStatusChange
[  FAILED  ] DefaultExecutorCheckTest.CommandCheckSeesParentsEnv
[  FAILED  ] DefaultExecutorCheckTest.CommandCheckSharesWorkDirWithTask

 5 FAILED TESTS
  YOU HAVE 20 DISABLED TESTS

I0929 20:22:49.281967 30325 process.cpp:1068] Failed to accept socket: future discarded
make[4]: *** [check-local] Error 1
make[4]: Leaving directory `/mesos/mesos-1.5.0/_build/src'
make[3]: *** [check-am] Error 2
make[3]: Leaving directory `/mesos/mesos-1.5.0/_build/src'
make[2]: *** [check] Error 2
make[2]: Leaving directory `/mesos/mesos-1.5.0/_build/src'
make[1]: *** [check-recursive] Error 1
make[1]: Leaving directory `/mesos/mesos-1.5.0/_build'
make: *** [distcheck] Error 1
+ docker rmi mesos-1506712906-20902
Untagged: mesos-1506712906-20902:latest
Deleted: sha256:3d7ada1a7a5c34742b4bb81a7cf779c7b2112ddf56fc36dcea8bf487284b1524
Deleted: sha256:6105cd836e5c47fc3341b6810df6f8254f9b0520345d42f80549aa1688ede50b
Deleted: sha256:c03090932b4ad99b7e6347c085d14cd20dd799dd96435b7b71601e6cc0dc571c
Deleted: sha256:99fff6b8276636137c2c2c931aafdcfa370692ce6ef60faf32c587da47f6bf03
Deleted: sha256:cf185d2989ff00b52926214c51f1c21e5a4a34d247b738de71d05ab1f271cf1f
Deleted: sha256:466e14c7764fbf4642266c5f248f2f4e0a989642b542cb23310ad5f4f9ae50a6
Deleted: sha256:2386a0c190b0e9ec35176cc35c9482ece0ac1889d5da6650a4ab930a127c3cd6
Deleted: sha256:0656a3f40e02aeedb21b3f7088c92271e56048923fcd2db9eed2f84a63546cbc
Deleted: sha256:ba921adb783fd7cca0b6b40f1e4dba8f6220fa8159d08d112e65de019e6bc7d8
Deleted: sha256:404a4034e97d224fd0051379e44d37dcb2ceb028e1be33e38b16b8c66ad191d4
Deleted: sha256:c18b697e8a7be4c7e2a68688e0ec2add80d5e024f99c6d75524cf45d77ebc63c
Deleted: sha256:9e07230030dcdc803560939f5ed5c093b5044bd9a70c0c6af65af2280211ffad
Deleted: sha256:2249c72bbae05da2e2af1d107a9acde2809c3a22a670e27cfbabb02222249278
Deleted: sha256:f341764892662774e14a1e2cbbdc1a089c500cefbf4721ccbd23a017ce7b9828
Deleted: sha256:6d8fa30c6db97833af5658bf42421db68e6693062e50ecc42cfbacf61a646f3b
Deleted: sha256:cf8961e3fcf7c3d9ec2479eaadce5c111aa412f569090154f77e59ea58611450
Deleted: sha256:1f248a35a0fc2142fa048289a84fdf96d9deb9c145dd003d52bc4de399779c38
Deleted: sha256:216861ee2114c5c11ea5c4e708732a01be4b8f1c39bd9923486e867f2f719f29
Deleted: sha256:57aed81cac04f9ebb3960575d160a62c7e4599993a0d34478e8b60bcafe51f4d
Deleted: sha256:24320832d9fbd18f7045fd3d0b6017e5d5667d6678a7765e7c5d3fa83017e674
Deleted: sha256:fc383200f300e8f1cd8a268b9b8fac30669732cbfd469f38628501bf64a0680f
Deleted: sha256:afdd0f62b015be9efb7093240aada1d3c71655b910553eecdd9f78e1a50dc584
Deleted: sha256:2eb021a1d7d615a035ffcb6ecd9efaa8bba87a313c9936966f644166e4dce16a
Deleted: sha256:b2b6ad6accc7ee22280f59e56cc39e24480f72cd1ea530c218ef235ef1549b28
Deleted: sha256:39acd3b61b0a07a0f5aa3e24397f096c9afe00e021651fd0e02678d34beccfcc
Deleted: sha256:a541165721804dfb12e6563b1f92358d9b523f2ce0ad30fa4686f3c2c8e2ead9
Deleted: sha256:bb9bbd051fa70c27eed0dc00cdc96550aec4eba48ebd2e21cdca53cc6b6f1b36
Deleted: sha256:5aa4e6a9bb74fb60b05c19e9b4e194e7cca9966c0a66699e76b07c15fa3db801
Build step 'Execute shell' marked build as failure
Not sending mail to unregistered user benjamin.hindman@gmail.com

Mime
View raw message