mesos-builds mailing list archives

Site index · List index
Message view « Date » · « Thread »
Top « Date » · « Thread »
From Apache Jenkins Server <jenk...@builds.apache.org>
Subject Build failed in Jenkins: Mesos-Buildbot » cmake,gcc,--verbose,GLOG_v=1 MESOS_VERBOSE=1,centos:7,(ubuntu)&&(!ubuntu-us1)&&(!ubuntu-eu2)&&(!qnode3)&&(!H23) #4250
Date Thu, 21 Sep 2017 22:20:59 GMT
See <https://builds.apache.org/job/Mesos-Buildbot/BUILDTOOL=cmake,COMPILER=gcc,CONFIGURATION=--verbose,ENVIRONMENT=GLOG_v=1%20MESOS_VERBOSE=1,OS=centos%3A7,label_exp=(ubuntu)&&(!ubuntu-us1)&&(!ubuntu-eu2)&&(!qnode3)&&(!H23)/4250/display/redirect?page=changes>

Changes:

[bmahler] Fixed a javascript lint issue related to ellipsis in the webui.

------------------------------------------
[...truncated 1.61 MB...]
as: BFD version 2.25.1-22.base.el7  assertion fail elf.c:2660
as: BFD version 2.25.1-22.base.el7  assertion fail elf.c:2660
as: BFD version 2.25.1-22.base.el7  assertion fail elf.c:2660
as: BFD version 2.25.1-22.base.el7  assertion fail elf.c:2660
as: BFD version 2.25.1-22.base.el7  assertion fail elf.c:2660
as: BFD version 2.25.1-22.base.el7  assertion fail elf.c:2660
as: BFD version 2.25.1-22.base.el7  assertion fail elf.c:2660
as: BFD version 2.25.1-22.base.el7  assertion fail elf.c:2660
as: BFD version 2.25.1-22.base.el7  assertion fail elf.c:2660
as: BFD version 2.25.1-22.base.el7  assertion fail elf.c:2660
as: BFD version 2.25.1-22.base.el7  assertion fail elf.c:2660
as: BFD version 2.25.1-22.base.el7  assertion fail elf.c:2660
as: BFD version 2.25.1-22.base.el7  assertion fail elf.c:2660
as: BFD version 2.25.1-22.base.el7  assertion fail elf.c:2660
as: BFD version 2.25.1-22.base.el7  assertion fail elf.c:2660
as: BFD version 2.25.1-22.base.el7  assertion fail elf.c:2660
as: BFD version 2.25.1-22.base.el7  assertion fail elf.c:2660
as: BFD version 2.25.1-22.base.el7  assertion fail elf.c:2660
as: BFD version 2.25.1-22.base.el7  assertion fail elf.c:2660
as: BFD version 2.25.1-22.base.el7  assertion fail elf.c:2660
as: BFD version 2.25.1-22.base.el7  assertion fail elf.c:2660
as: BFD version 2.25.1-22.base.el7  assertion fail elf.c:2660
as: BFD version 2.25.1-22.base.el7  assertion fail elf.c:2660
as: BFD version 2.25.1-22.base.el7  assertion fail elf.c:2660
as: BFD version 2.25.1-22.base.el7  assertion fail elf.c:2660
as: BFD version 2.25.1-22.base.el7  assertion fail elf.c:2660
as: BFD version 2.25.1-22.base.el7  assertion fail elf.c:2660
as: BFD version 2.25.1-22.base.el7  assertion fail elf.c:2660
as: BFD version 2.25.1-22.base.el7  assertion fail elf.c:2660
as: BFD version 2.25.1-22.base.el7  assertion fail elf.c:2660
as: BFD version 2.25.1-22.base.el7  assertion fail elf.c:2660
as: BFD version 2.25.1-22.base.el7  assertion fail elf.c:2660
as: BFD version 2.25.1-22.base.el7  assertion fail elf.c:2660
as: BFD version 2.25.1-22.base.el7  assertion fail elf.c:2660
as: BFD version 2.25.1-22.base.el7  assertion fail elf.c:2660
as: BFD version 2.25.1-22.base.el7  assertion fail elf.c:2660
as: BFD version 2.25.1-22.base.el7  assertion fail elf.c:2660
as: BFD version 2.25.1-22.base.el7  assertion fail elf.c:2660
as: BFD version 2.25.1-22.base.el7  assertion fail elf.c:2660
as: BFD version 2.25.1-22.base.el7  assertion fail elf.c:2660
as: BFD version 2.25.1-22.base.el7  assertion fail elf.c:2660
as: BFD version 2.25.1-22.base.el7  assertion fail elf.c:2660
as: BFD version 2.25.1-22.base.el7  assertion fail elf.c:2660
as: BFD version 2.25.1-22.base.el7  assertion fail elf.c:2660
as: BFD version 2.25.1-22.base.el7  assertion fail elf.c:2660
as: BFD version 2.25.1-22.base.el7  assertion fail elf.c:2660
as: BFD version 2.25.1-22.base.el7  assertion fail elf.c:2660
as: BFD version 2.25.1-22.base.el7  assertion fail elf.c:2660
as: BFD version 2.25.1-22.base.el7  assertion fail elf.c:2660
as: BFD version 2.25.1-22.base.el7  assertion fail elf.c:2660
as: BFD version 2.25.1-22.base.el7  assertion fail elf.c:2660
as: BFD version 2.25.1-22.base.el7  assertion fail elf.c:2660
as: BFD version 2.25.1-22.base.el7  assertion fail elf.c:2660
as: BFD version 2.25.1-22.base.el7  assertion fail elf.c:2660
as: BFD version 2.25.1-22.base.el7  assertion fail elf.c:2660
as: BFD version 2.25.1-22.base.el7  assertion fail elf.c:2660
as: BFD version 2.25.1-22.base.el7  assertion fail elf.c:2660
as: BFD version 2.25.1-22.base.el7  assertion fail elf.c:2660
as: BFD version 2.25.1-22.base.el7  assertion fail elf.c:2660
as: BFD version 2.25.1-22.base.el7  assertion fail elf.c:2660
as: BFD version 2.25.1-22.base.el7  assertion fail elf.c:2660
as: BFD version 2.25.1-22.base.el7  assertion fail elf.c:2660
as: BFD version 2.25.1-22.base.el7  assertion fail elf.c:2660
as: BFD version 2.25.1-22.base.el7  assertion fail elf.c:2660
as: BFD version 2.25.1-22.base.el7  assertion fail elf.c:2660
as: BFD version 2.25.1-22.base.el7  assertion fail elf.c:2660
as: BFD version 2.25.1-22.base.el7  assertion fail elf.c:2660
as: BFD version 2.25.1-22.base.el7  assertion fail elf.c:2660
as: BFD version 2.25.1-22.base.el7  assertion fail elf.c:2660
as: BFD version 2.25.1-22.base.el7  assertion fail elf.c:2660
as: BFD version 2.25.1-22.base.el7  assertion fail elf.c:2660
as: BFD version 2.25.1-22.base.el7  assertion fail elf.c:2660
as: BFD version 2.25.1-22.base.el7  assertion fail elf.c:2660
as: BFD version 2.25.1-22.base.el7  assertion fail elf.c:2660
as: BFD version 2.25.1-22.base.el7  assertion fail elf.c:2660
as: BFD version 2.25.1-22.base.el7  assertion fail elf.c:2660
as: BFD version 2.25.1-22.base.el7  assertion fail elf.c:2660
as: BFD version 2.25.1-22.base.el7  assertion fail elf.c:2660
as: BFD version 2.25.1-22.base.el7  assertion fail elf.c:2660
as: BFD version 2.25.1-22.base.el7  assertion fail elf.c:2660
as: BFD version 2.25.1-22.base.el7  assertion fail elf.c:2660
as: BFD version 2.25.1-22.base.el7  assertion fail elf.c:2660
as: BFD version 2.25.1-22.base.el7  assertion fail elf.c:2660
as: BFD version 2.25.1-22.base.el7  assertion fail elf.c:2660
as: BFD version 2.25.1-22.base.el7  assertion fail elf.c:2660
as: BFD version 2.25.1-22.base.el7  assertion fail elf.c:2660
as: BFD version 2.25.1-22.base.el7  assertion fail elf.c:2660
as: BFD version 2.25.1-22.base.el7  assertion fail elf.c:2660
as: BFD version 2.25.1-22.base.el7  assertion fail elf.c:2660
as: BFD version 2.25.1-22.base.el7  assertion fail elf.c:2660
as: BFD version 2.25.1-22.base.el7  assertion fail elf.c:2660
as: BFD version 2.25.1-22.base.el7  assertion fail elf.c:2660
as: BFD version 2.25.1-22.base.el7  assertion fail elf.c:2660
as: BFD version 2.25.1-22.base.el7  assertion fail elf.c:2660
as: BFD version 2.25.1-22.base.el7  assertion fail elf.c:2660
as: BFD version 2.25.1-22.base.el7  assertion fail elf.c:2660
as: BFD version 2.25.1-22.base.el7  assertion fail elf.c:2660
as: BFD version 2.25.1-22.base.el7  assertion fail elf.c:2660
as: BFD version 2.25.1-22.base.el7  assertion fail elf.c:2660
as: BFD version 2.25.1-22.base.el7  assertion fail elf.c:2660
as: BFD version 2.25.1-22.base.el7  assertion fail elf.c:2660
as: BFD version 2.25.1-22.base.el7  assertion fail elf.c:2660
as: BFD version 2.25.1-22.base.el7  assertion fail elf.c:2660
as: BFD version 2.25.1-22.base.el7  assertion fail elf.c:2660
as: BFD version 2.25.1-22.base.el7  assertion fail elf.c:2660
as: BFD version 2.25.1-22.base.el7  assertion fail elf.c:2660
as: BFD version 2.25.1-22.base.el7  assertion fail elf.c:2660
as: BFD version 2.25.1-22.base.el7  assertion fail elf.c:2660
as: BFD version 2.25.1-22.base.el7  assertion fail elf.c:2660
as: BFD version 2.25.1-22.base.el7  assertion fail elf.c:2660
as: BFD version 2.25.1-22.base.el7  assertion fail elf.c:2660
as: BFD version 2.25.1-22.base.el7  assertion fail elf.c:2660
as: BFD version 2.25.1-22.base.el7  assertion fail elf.c:2660
as: BFD version 2.25.1-22.base.el7  assertion fail elf.c:2660
as: BFD version 2.25.1-22.base.el7  assertion fail elf.c:2660
as: BFD version 2.25.1-22.base.el7  assertion fail elf.c:2660
as: BFD version 2.25.1-22.base.el7  assertion fail elf.c:2660
as: BFD version 2.25.1-22.base.el7  assertion fail elf.c:2660
as: BFD version 2.25.1-22.base.el7  assertion fail elf.c:2660
as: BFD version 2.25.1-22.base.el7  assertion fail elf.c:2660
as: BFD version 2.25.1-22.base.el7  assertion fail elf.c:2660
as: BFD version 2.25.1-22.base.el7  assertion fail elf.c:2660
as: BFD version 2.25.1-22.base.el7  assertion fail elf.c:2660
as: BFD version 2.25.1-22.base.el7  assertion fail elf.c:2660
as: BFD version 2.25.1-22.base.el7  assertion fail elf.c:2660
as: BFD version 2.25.1-22.base.el7  assertion fail elf.c:2660
as: BFD version 2.25.1-22.base.el7  assertion fail elf.c:2660
as: BFD version 2.25.1-22.base.el7  assertion fail elf.c:2660
as: BFD version 2.25.1-22.base.el7  assertion fail elf.c:2660
as: BFD version 2.25.1-22.base.el7  assertion fail elf.c:2660
as: BFD version 2.25.1-22.base.el7  assertion fail elf.c:2660
as: BFD version 2.25.1-22.base.el7  assertion fail elf.c:2660
as: BFD version 2.25.1-22.base.el7  assertion fail elf.c:2660
as: BFD version 2.25.1-22.base.el7  assertion fail elf.c:2660
as: BFD version 2.25.1-22.base.el7  assertion fail elf.c:2660
as: BFD version 2.25.1-22.base.el7  assertion fail elf.c:2660
as: BFD version 2.25.1-22.base.el7  assertion fail elf.c:2660
as: BFD version 2.25.1-22.base.el7  assertion fail elf.c:2660
as: BFD version 2.25.1-22.base.el7  assertion fail elf.c:2660
as: BFD version 2.25.1-22.base.el7  assertion fail elf.c:2660
as: BFD version 2.25.1-22.base.el7  assertion fail elf.c:2660
as: BFD version 2.25.1-22.base.el7  assertion fail elf.c:2660
as: BFD version 2.25.1-22.base.el7  assertion fail elf.c:2660
as: BFD version 2.25.1-22.base.el7  assertion fail elf.c:2660
as: BFD version 2.25.1-22.base.el7  assertion fail elf.c:2660
as: BFD version 2.25.1-22.base.el7  assertion fail elf.c:2660
as: BFD version 2.25.1-22.base.el7  assertion fail elf.c:2660
as: BFD version 2.25.1-22.base.el7  assertion fail elf.c:2660
as: BFD version 2.25.1-22.base.el7  assertion fail elf.c:2660
as: BFD version 2.25.1-22.base.el7  assertion fail elf.c:2660
as: BFD version 2.25.1-22.base.el7  assertion fail elf.c:2660
as: BFD version 2.25.1-22.base.el7  assertion fail elf.c:2660
as: BFD version 2.25.1-22.base.el7  assertion fail elf.c:2660
as: BFD version 2.25.1-22.base.el7  assertion fail elf.c:2660
as: BFD version 2.25.1-22.base.el7  assertion fail elf.c:2660
as: BFD version 2.25.1-22.base.el7  assertion fail elf.c:2660
as: BFD version 2.25.1-22.base.el7  assertion fail elf.c:2660
as: BFD version 2.25.1-22.base.el7  assertion fail elf.c:2660
as: BFD version 2.25.1-22.base.el7  assertion fail elf.c:2660
as: BFD version 2.25.1-22.base.el7  assertion fail elf.c:2660
as: BFD version 2.25.1-22.base.el7  assertion fail elf.c:2660
as: BFD version 2.25.1-22.base.el7  assertion fail elf.c:2660
as: BFD version 2.25.1-22.base.el7  assertion fail elf.c:2660
as: BFD version 2.25.1-22.base.el7  assertion fail elf.c:2660
as: BFD version 2.25.1-22.base.el7  assertion fail elf.c:2660
as: BFD version 2.25.1-22.base.el7  assertion fail elf.c:2660
as: BFD version 2.25.1-22.base.el7  assertion fail elf.c:2660
as: BFD version 2.25.1-22.base.el7  assertion fail elf.c:2660
as: BFD version 2.25.1-22.base.el7  assertion fail elf.c:2660
as: BFD version 2.25.1-22.base.el7  assertion fail elf.c:2660
as: BFD version 2.25.1-22.base.el7  assertion fail elf.c:2660
as: BFD version 2.25.1-22.base.el7  assertion fail elf.c:2660
as: BFD version 2.25.1-22.base.el7  assertion fail elf.c:2660
as: BFD version 2.25.1-22.base.el7  assertion fail elf.c:2660
as: BFD version 2.25.1-22.base.el7  assertion fail elf.c:2660
as: BFD version 2.25.1-22.base.el7  assertion fail elf.c:2660
as: BFD version 2.25.1-22.base.el7  assertion fail elf.c:2660
as: BFD version 2.25.1-22.base.el7  assertion fail elf.c:2660
as: BFD version 2.25.1-22.base.el7  assertion fail elf.c:2660
as: BFD version 2.25.1-22.base.el7  assertion fail elf.c:2660
as: BFD version 2.25.1-22.base.el7  assertion fail elf.c:2660
as: BFD version 2.25.1-22.base.el7  assertion fail elf.c:2660
as: BFD version 2.25.1-22.base.el7  assertion fail elf.c:2660
as: BFD version 2.25.1-22.base.el7  assertion fail elf.c:2660
as: BFD version 2.25.1-22.base.el7  assertion fail elf.c:2660
as: BFD version 2.25.1-22.base.el7  assertion fail elf.c:2660
as: BFD version 2.25.1-22.base.el7  assertion fail elf.c:2660
as: BFD version 2.25.1-22.base.el7  assertion fail elf.c:2660
as: BFD version 2.25.1-22.base.el7  assertion fail elf.c:2660
as: BFD version 2.25.1-22.base.el7  assertion fail elf.c:2660
as: BFD version 2.25.1-22.base.el7  assertion fail elf.c:2660
as: BFD version 2.25.1-22.base.el7  assertion fail elf.c:2660
as: BFD version 2.25.1-22.base.el7  assertion fail elf.c:2660
as: BFD version 2.25.1-22.base.el7  assertion fail elf.c:2660
as: BFD version 2.25.1-22.base.el7  assertion fail elf.c:2660
as: BFD version 2.25.1-22.base.el7  assertion fail elf.c:2660
as: BFD version 2.25.1-22.base.el7  assertion fail elf.c:2660
as: BFD version 2.25.1-22.base.el7  assertion fail elf.c:2660
as: BFD version 2.25.1-22.base.el7  assertion fail elf.c:2660
as: BFD version 2.25.1-22.base.el7  assertion fail elf.c:2660
as: BFD version 2.25.1-22.base.el7  assertion fail elf.c:2660
as: BFD version 2.25.1-22.base.el7  assertion fail elf.c:2660
/tmp/ccCKf6m1.s: Fatal error: can't close CMakeFiles/mesos-tests.dir/containerizer/provisioner_docker_tests.cpp.o:
No space left on device
make[3]: *** [src/tests/CMakeFiles/mesos-tests.dir/containerizer/provisioner_docker_tests.cpp.o]
Error 1
make[3]: *** Waiting for unfinished jobs....
/mesos/src/tests/containerizer/volume_sandbox_path_isolator_tests.cpp:374:1: fatal error:
error writing to /tmp/ccLxnjSr.s: No space left on device
 } // namespace mesos {
 ^
compilation terminated.
The bug is not reproducible, so it is likely a hardware or OS problem.
make[3]: *** [src/tests/CMakeFiles/mesos-tests.dir/containerizer/volume_sandbox_path_isolator_tests.cpp.o]
Error 1
make[3]: Leaving directory `/mesos/build'
make[2]: Leaving directory `/mesos/build'
make[2]: *** [src/tests/CMakeFiles/mesos-tests.dir/all] Error 2
make[1]: *** [CMakeFiles/check.dir/rule] Error 2
make[1]: Leaving directory `/mesos/build'
make: *** [check] Error 2
+ docker rmi mesos-1506028665-28651
Untagged: mesos-1506028665-28651:latest
Deleted: sha256:37683b00287272c7f21b15b7c2c31752bfe80f960342d9d2629c78a0f52cfcfd
Deleted: sha256:17f8ad241e68c7a99606a3bd1a04b93d4e5116c528479e080788783894bc7513
Deleted: sha256:309288e51229582a00b3139de2d7f431221b68e9ad50d93e4000ed57ce6250bd
Deleted: sha256:cdce62c3aa9c275b20e0d69c23056fef36cf65beba063e235f9501adc9ef41f4
Deleted: sha256:0fe5a6f792a2a5220a92d5138d92f6851a12112589d3b65c5f525f22adde8117
Deleted: sha256:7529e9c45fcf186048e8f9ee8ab82b53a19d5085381e39023d8908ee95792ce6
Deleted: sha256:16ae79bc9bdef63a6b7443ab3c4fe693ea613648189c6edac9669c2bffccb87a
Deleted: sha256:75fdf77d226da708deabfffecf7c8899d0451985ee2d7d3b7e425301d5c54cbd
Deleted: sha256:dce76683dd162f06934acfc1f91a5c01cec0440f729a676e42d5f17b65a81768
Deleted: sha256:ba8e7820096f3bcf785ae236b6c8c682674922bf83dae92a0cbb65495abd4125
Deleted: sha256:54bdfa99f96e14c8465e6e7e5b305082c0667c51d4acb167b9257fa11ef4763e
Deleted: sha256:27640bdfe4f26e90bcaedc695b9d243d0dc0503c0bdd7f29645bc3d19c0a94a5
Deleted: sha256:a9799dbbaebe943c95f3b77bd5fc27a657be8dbd02228f97787096dbbb5e8867
Deleted: sha256:5b6f84494547c6722ffe1ba1291caa1543603b7b2dd574deebeacf6f014720d7
Deleted: sha256:dc7c6b1db37e53d84ff0162f37a8c5ee47d66e84898d8ed3ddb15abd16740a59
Deleted: sha256:e747283caa17dd3bd8b55a749c93ab015db36522b892384d930411a374ddd14c
Deleted: sha256:3e9691f79774a6cfc01e411f393664a98523ae8da46e8d3d46b904d1885ac30c
Deleted: sha256:75bb64c64c1b36a296e51c17bbea47c6c7746a0f03191df5ef5379fdec9f5654
Deleted: sha256:3609eb482588e66cee4f0c1cc388cb4cef2e0852bdcea71ca1c690b092e82053
Deleted: sha256:c6c577c9f7213bea043c516979d016c25425732d1b1f269b6d6d356f4c5a5f31
Deleted: sha256:a63cd477abadab7b96ba85ef5acee6d557da9aa945d3bbf442abf050c2f98af2
Deleted: sha256:8dd320f9dcc3d3dd05ab16fe5fc6e41b9da5467c158548e315e95eee7c099289
Deleted: sha256:8948988c7c0bae47f37cbd7439ba2cfdf2522a3e4b0d9d9174dfb9e6c68e7a5c
Deleted: sha256:1eb9c1d63f69ba4ad85e93b21758b289772d8585b193e555c5226fdbf404ff44
Deleted: sha256:4eca2049fbad7730d77b66c1438bf186a568b59a3d10a8579b60148da75c8c67
Deleted: sha256:5aa06dba01da3a4e77a7b5762b39fad7bbce6adcc798f1a33121ac67fd14246c
Deleted: sha256:93f1b46b2f0425d8fcd0b81c007b37570e292c183efa26c0d7141431a365086a
Deleted: sha256:c37c693eebdca6d22b32e60205635ea36e1a06426b9057fa8accb2b52863deda
Deleted: sha256:cd1e869a48a5296fb307c85876c4467feb3281b724b5b9b394bee215f1e175bc
Build step 'Execute shell' marked build as failure

Mime
View raw message