mesos-builds mailing list archives

Site index · List index
Message view « Date » · « Thread »
Top « Date » · « Thread »
From Apache Jenkins Server <jenk...@builds.apache.org>
Subject Build failed in Jenkins: Mesos-Reviewbot #19155
Date Fri, 01 Sep 2017 07:20:25 GMT
See <https://builds.apache.org/job/Mesos-Reviewbot/19155/display/redirect?page=changes>

Changes:

[songzihao1990] Added unit test for killing the default executor process.

------------------------------------------
[...truncated 31.06 MB...]
I0901 07:20:19.637060  5791 credentials.hpp:37] Loading credentials for authentication from
'/tmp/Endpoint_SlaveEndpointTest_AuthorizedRequest_2_RxcHAF/http_credentials'
I0901 07:20:19.637329  5791 http.cpp:1045] Creating default 'basic' HTTP authenticator for
realm 'mesos-agent-readonly'
I0901 07:20:19.637504  5791 http.cpp:1045] Creating default 'basic' HTTP authenticator for
realm 'mesos-agent-readwrite'
I0901 07:20:19.638957  5791 slave.cpp:581] Agent resources: [{"name":"cpus","scalar":{"value":2.0},"type":"SCALAR"},{"name":"mem","scalar":{"value":1024.0},"type":"SCALAR"},{"name":"disk","scalar":{"value":1024.0},"type":"SCALAR"},{"name":"ports","ranges":{"range":[{"begin":31000,"end":32000}]},"type":"RANGES"}]
I0901 07:20:19.639200  5791 slave.cpp:589] Agent attributes: [  ]
I0901 07:20:19.639214  5791 slave.cpp:598] Agent hostname: fa1ba8b903d7
I0901 07:20:19.639400  5796 status_update_manager.cpp:177] Pausing sending status updates
I0901 07:20:19.640939  5793 state.cpp:64] Recovering state from '/tmp/Endpoint_SlaveEndpointTest_AuthorizedRequest_2_XvSIOV/meta'
I0901 07:20:19.641304  5798 status_update_manager.cpp:203] Recovering status update manager
I0901 07:20:19.641638  5804 containerizer.cpp:646] Recovering containerizer
I0901 07:20:19.643366  5801 provisioner.cpp:416] Provisioner recovery complete
I0901 07:20:19.643962  5793 slave.cpp:6296] Finished recovery
I0901 07:20:19.644552  5793 slave.cpp:6478] Querying resource estimator for oversubscribable
resources
I0901 07:20:19.644881  5797 slave.cpp:6492] Received oversubscribable resources {} from the
resource estimator
I0901 07:20:19.647929  5805 process.cpp:3956] Handling HTTP event for process 'slave(810)'
with path: '/slave(810)/containers'
I0901 07:20:19.649793  5799 http.cpp:1185] HTTP GET for /slave(810)/containers from 172.17.0.7:46340
I0901 07:20:19.649874  5799 http.cpp:976] Authorizing principal 'test-principal' to GET the
'/containers' endpoint
I0901 07:20:19.654734  5770 slave.cpp:859] Agent terminating
[       OK ] Endpoint/SlaveEndpointTest.AuthorizedRequest/2 (36 ms)
[ RUN      ] Endpoint/SlaveEndpointTest.UnauthorizedRequest/0
I0901 07:20:19.668398  5770 containerizer.cpp:290] Using isolation { environment_secret, posix/cpu,
posix/mem, filesystem/posix, network/cni }
W0901 07:20:19.668972  5770 backend.cpp:76] Failed to create 'aufs' backend: AufsBackend requires
root privileges
W0901 07:20:19.669106  5770 backend.cpp:76] Failed to create 'bind' backend: BindBackend requires
root privileges
I0901 07:20:19.669142  5770 provisioner.cpp:255] Using default backend 'copy'
I0901 07:20:19.673527  5794 slave.cpp:252] Mesos agent started on (811)@172.17.0.7:45949
I0901 07:20:19.673562  5794 slave.cpp:253] Flags at startup: --acls="" --appc_simple_discovery_uri_prefix="http://"
--appc_store_dir="/tmp/Endpoint_SlaveEndpointTest_UnauthorizedRequest_0_xKCwYC/store/appc"
--authenticate_http_readonly="true" --authenticate_http_readwrite="true" --authenticatee="crammd5"
--authentication_backoff_factor="1secs" --authorizer="local" --cgroups_cpu_enable_pids_and_tids_count="false"
--cgroups_enable_cfs="false" --cgroups_hierarchy="/sys/fs/cgroup" --cgroups_limit_swap="false"
--cgroups_root="mesos" --container_disk_watch_interval="15secs" --containerizers="mesos" --credential="/tmp/Endpoint_SlaveEndpointTest_UnauthorizedRequest_0_xKCwYC/credential"
--default_role="*" --disallow_sharing_agent_pid_namespace="false" --disk_watch_interval="1mins"
--docker="docker" --docker_kill_orphans="true" --docker_registry="https://registry-1.docker.io"
--docker_remove_delay="6hrs" --docker_socket="/var/run/docker.sock" --docker_stop_timeout="0ns"
--docker_store_dir="/tmp/Endpoint_SlaveEndpointTest_UnauthorizedRequest_0_xKCwYC/store/docker"
--docker_volume_checkpoint_dir="/var/run/mesos/isolators/docker/volume" --enforce_container_disk_quota="false"
--executor_registration_timeout="1mins" --executor_reregistration_timeout="2secs" --executor_shutdown_grace_period="5secs"
--fetcher_cache_dir="/tmp/Endpoint_SlaveEndpointTest_UnauthorizedRequest_0_xKCwYC/fetch" --fetcher_cache_size="2GB"
--frameworks_home="" --gc_delay="1weeks" --gc_disk_headroom="0.1" --hadoop_home="" --help="false"
--hostname_lookup="true" --http_command_executor="false" --http_credentials="/tmp/Endpoint_SlaveEndpointTest_UnauthorizedRequest_0_xKCwYC/http_credentials"
--http_heartbeat_interval="30secs" --initialize_driver_logging="true" --isolation="posix/cpu,posix/mem"
--launcher="posix" --launcher_dir="/mesos/mesos-1.5.0/_build/src" --logbufsecs="0" --logging_level="INFO"
--max_completed_executors_per_framework="150" --oversubscribed_resources_interval="15secs"
--perf_duration="10secs" --perf_interval="1mins" --port="5051" --qos_correction_interval_min="0ns"
--quiet="false" --recover="reconnect" --recovery_timeout="15mins" --registration_backoff_factor="10ms"
--resources="cpus:2;gpus:0;mem:1024;disk:1024;ports:[31000-32000]" --revocable_cpu_low_priority="true"
--runtime_dir="/tmp/Endpoint_SlaveEndpointTest_UnauthorizedRequest_0_xKCwYC" --sandbox_directory="/mnt/mesos/sandbox"
--strict="true" --switch_user="true" --systemd_enable_support="true" --systemd_runtime_directory="/run/systemd/system"
--version="false" --work_dir="/tmp/Endpoint_SlaveEndpointTest_UnauthorizedRequest_0_B0Bb7S"
--zk_session_timeout="10secs"
I0901 07:20:19.674046  5794 credentials.hpp:86] Loading credential for authentication from
'/tmp/Endpoint_SlaveEndpointTest_UnauthorizedRequest_0_xKCwYC/credential'
I0901 07:20:19.674252  5794 slave.cpp:285] Agent using credential for: test-principal
I0901 07:20:19.674293  5794 credentials.hpp:37] Loading credentials for authentication from
'/tmp/Endpoint_SlaveEndpointTest_UnauthorizedRequest_0_xKCwYC/http_credentials'
I0901 07:20:19.674613  5794 http.cpp:1045] Creating default 'basic' HTTP authenticator for
realm 'mesos-agent-readonly'
I0901 07:20:19.674806  5794 http.cpp:1045] Creating default 'basic' HTTP authenticator for
realm 'mesos-agent-readwrite'
I0901 07:20:19.676353  5794 slave.cpp:581] Agent resources: [{"name":"cpus","scalar":{"value":2.0},"type":"SCALAR"},{"name":"mem","scalar":{"value":1024.0},"type":"SCALAR"},{"name":"disk","scalar":{"value":1024.0},"type":"SCALAR"},{"name":"ports","ranges":{"range":[{"begin":31000,"end":32000}]},"type":"RANGES"}]
I0901 07:20:19.676595  5794 slave.cpp:589] Agent attributes: [  ]
I0901 07:20:19.676609  5794 slave.cpp:598] Agent hostname: fa1ba8b903d7
I0901 07:20:19.676796  5812 status_update_manager.cpp:177] Pausing sending status updates
I0901 07:20:19.678578  5801 state.cpp:64] Recovering state from '/tmp/Endpoint_SlaveEndpointTest_UnauthorizedRequest_0_B0Bb7S/meta'
I0901 07:20:19.678872  5793 status_update_manager.cpp:203] Recovering status update manager
I0901 07:20:19.679052  5789 containerizer.cpp:646] Recovering containerizer
I0901 07:20:19.680557  5812 provisioner.cpp:416] Provisioner recovery complete
I0901 07:20:19.680958  5803 slave.cpp:6296] Finished recovery
I0901 07:20:19.681468  5803 slave.cpp:6478] Querying resource estimator for oversubscribable
resources
I0901 07:20:19.681867  5799 slave.cpp:6492] Received oversubscribable resources {} from the
resource estimator
I0901 07:20:19.684999  5796 process.cpp:3956] Handling HTTP event for process 'slave(811)'
with path: '/slave(811)/monitor/statistics'
I0901 07:20:19.686621  5812 http.cpp:1185] HTTP GET for /slave(811)/monitor/statistics from
172.17.0.7:46342
I0901 07:20:19.686705  5812 http.cpp:976] Authorizing principal 'test-principal' to GET the
'/monitor/statistics' endpoint
I0901 07:20:19.689355  5770 slave.cpp:859] Agent terminating
[       OK ] Endpoint/SlaveEndpointTest.UnauthorizedRequest/0 (35 ms)
[ RUN      ] Endpoint/SlaveEndpointTest.UnauthorizedRequest/1
I0901 07:20:19.703313  5770 containerizer.cpp:290] Using isolation { environment_secret, posix/cpu,
posix/mem, filesystem/posix, network/cni }
W0901 07:20:19.703940  5770 backend.cpp:76] Failed to create 'aufs' backend: AufsBackend requires
root privileges
W0901 07:20:19.704074  5770 backend.cpp:76] Failed to create 'bind' backend: BindBackend requires
root privileges
I0901 07:20:19.704110  5770 provisioner.cpp:255] Using default backend 'copy'
I0901 07:20:19.708207  5807 slave.cpp:252] Mesos agent started on (812)@172.17.0.7:45949
I0901 07:20:19.708231  5807 slave.cpp:253] Flags at startup: --acls="" --appc_simple_discovery_uri_prefix="http://"
--appc_store_dir="/tmp/Endpoint_SlaveEndpointTest_UnauthorizedRequest_1_POzzHA/store/appc"
--authenticate_http_readonly="true" --authenticate_http_readwrite="true" --authenticatee="crammd5"
--authentication_backoff_factor="1secs" --authorizer="local" --cgroups_cpu_enable_pids_and_tids_count="false"
--cgroups_enable_cfs="false" --cgroups_hierarchy="/sys/fs/cgroup" --cgroups_limit_swap="false"
--cgroups_root="mesos" --container_disk_watch_interval="15secs" --containerizers="mesos" --credential="/tmp/Endpoint_SlaveEndpointTest_UnauthorizedRequest_1_POzzHA/credential"
--default_role="*" --disallow_sharing_agent_pid_namespace="false" --disk_watch_interval="1mins"
--docker="docker" --docker_kill_orphans="true" --docker_registry="https://registry-1.docker.io"
--docker_remove_delay="6hrs" --docker_socket="/var/run/docker.sock" --docker_stop_timeout="0ns"
--docker_store_dir="/tmp/Endpoint_SlaveEndpointTest_UnauthorizedRequest_1_POzzHA/store/docker"
--docker_volume_checkpoint_dir="/var/run/mesos/isolators/docker/volume" --enforce_container_disk_quota="false"
--executor_registration_timeout="1mins" --executor_reregistration_timeout="2secs" --executor_shutdown_grace_period="5secs"
--fetcher_cache_dir="/tmp/Endpoint_SlaveEndpointTest_UnauthorizedRequest_1_POzzHA/fetch" --fetcher_cache_size="2GB"
--frameworks_home="" --gc_delay="1weeks" --gc_disk_headroom="0.1" --hadoop_home="" --help="false"
--hostname_lookup="true" --http_command_executor="false" --http_credentials="/tmp/Endpoint_SlaveEndpointTest_UnauthorizedRequest_1_POzzHA/http_credentials"
--http_heartbeat_interval="30secs" --initialize_driver_logging="true" --isolation="posix/cpu,posix/mem"
--launcher="posix" --launcher_dir="/mesos/mesos-1.5.0/_build/src" --logbufsecs="0" --logging_level="INFO"
--max_completed_executors_per_framework="150" --oversubscribed_resources_interval="15secs"
--perf_duration="10secs" --perf_interval="1mins" --port="5051" --qos_correction_interval_min="0ns"
--quiet="false" --recover="reconnect" --recovery_timeout="15mins" --registration_backoff_factor="10ms"
--resources="cpus:2;gpus:0;mem:1024;disk:1024;ports:[31000-32000]" --revocable_cpu_low_priority="true"
--runtime_dir="/tmp/Endpoint_SlaveEndpointTest_UnauthorizedRequest_1_POzzHA" --sandbox_directory="/mnt/mesos/sandbox"
--strict="true" --switch_user="true" --systemd_enable_support="true" --systemd_runtime_directory="/run/systemd/system"
--version="false" --work_dir="/tmp/Endpoint_SlaveEndpointTest_UnauthorizedRequest_1_rDf0KQ"
--zk_session_timeout="10secs"
I0901 07:20:19.708686  5807 credentials.hpp:86] Loading credential for authentication from
'/tmp/Endpoint_SlaveEndpointTest_UnauthorizedRequest_1_POzzHA/credential'
I0901 07:20:19.708911  5807 slave.cpp:285] Agent using credential for: test-principal
I0901 07:20:19.708935  5807 credentials.hpp:37] Loading credentials for authentication from
'/tmp/Endpoint_SlaveEndpointTest_UnauthorizedRequest_1_POzzHA/http_credentials'
I0901 07:20:19.709228  5807 http.cpp:1045] Creating default 'basic' HTTP authenticator for
realm 'mesos-agent-readonly'
I0901 07:20:19.709436  5807 http.cpp:1045] Creating default 'basic' HTTP authenticator for
realm 'mesos-agent-readwrite'
I0901 07:20:19.710984  5807 slave.cpp:581] Agent resources: [{"name":"cpus","scalar":{"value":2.0},"type":"SCALAR"},{"name":"mem","scalar":{"value":1024.0},"type":"SCALAR"},{"name":"disk","scalar":{"value":1024.0},"type":"SCALAR"},{"name":"ports","ranges":{"range":[{"begin":31000,"end":32000}]},"type":"RANGES"}]
I0901 07:20:19.711236  5807 slave.cpp:589] Agent attributes: [  ]
I0901 07:20:19.711251  5807 slave.cpp:598] Agent hostname: fa1ba8b903d7
I0901 07:20:19.711424  5792 status_update_manager.cpp:177] Pausing sending status updates
I0901 07:20:19.713176  5803 state.cpp:64] Recovering state from '/tmp/Endpoint_SlaveEndpointTest_UnauthorizedRequest_1_rDf0KQ/meta'
I0901 07:20:19.713546  5802 status_update_manager.cpp:203] Recovering status update manager
I0901 07:20:19.713726  5799 containerizer.cpp:646] Recovering containerizer
I0901 07:20:19.715109  5793 provisioner.cpp:416] Provisioner recovery complete
I0901 07:20:19.715548  5807 slave.cpp:6296] Finished recovery
I0901 07:20:19.716101  5807 slave.cpp:6478] Querying resource estimator for oversubscribable
resources
I0901 07:20:19.716462  5811 slave.cpp:6492] Received oversubscribable resources {} from the
resource estimator
I0901 07:20:19.719420  5805 process.cpp:3956] Handling HTTP event for process 'slave(812)'
with path: '/slave(812)/monitor/statistics.json'
I0901 07:20:19.720921  5808 http.cpp:1185] HTTP GET for /slave(812)/monitor/statistics.json
from 172.17.0.7:46344
I0901 07:20:19.721002  5808 http.cpp:976] Authorizing principal 'test-principal' to GET the
'/monitor/statistics.json' endpoint
I0901 07:20:19.723708  5803 slave.cpp:859] Agent terminating
[       OK ] Endpoint/SlaveEndpointTest.UnauthorizedRequest/1 (34 ms)
[ RUN      ] Endpoint/SlaveEndpointTest.UnauthorizedRequest/2
I0901 07:20:19.738004  5770 containerizer.cpp:290] Using isolation { environment_secret, posix/cpu,
posix/mem, filesystem/posix, network/cni }
W0901 07:20:19.738596  5770 backend.cpp:76] Failed to create 'aufs' backend: AufsBackend requires
root privileges
W0901 07:20:19.738739  5770 backend.cpp:76] Failed to create 'bind' backend: BindBackend requires
root privileges
I0901 07:20:19.738775  5770 provisioner.cpp:255] Using default backend 'copy'
I0901 07:20:19.743031  5789 slave.cpp:252] Mesos agent started on (813)@172.17.0.7:45949
I0901 07:20:19.743059  5789 slave.cpp:253] Flags at startup: --acls="" --appc_simple_discovery_uri_prefix="http://"
--appc_store_dir="/tmp/Endpoint_SlaveEndpointTest_UnauthorizedRequest_2_d139Ky/store/appc"
--authenticate_http_readonly="true" --authenticate_http_readwrite="true" --authenticatee="crammd5"
--authentication_backoff_factor="1secs" --authorizer="local" --cgroups_cpu_enable_pids_and_tids_count="false"
--cgroups_enable_cfs="false" --cgroups_hierarchy="/sys/fs/cgroup" --cgroups_limit_swap="false"
--cgroups_root="mesos" --container_disk_watch_interval="15secs" --containerizers="mesos" --credential="/tmp/Endpoint_SlaveEndpointTest_UnauthorizedRequest_2_d139Ky/credential"
--default_role="*" --disallow_sharing_agent_pid_namespace="false" --disk_watch_interval="1mins"
--docker="docker" --docker_kill_orphans="true" --docker_registry="https://registry-1.docker.io"
--docker_remove_delay="6hrs" --docker_socket="/var/run/docker.sock" --docker_stop_timeout="0ns"
--docker_store_dir="/tmp/Endpoint_SlaveEndpointTest_UnauthorizedRequest_2_d139Ky/store/docker"
--docker_volume_checkpoint_dir="/var/run/mesos/isolators/docker/volume" --enforce_container_disk_quota="false"
--executor_registration_timeout="1mins" --executor_reregistration_timeout="2secs" --executor_shutdown_grace_period="5secs"
--fetcher_cache_dir="/tmp/Endpoint_SlaveEndpointTest_UnauthorizedRequest_2_d139Ky/fetch" --fetcher_cache_size="2GB"
--frameworks_home="" --gc_delay="1weeks" --gc_disk_headroom="0.1" --hadoop_home="" --help="false"
--hostname_lookup="true" --http_command_executor="false" --http_credentials="/tmp/Endpoint_SlaveEndpointTest_UnauthorizedRequest_2_d139Ky/http_credentials"
--http_heartbeat_interval="30secs" --initialize_driver_logging="true" --isolation="posix/cpu,posix/mem"
--launcher="posix" --launcher_dir="/mesos/mesos-1.5.0/_build/src" --logbufsecs="0" --logging_level="INFO"
--max_completed_executors_per_framework="150" --oversubscribed_resources_interval="15secs"
--perf_duration="10secs" --perf_interval="1mins" --port="5051" --qos_correction_interval_min="0ns"
--quiet="false" --recover="reconnect" --recovery_timeout="15mins" --registration_backoff_factor="10ms"
--resources="cpus:2;gpus:0;mem:1024;disk:1024;ports:[31000-32000]" --revocable_cpu_low_priority="true"
--runtime_dir="/tmp/Endpoint_SlaveEndpointTest_UnauthorizedRequest_2_d139Ky" --sandbox_directory="/mnt/mesos/sandbox"
--strict="true" --switch_user="true" --systemd_enable_support="true" --systemd_runtime_directory="/run/systemd/system"
--version="false" --work_dir="/tmp/Endpoint_SlaveEndpointTest_UnauthorizedRequest_2_RWjsJO"
--zk_session_timeout="10secs"
I0901 07:20:19.743561  5789 credentials.hpp:86] Loading credential for authentication from
'/tmp/Endpoint_SlaveEndpointTest_UnauthorizedRequest_2_d139Ky/credential'
I0901 07:20:19.743753  5789 slave.cpp:285] Agent using credential for: test-principal
I0901 07:20:19.743777  5789 credentials.hpp:37] Loading credentials for authentication from
'/tmp/Endpoint_SlaveEndpointTest_UnauthorizedRequest_2_d139Ky/http_credentials'
I0901 07:20:19.744082  5789 http.cpp:1045] Creating default 'basic' HTTP authenticator for
realm 'mesos-agent-readonly'
I0901 07:20:19.744316  5789 http.cpp:1045] Creating default 'basic' HTTP authenticator for
realm 'mesos-agent-readwrite'
I0901 07:20:19.745924  5789 slave.cpp:581] Agent resources: [{"name":"cpus","scalar":{"value":2.0},"type":"SCALAR"},{"name":"mem","scalar":{"value":1024.0},"type":"SCALAR"},{"name":"disk","scalar":{"value":1024.0},"type":"SCALAR"},{"name":"ports","ranges":{"range":[{"begin":31000,"end":32000}]},"type":"RANGES"}]
I0901 07:20:19.746177  5789 slave.cpp:589] Agent attributes: [  ]
I0901 07:20:19.746192  5789 slave.cpp:598] Agent hostname: fa1ba8b903d7
I0901 07:20:19.746371  5802 status_update_manager.cpp:177] Pausing sending status updates
I0901 07:20:19.748363  5798 state.cpp:64] Recovering state from '/tmp/Endpoint_SlaveEndpointTest_UnauthorizedRequest_2_RWjsJO/meta'
I0901 07:20:19.748656  5791 status_update_manager.cpp:203] Recovering status update manager
I0901 07:20:19.748903  5791 containerizer.cpp:646] Recovering containerizer
I0901 07:20:19.750514  5800 provisioner.cpp:416] Provisioner recovery complete
I0901 07:20:19.750969  5803 slave.cpp:6296] Finished recovery
I0901 07:20:19.751551  5803 slave.cpp:6478] Querying resource estimator for oversubscribable
resources
I0901 07:20:19.751828  5796 slave.cpp:6492] Received oversubscribable resources {} from the
resource estimator
I0901 07:20:19.754282  5811 process.cpp:3956] Handling HTTP event for process 'slave(813)'
with path: '/slave(813)/containers'
I0901 07:20:19.755820  5801 http.cpp:1185] HTTP GET for /slave(813)/containers from 172.17.0.7:46346
I0901 07:20:19.755950  5801 http.cpp:976] Authorizing principal 'test-principal' to GET the
'/containers' endpoint
I0901 07:20:19.758689  5770 slave.cpp:859] Agent terminating
[       OK ] Endpoint/SlaveEndpointTest.UnauthorizedRequest/2 (34 ms)
[ RUN      ] Endpoint/SlaveEndpointTest.NoAuthorizer/0
I0901 07:20:19.773479  5770 containerizer.cpp:290] Using isolation { environment_secret, posix/cpu,
posix/mem, filesystem/posix, network/cni }
W0901 07:20:19.774035  5770 backend.cpp:76] Failed to create 'aufs' backend: AufsBackend requires
root privileges
W0901 07:20:19.774166  5770 backend.cpp:76] Failed to create 'bind' backend: BindBackend requires
root privileges
I0901 07:20:19.774212  5770 provisioner.cpp:255] Using default backend 'copy'
I0901 07:20:19.776039  5770 cluster.cpp:448] Creating default 'local' authorizer
I0901 07:20:19.778398  5800 slave.cpp:252] Mesos agent started on (814)@172.17.0.7:45949
I0901 07:20:19.778431  5800 slave.cpp:253] Flags at startup: --acls="" --appc_simple_discovery_uri_prefix="http://"
--appc_store_dir="/tmp/Endpoint_SlaveEndpointTest_NoAuthorizer_0_7rUN9w/store/appc" --authenticate_http_readonly="true"
--authenticate_http_readwrite="true" --authenticatee="crammd5" --authentication_backoff_factor="1secs"
--authorizer="local" --cgroups_cpu_enable_pids_and_tids_count="false" --cgroups_enable_cfs="false"
--cgroups_hierarchy="/sys/fs/cgroup" --cgroups_limit_swap="false" --cgroups_root="mesos" --container_disk_watch_interval="15secs"
--containerizers="mesos" --credential="/tmp/Endpoint_SlaveEndpointTest_NoAuthorizer_0_7rUN9w/credential"
--default_role="*" --disallow_sharing_agent_pid_namespace="false" --disk_watch_interval="1mins"
--docker="docker" --docker_kill_orphans="true" --docker_registry="https://registry-1.docker.io"
--docker_remove_delay="6hrs" --docker_socket="/var/run/docker.sock" --docker_stop_timeout="0ns"
--docker_store_dir="/tmp/Endpoint_SlaveEndpointTest_NoAuthorizer_0_7rUN9w/store/docker" --docker_volume_checkpoint_dir="/var/run/mesos/isolators/docker/volume"
--enforce_container_disk_quota="false" --executor_registration_timeout="1mins" --executor_reregistration_timeout="2secs"
--executor_shutdown_grace_period="5secs" --fetcher_cache_dir="/tmp/Endpoint_SlaveEndpointTest_NoAuthorizer_0_7rUN9w/fetch"
--fetcher_cache_size="2GB" --frameworks_home="" --gc_delay="1weeks" --gc_disk_headroom="0.1"
--hadoop_home="" --help="false" --hostname_lookup="true" --http_command_executor="false" --http_credentials="/tmp/Endpoint_SlaveEndpointTest_NoAuthorizer_0_7rUN9w/http_credentials"
--http_heartbeat_interval="30secs" --initialize_driver_logging="true" --isolation="posix/cpu,posix/mem"
--launcher="posix" --launcher_dir="/mesos/mesos-1.5.0/_build/src" --logbufsecs="0" --logging_level="INFO"
--max_completed_executors_per_framework="150" --oversubscribed_resources_interval="15secs"
--perf_duration="10secs" --perf_interval="1mins" --port="5051" --qos_correction_interval_min="0ns"
--quiet="false" --recover="reconnect" --recovery_timeout="15mins" --registration_backoff_factor="10ms"
--resources="cpus:2;gpus:0;mem:1024;disk:1024;ports:[31000-32000]" --revocable_cpu_low_priority="true"
--runtime_dir="/tmp/Endpoint_SlaveEndpointTest_NoAuthorizer_0_7rUN9w" --sandbox_directory="/mnt/mesos/sandbox"
--strict="true" --switch_user="true" --systemd_enable_support="true" --systemd_runtime_directory="/run/systemd/system"
--version="false" --work_dir="/tmp/Endpoint_SlaveEndpointTest_NoAuthorizer_0_BpkQ2M" --zk_session_timeout="10secs"
I0901 07:20:19.779034  5800 credentials.hpp:86] Loading credential for authentication from
'/tmp/Endpoint_SlaveEndpointTest_NoAuthorizer_0_7rUN9w/credential'
I0901 07:20:19.779259  5800 slave.cpp:285] Agent using credential for: test-principal
I0901 07:20:19.779287  5800 credentials.hpp:37] Loading credentials for authentication from
'/tmp/Endpoint_SlaveEndpointTest_NoAuthorizer_0_7rUN9w/http_credentials'
I0901 07:20:19.779651  5800 http.cpp:1045] Creating default 'basic' HTTP authenticator for
realm 'mesos-agent-readonly'
I0901 07:20:19.779866  5800 http.cpp:1045] Creating default 'basic' HTTP authenticator for
realm 'mesos-agent-readwrite'
I0901 07:20:19.781536  5800 slave.cpp:581] Agent resources: [{"name":"cpus","scalar":{"value":2.0},"type":"SCALAR"},{"name":"mem","scalar":{"value":1024.0},"type":"SCALAR"},{"name":"disk","scalar":{"value":1024.0},"type":"SCALAR"},{"name":"ports","ranges":{"range":[{"begin":31000,"end":32000}]},"type":"RANGES"}]
I0901 07:20:19.781803  5800 slave.cpp:589] Agent attributes: [  ]
I0901 07:20:19.781831  5800 slave.cpp:598] Agent hostname: fa1ba8b903d7
I0901 07:20:19.782045  5807 status_update_manager.cpp:177] Pausing sending status updates
I0901 07:20:19.783468  5792 state.cpp:64] Recovering state from '/tmp/Endpoint_SlaveEndpointTest_NoAuthorizer_0_BpkQ2M/meta'
I0901 07:20:19.783927  5804 status_update_manager.cpp:203] Recovering status update manager
I0901 07:20:19.784186  5809 containerizer.cpp:646] Recovering containerizer
I0901 07:20:19.786125  5811 provisioner.cpp:416] Provisioner recovery complete
I0901 07:20:19.786607  5805 slave.cpp:6296] Finished recovery
I0901 07:20:19.787271  5805 slave.cpp:6478] Querying resource estimator for oversubscribable
resources
I0901 07:20:19.787606  5797 slave.cpp:6492] Received oversubscribable resources {} from the
resource estimator
I0901 07:20:19.790496  5789 process.cpp:3956] Handling HTTP event for process 'slave(814)'
with path: '/slave(814)/monitor/statistics'
I0901 07:20:19.791810  5811 http.cpp:1185] HTTP GET for /slave(814)/monitor/statistics from
172.17.0.7:46348
I0901 07:20:19.791914  5811 http.cpp:976] Authorizing principal 'test-principal' to GET the
'/monitor/statistics' endpoint
I0901 07:20:19.795892  5809 slave.cpp:859] Agent terminating
[       OK ] Endpoint/SlaveEndpointTest.NoAuthorizer/0 (36 ms)
[ RUN      ] Endpoint/SlaveEndpointTest.NoAuthorizer/1
I0901 07:20:19.809329  5770 containerizer.cpp:290] Using isolation { environment_secret, posix/cpu,
posix/mem, filesystem/posix, network/cni }
W0901 07:20:19.809850  5770 backend.cpp:76] Failed to create 'aufs' backend: AufsBackend requires
root privileges
W0901 07:20:19.809969  5770 backend.cpp:76] Failed to create 'bind' backend: BindBackend requires
root privileges
I0901 07:20:19.810001  5770 provisioner.cpp:255] Using default backend 'copy'
I0901 07:20:19.811753  5770 cluster.cpp:448] Creating default 'local' authorizer
I0901 07:20:19.813839  5790 slave.cpp:252] Mesos agent started on (815)@172.17.0.7:45949
I0901 07:20:19.813870  5790 slave.cpp:253] Flags at startup: --acls="" --appc_simple_discovery_uri_prefix="http://"
--appc_store_dir="/tmp/Endpoint_SlaveEndpointTest_NoAuthorizer_1_P1gSTv/store/appc" --authenticate_http_readonly="true"
--authenticate_http_readwrite="true" --authenticatee="crammd5" --authentication_backoff_factor="1secs"
--authorizer="local" --cgroups_cpu_enable_pids_and_tids_count="false" --cgroups_enable_cfs="false"
--cgroups_hierarchy="/sys/fs/cgroup" --cgroups_limit_swap="false" --cgroups_root="mesos" --container_disk_watch_interval="15secs"
--containerizers="mesos" --credential="/tmp/Endpoint_SlaveEndpointTest_NoAuthorizer_1_P1gSTv/credential"
--default_role="*" --disallow_sharing_agent_pid_namespace="false" --disk_watch_interval="1mins"
--docker="docker" --docker_kill_orphans="true" --docker_registry="https://registry-1.docker.io"
--docker_remove_delay="6hrs" --docker_socket="/var/run/docker.sock" --docker_stop_timeout="0ns"
--docker_store_dir="/tmp/Endpoint_SlaveEndpointTest_NoAuthorizer_1_P1gSTv/store/docker" --docker_volume_checkpoint_dir="/var/run/mesos/isolators/docker/volume"
--enforce_container_disk_quota="false" --executor_registration_timeout="1mins" --executor_reregistration_timeout="2secs"
--executor_shutdown_grace_period="5secs" --fetcher_cache_dir="/tmp/Endpoint_SlaveEndpointTest_NoAuthorizer_1_P1gSTv/fetch"
--fetcher_cache_size="2GB" --frameworks_home="" --gc_delay="1weeks" --gc_disk_headroom="0.1"
--hadoop_home="" --help="false" --hostname_lookup="true" --http_command_executor="false" --http_credentials="/tmp/Endpoint_SlaveEndpointTest_NoAuthorizer_1_P1gSTv/http_credentials"
--http_heartbeat_interval="30secs" --initialize_driver_logging="true" --isolation="posix/cpu,posix/mem"
--launcher="posix" --launcher_dir="/mesos/mesos-1.5.0/_build/src" --logbufsecs="0" --logging_level="INFO"
--max_completed_executors_per_framework="150" --oversubscribed_resources_interval="15secs"
--perf_duration="10secs" --perf_interval="1mins" --port="5051" --qos_correction_interval_min="0ns"
--quiet="false" --recover="reconnect" --recovery_timeout="15mins" --registration_backoff_factor="10ms"
--resources="cpus:2;gpus:0;mem:1024;disk:1024;ports:[31000-32000]" --revocable_cpu_low_priority="true"
--runtime_dir="/tmp/Endpoint_SlaveEndpointTest_NoAuthorizer_1_P1gSTv" --sandbox_directory="/mnt/mesos/sandbox"
--strict="true" --switch_user="true" --systemd_enable_support="true" --systemd_runtime_directory="/run/systemd/system"
--version="false" --work_dir="/tmp/Endpoint_SlaveEndpointTest_NoAuthorizer_1_zMwyHL" --zk_session_timeout="10secs"
I0901 07:20:19.814262  5790 credentials.hpp:86] Loading credential for authentication from
'/tmp/Endpoint_SlaveEndpointTest_NoAuthorizer_1_P1gSTv/credential'
I0901 07:20:19.814422  5790 slave.cpp:285] Agent using credential for: test-principal
I0901 07:20:19.814447  5790 credentials.hpp:37] Loading credentials for authentication from
'/tmp/Endpoint_SlaveEndpointTest_NoAuthorizer_1_P1gSTv/http_credentials'
I0901 07:20:19.814716  5790 http.cpp:1045] Creating default 'basic' HTTP authenticator for
realm 'mesos-agent-readonly'
I0901 07:20:19.814884  5790 http.cpp:1045] Creating default 'basic' HTTP authenticator for
realm 'mesos-agent-readwrite'
I0901 07:20:19.816318  5790 slave.cpp:581] Agent resources: [{"name":"cpus","scalar":{"value":2.0},"type":"SCALAR"},{"name":"mem","scalar":{"value":1024.0},"type":"SCALAR"},{"name":"disk","scalar":{"value":1024.0},"type":"SCALAR"},{"name":"ports","ranges":{"range":[{"begin":31000,"end":32000}]},"type":"RANGES"}]
I0901 07:20:19.816563  5790 slave.cpp:589] Agent attributes: [  ]
I0901 07:20:19.816591  5790 slave.cpp:598] Agent hostname: fa1ba8b903d7
I0901 07:20:19.816743  5806 status_update_manager.cpp:177] Pausing sending status updates
I0901 07:20:19.818195  5797 state.cpp:64] Recovering state from '/tmp/Endpoint_SlaveEndpointTest_NoAuthorizer_1_zMwyHL/meta'
I0901 07:20:19.818686  5794 status_update_manager.cpp:203] Recovering status update manager
I0901 07:20:19.818958  5807 containerizer.cpp:646] Recovering containerizer
I0901 07:20:19.820534  5798 provisioner.cpp:416] Provisioner recovery complete
I0901 07:20:19.820960  5809 slave.cpp:6296] Finished recovery
I0901 07:20:19.821564  5809 slave.cpp:6478] Querying resource estimator for oversubscribable
resources
I0901 07:20:19.821820  5789 slave.cpp:6492] Received oversubscribable resources {} from the
resource estimator
I0901 07:20:19.824061  5796 process.cpp:3956] Handling HTTP event for process 'slave(815)'
with path: '/slave(815)/monitor/statistics.json'
I0901 07:20:19.825703  5790 http.cpp:1185] HTTP GET for /slave(815)/monitor/statistics.json
from 172.17.0.7:46350
I0901 07:20:19.825793  5790 http.cpp:976] Authorizing principal 'test-principal' to GET the
'/monitor/statistics.json' endpoint
I0901 07:20:19.829489  5770 slave.cpp:859] Agent terminating
[       OK ] Endpoint/SlaveEndpointTest.NoAuthorizer/1 (33 ms)
[ RUN      ] Endpoint/SlaveEndpointTest.NoAuthorizer/2
I0901 07:20:19.842912  5770 containerizer.cpp:290] Using isolation { environment_secret, posix/cpu,
posix/mem, filesystem/posix, network/cni }
W0901 07:20:19.843457  5770 backend.cpp:76] Failed to create 'aufs' backend: AufsBackend requires
root privileges
W0901 07:20:19.843583  5770 backend.cpp:76] Failed to create 'bind' backend: BindBackend requires
root privileges
I0901 07:20:19.843617  5770 provisioner.cpp:255] Using default backend 'copy'
I0901 07:20:19.845525  5770 cluster.cpp:448] Creating default 'local' authorizer
I0901 07:20:19.847764  5806 slave.cpp:252] Mesos agent started on (816)@172.17.0.7:45949
I0901 07:20:19.847800  5806 slave.cpp:253] Flags at startup: --acls="" --appc_simple_discovery_uri_prefix="http://"
--appc_store_dir="/tmp/Endpoint_SlaveEndpointTest_NoAuthorizer_2_Nhr0Xu/store/appc" --authenticate_http_readonly="true"
--authenticate_http_readwrite="true" --authenticatee="crammd5" --authentication_backoff_factor="1secs"
--authorizer="local" --cgroups_cpu_enable_pids_and_tids_count="false" --cgroups_enable_cfs="false"
--cgroups_hierarchy="/sys/fs/cgroup" --cgroups_limit_swap="false" --cgroups_root="mesos" --container_disk_watch_interval="15secs"
--containerizers="mesos" --credential="/tmp/Endpoint_SlaveEndpointTest_NoAuthorizer_2_Nhr0Xu/credential"
--default_role="*" --disallow_sharing_agent_pid_namespace="false" --disk_watch_interval="1mins"
--docker="docker" --docker_kill_orphans="true" --docker_registry="https://registry-1.docker.io"
--docker_remove_delay="6hrs" --docker_socket="/var/run/docker.sock" --docker_stop_timeout="0ns"
--docker_store_dir="/tmp/Endpoint_SlaveEndpointTest_NoAuthorizer_2_Nhr0Xu/store/docker" --docker_volume_checkpoint_dir="/var/run/mesos/isolators/docker/volume"
--enforce_container_disk_quota="false" --executor_registration_timeout="1mins" --executor_reregistration_timeout="2secs"
--executor_shutdown_grace_period="5secs" --fetcher_cache_dir="/tmp/Endpoint_SlaveEndpointTest_NoAuthorizer_2_Nhr0Xu/fetch"
--fetcher_cache_size="2GB" --frameworks_home="" --gc_delay="1weeks" --gc_disk_headroom="0.1"
--hadoop_home="" --help="false" --hostname_lookup="true" --http_command_executor="false" --http_credentials="/tmp/Endpoint_SlaveEndpointTest_NoAuthorizer_2_Nhr0Xu/http_credentials"
--http_heartbeat_interval="30secs" --initialize_driver_logging="true" --isolation="posix/cpu,posix/mem"
--launcher="posix" --launcher_dir="/mesos/mesos-1.5.0/_build/src" --logbufsecs="0" --logging_level="INFO"
--max_completed_executors_per_framework="150" --oversubscribed_resources_interval="15secs"
--perf_duration="10secs" --perf_interval="1mins" --port="5051" --qos_correction_interval_min="0ns"
--quiet="false" --recover="reconnect" --recovery_timeout="15mins" --registration_backoff_factor="10ms"
--resources="cpus:2;gpus:0;mem:1024;disk:1024;ports:[31000-32000]" --revocable_cpu_low_priority="true"
--runtime_dir="/tmp/Endpoint_SlaveEndpointTest_NoAuthorizer_2_Nhr0Xu" --sandbox_directory="/mnt/mesos/sandbox"
--strict="true" --switch_user="true" --systemd_enable_support="true" --systemd_runtime_directory="/run/systemd/system"
--version="false" --work_dir="/tmp/Endpoint_SlaveEndpointTest_NoAuthorizer_2_fu6GGK" --zk_session_timeout="10secs"
I0901 07:20:19.848299  5806 credentials.hpp:86] Loading credential for authentication from
'/tmp/Endpoint_SlaveEndpointTest_NoAuthorizer_2_Nhr0Xu/credential'
I0901 07:20:19.848534  5806 slave.cpp:285] Agent using credential for: test-principal
I0901 07:20:19.848562  5806 credentials.hpp:37] Loading credentials for authentication from
'/tmp/Endpoint_SlaveEndpointTest_NoAuthorizer_2_Nhr0Xu/http_credentials'
I0901 07:20:19.848872  5806 http.cpp:1045] Creating default 'basic' HTTP authenticator for
realm 'mesos-agent-readonly'
I0901 07:20:19.849094  5806 http.cpp:1045] Creating default 'basic' HTTP authenticator for
realm 'mesos-agent-readwrite'
I0901 07:20:19.850698  5806 slave.cpp:581] Agent resources: [{"name":"cpus","scalar":{"value":2.0},"type":"SCALAR"},{"name":"mem","scalar":{"value":1024.0},"type":"SCALAR"},{"name":"disk","scalar":{"value":1024.0},"type":"SCALAR"},{"name":"ports","ranges":{"range":[{"begin":31000,"end":32000}]},"type":"RANGES"}]
I0901 07:20:19.850965  5806 slave.cpp:589] Agent attributes: [  ]
I0901 07:20:19.850988  5806 slave.cpp:598] Agent hostname: fa1ba8b903d7
I0901 07:20:19.851177  5805 status_update_manager.cpp:177] Pausing sending status updates
I0901 07:20:19.853127  5803 state.cpp:64] Recovering state from '/tmp/Endpoint_SlaveEndpointTest_NoAuthorizer_2_fu6GGK/meta'
I0901 07:20:19.853483  5803 status_update_manager.cpp:203] Recovering status update manager
I0901 07:20:19.853670  5798 containerizer.cpp:646] Recovering containerizer
I0901 07:20:19.855259  5807 provisioner.cpp:416] Provisioner recovery complete
I0901 07:20:19.855684  5795 slave.cpp:6296] Finished recovery
I0901 07:20:19.856334  5795 slave.cpp:6478] Querying resource estimator for oversubscribable
resources
I0901 07:20:19.856624  5809 slave.cpp:6492] Received oversubscribable resources {} from the
resource estimator
I0901 07:20:19.858935  5790 process.cpp:3956] Handling HTTP event for process 'slave(816)'
with path: '/slave(816)/containers'
I0901 07:20:19.860525  5806 http.cpp:1185] HTTP GET for /slave(816)/containers from 172.17.0.7:46352
I0901 07:20:19.860622  5806 http.cpp:976] Authorizing principal 'test-principal' to GET the
'/containers' endpoint
I0901 07:20:19.865090  5770 slave.cpp:859] Agent terminating
[       OK ] Endpoint/SlaveEndpointTest.NoAuthorizer/2 (34 ms)
[----------] 9 tests from Endpoint/SlaveEndpointTest (318 ms total)

[----------] 2 tests from ContainerizerType/DefaultContainerDNSFlagTest
[ RUN      ] ContainerizerType/DefaultContainerDNSFlagTest.ValidateFlag/0
[       OK ] ContainerizerType/DefaultContainerDNSFlagTest.ValidateFlag/0 (11 ms)
[ RUN      ] ContainerizerType/DefaultContainerDNSFlagTest.ValidateFlag/1
[       OK ] ContainerizerType/DefaultContainerDNSFlagTest.ValidateFlag/1 (9 ms)
[----------] 2 tests from ContainerizerType/DefaultContainerDNSFlagTest (20 ms total)

[----------] Global test environment tear-down
[==========] 1667 tests from 183 test cases ran. (603681 ms total)
[  PASSED  ] 1662 tests.
[  FAILED  ] 5 tests, listed below:
[  FAILED  ] DefaultExecutorCheckTest.CommandCheckDeliveredAndReconciled
[  FAILED  ] DefaultExecutorCheckTest.CommandCheckStatusChange
[  FAILED  ] DefaultExecutorCheckTest.CommandCheckSeesParentsEnv
[  FAILED  ] DefaultExecutorCheckTest.CommandCheckSharesWorkDirWithTask
[  FAILED  ] ExamplesTest.PersistentVolumeFramework

 5 FAILED TESTS
  YOU HAVE 20 DISABLED TESTS

I0901 07:20:19.951584  5813 process.cpp:1072] Failed to accept socket: future discarded
make[4]: *** [check-local] Error 1
make[4]: Leaving directory `/mesos/mesos-1.5.0/_build/src'
make[3]: *** [check-am] Error 2
make[3]: Leaving directory `/mesos/mesos-1.5.0/_build/src'
make[2]: *** [check] Error 2
make[2]: Leaving directory `/mesos/mesos-1.5.0/_build/src'
make[1]: *** [check-recursive] Error 1
make[1]: Leaving directory `/mesos/mesos-1.5.0/_build'
make: *** [distcheck] Error 1
+ docker rmi mesos-1504247222-28259
Untagged: mesos-1504247222-28259:latest
Deleted: sha256:953fc749fdceba6b900b2b283210ab10b455885f5ca1542e3c5fc6324e5cec82
Deleted: sha256:b330e922317056c67b17d6aef4911cd4db7c7766c2bb60aecba1190e144205b1
Deleted: sha256:105dad86088c4ebd66bd35585d4b4b66c383015a8b00c93397a8d14a9a953d74
Deleted: sha256:f5afa2d7b323392035d7002d966160189d16a913a1b6b1aa3f74995368d9b944
Deleted: sha256:3da9d995c7151d3728fd6426369872f8542040dcc6e3b17721b5ad9e8f936e59
Deleted: sha256:c333bceae236f8e81f90073f17eb1be2e743492ff2338883359f4d4e14d610c2
Deleted: sha256:4a75d3f1ff08aa6698415ed53eb1017bca1e254810cbb3fd5ef79904ffe3adbd
Deleted: sha256:82d833b83c4ddfd7ebf2789f03320a63db057dbd2a1a32de17ca73e0777e3ac6
Deleted: sha256:2b69083aaab16f86e72a9ebb3c1a553b8ca2bee6a5d4c5690dd482c6eb62c679
Deleted: sha256:df4df0c1b9ad5a58e475bf8129eb02904783907b6aff2bf75600ddc51380ce65
Deleted: sha256:f0220b93299bf15b412269b5468a147b9a593e2798526bd1ca28c65372b57cf7
Deleted: sha256:34e824eb3a11f47ca7edfde6193b824456da86213b7cc8a2dacd92bd0fb4f4ec
Deleted: sha256:e42949ce9e5a8e52228d97e8b225b076673f40667ff4e0abd90b1eb546e7c5c3
Deleted: sha256:fef15c1a24d085882f42ced45dc56147fef0f75a2ff6187da5d527eb2e5d2731
Deleted: sha256:f96140dfa5147aea7f444fe8f9cd97aa919b8dac37d672408904aa0e14742f0e
Deleted: sha256:766dbb33777bad0cfeaf2914dfb1b62b08438e21201d1953f018d1ed58163442
Deleted: sha256:4005e475070c95ee121df5d2322a09bb86a93dd72512f2586c3e151e9985fb41
Deleted: sha256:050bbb2ec098ccf08442a0cea6975dd66f1c6aa677c74b36879eb10e1f9b269b
Deleted: sha256:0e318abc047b4f995eae1b4a719c8b598080222f12dd7685a677f879acd42d79
Deleted: sha256:4c6394310388339c8750b9ce0ab0138284a6d09a8c0c6139111cbcec6a8f1185
Deleted: sha256:7072281045bc5d06f53a89ab761e3e019b79a5ca9025a2a92d555f66ceec3187
Deleted: sha256:47d1b7bc8b8aba98b82408df79567cfdaec10b918cbc80ce6c4e118a7c483940
Deleted: sha256:05bb7a08be4369e9f0a45d86ea3fe5a39b34fbab3a0c3d0849faab1e3dcba31a
Deleted: sha256:ca342aaa6e7c9a34763850cafafc7f317eb99cadeb0037245d8e337e76bdbe81
Build step 'Execute shell' marked build as failure

Mime
View raw message