mesos-builds mailing list archives

Site index · List index
Message view « Date » · « Thread »
Top « Date » · « Thread »
From Apache Jenkins Server <jenk...@builds.apache.org>
Subject Build failed in Jenkins: Mesos-Buildbot » autotools,clang,--verbose --enable-libevent --enable-ssl,GLOG_v=1 MESOS_VERBOSE=1,ubuntu:14.04,(ubuntu)&&(!ubuntu-us1)&&(!ubuntu-eu2)&&(!qnode3)&&(!H23) #4252
Date Fri, 22 Sep 2017 00:44:16 GMT
See <https://builds.apache.org/job/Mesos-Buildbot/BUILDTOOL=autotools,COMPILER=clang,CONFIGURATION=--verbose%20--enable-libevent%20--enable-ssl,ENVIRONMENT=GLOG_v=1%20MESOS_VERBOSE=1,OS=ubuntu%3A14.04,label_exp=(ubuntu)&&(!ubuntu-us1)&&(!ubuntu-eu2)&&(!qnode3)&&(!H23)/4252/display/redirect?page=changes>

Changes:

[bmahler] Display task state counters in the framework page.

------------------------------------------
[...truncated 33.15 MB...]
I0922 00:44:04.006033 25292 slave.cpp:254] Mesos agent started on (818)@172.17.0.2:42130
I0922 00:44:04.006070 25292 slave.cpp:255] Flags at startup: --acls="" --appc_simple_discovery_uri_prefix="http://"
--appc_store_dir="/tmp/Endpoint_SlaveEndpointTest_UnauthorizedRequest_0_IS11uX/store/appc"
--authenticate_http_executors="true" --authenticate_http_readonly="true" --authenticate_http_readwrite="true"
--authenticatee="crammd5" --authentication_backoff_factor="1secs" --authorizer="local" --cgroups_cpu_enable_pids_and_tids_count="false"
--cgroups_enable_cfs="false" --cgroups_hierarchy="/sys/fs/cgroup" --cgroups_limit_swap="false"
--cgroups_root="mesos" --container_disk_watch_interval="15secs" --containerizers="mesos" --credential="/tmp/Endpoint_SlaveEndpointTest_UnauthorizedRequest_0_IS11uX/credential"
--default_role="*" --disallow_sharing_agent_pid_namespace="false" --disk_watch_interval="1mins"
--docker="docker" --docker_kill_orphans="true" --docker_registry="https://registry-1.docker.io"
--docker_remove_delay="6hrs" --docker_socket="/var/run/docker.sock" --docker_stop_timeout="0ns"
--docker_store_dir="/tmp/Endpoint_SlaveEndpointTest_UnauthorizedRequest_0_IS11uX/store/docker"
--docker_volume_checkpoint_dir="/var/run/mesos/isolators/docker/volume" --enforce_container_disk_quota="false"
--executor_registration_timeout="1mins" --executor_reregistration_timeout="2secs" --executor_secret_key="/tmp/Endpoint_SlaveEndpointTest_UnauthorizedRequest_0_IS11uX/executor_secret_key"
--executor_shutdown_grace_period="5secs" --fetcher_cache_dir="/tmp/Endpoint_SlaveEndpointTest_UnauthorizedRequest_0_IS11uX/fetch"
--fetcher_cache_size="2GB" --frameworks_home="" --gc_delay="1weeks" --gc_disk_headroom="0.1"
--hadoop_home="" --help="false" --hostname_lookup="true" --http_command_executor="false" --http_credentials="/tmp/Endpoint_SlaveEndpointTest_UnauthorizedRequest_0_IS11uX/http_credentials"
--http_heartbeat_interval="30secs" --initialize_driver_logging="true" --isolation="posix/cpu,posix/mem"
--launcher="posix" --launcher_dir="/mesos/mesos-1.5.0/_build/src" --logbufsecs="0" --logging_level="INFO"
--max_completed_executors_per_framework="150" --oversubscribed_resources_interval="15secs"
--perf_duration="10secs" --perf_interval="1mins" --port="5051" --qos_correction_interval_min="0ns"
--quiet="false" --recover="reconnect" --recovery_timeout="15mins" --registration_backoff_factor="10ms"
--resources="cpus:2;gpus:0;mem:1024;disk:1024;ports:[31000-32000]" --revocable_cpu_low_priority="true"
--runtime_dir="/tmp/Endpoint_SlaveEndpointTest_UnauthorizedRequest_0_IS11uX" --sandbox_directory="/mnt/mesos/sandbox"
--strict="true" --switch_user="true" --systemd_enable_support="true" --systemd_runtime_directory="/run/systemd/system"
--version="false" --work_dir="/tmp/Endpoint_SlaveEndpointTest_UnauthorizedRequest_0_GNZiJg"
--zk_session_timeout="10secs"
I0922 00:44:04.006561 25292 credentials.hpp:86] Loading credential for authentication from
'/tmp/Endpoint_SlaveEndpointTest_UnauthorizedRequest_0_IS11uX/credential'
I0922 00:44:04.006734 25292 slave.cpp:287] Agent using credential for: test-principal
I0922 00:44:04.006763 25292 credentials.hpp:37] Loading credentials for authentication from
'/tmp/Endpoint_SlaveEndpointTest_UnauthorizedRequest_0_IS11uX/http_credentials'
I0922 00:44:04.007119 25292 http.cpp:1045] Creating default 'basic' HTTP authenticator for
realm 'mesos-agent-executor'
I0922 00:44:04.007269 25292 http.cpp:1066] Creating default 'jwt' HTTP authenticator for realm
'mesos-agent-executor'
I0922 00:44:04.007529 25292 http.cpp:1045] Creating default 'basic' HTTP authenticator for
realm 'mesos-agent-readonly'
I0922 00:44:04.007666 25292 http.cpp:1066] Creating default 'jwt' HTTP authenticator for realm
'mesos-agent-readonly'
I0922 00:44:04.007874 25292 http.cpp:1045] Creating default 'basic' HTTP authenticator for
realm 'mesos-agent-readwrite'
I0922 00:44:04.007982 25292 http.cpp:1066] Creating default 'jwt' HTTP authenticator for realm
'mesos-agent-readwrite'
I0922 00:44:04.009289 25292 slave.cpp:585] Agent resources: [{"name":"cpus","scalar":{"value":2.0},"type":"SCALAR"},{"name":"mem","scalar":{"value":1024.0},"type":"SCALAR"},{"name":"disk","scalar":{"value":1024.0},"type":"SCALAR"},{"name":"ports","ranges":{"range":[{"begin":31000,"end":32000}]},"type":"RANGES"}]
I0922 00:44:04.009493 25292 slave.cpp:593] Agent attributes: [  ]
I0922 00:44:04.009547 25292 slave.cpp:602] Agent hostname: c666d2394154
I0922 00:44:04.009706 25290 status_update_manager.cpp:177] Pausing sending status updates
I0922 00:44:04.011180 25285 state.cpp:64] Recovering state from '/tmp/Endpoint_SlaveEndpointTest_UnauthorizedRequest_0_GNZiJg/meta'
I0922 00:44:04.011489 25294 status_update_manager.cpp:203] Recovering status update manager
I0922 00:44:04.011759 25295 containerizer.cpp:648] Recovering containerizer
I0922 00:44:04.013283 25298 provisioner.cpp:416] Provisioner recovery complete
I0922 00:44:04.013710 25285 slave.cpp:6322] Finished recovery
I0922 00:44:04.014206 25285 slave.cpp:6504] Querying resource estimator for oversubscribable
resources
I0922 00:44:04.014485 25291 slave.cpp:6518] Received oversubscribable resources {} from the
resource estimator
I0922 00:44:04.016810 25289 process.cpp:3929] Handling HTTP event for process 'slave(818)'
with path: '/slave(818)/monitor/statistics'
I0922 00:44:04.018654 25290 http.cpp:1185] HTTP GET for /slave(818)/monitor/statistics from
172.17.0.2:49906
I0922 00:44:04.018754 25290 http.cpp:976] Authorizing principal 'test-principal' to GET the
'/monitor/statistics' endpoint
I0922 00:44:04.021237  6076 slave.cpp:869] Agent terminating
[       OK ] Endpoint/SlaveEndpointTest.UnauthorizedRequest/0 (32 ms)
[ RUN      ] Endpoint/SlaveEndpointTest.UnauthorizedRequest/1
I0922 00:44:04.034868  6076 containerizer.cpp:292] Using isolation { environment_secret, posix/cpu,
posix/mem, filesystem/posix, network/cni }
W0922 00:44:04.035459  6076 backend.cpp:76] Failed to create 'aufs' backend: AufsBackend requires
root privileges
W0922 00:44:04.035591  6076 backend.cpp:76] Failed to create 'bind' backend: BindBackend requires
root privileges
I0922 00:44:04.035634  6076 provisioner.cpp:255] Using default backend 'copy'
I0922 00:44:04.039175 25292 slave.cpp:254] Mesos agent started on (819)@172.17.0.2:42130
I0922 00:44:04.039214 25292 slave.cpp:255] Flags at startup: --acls="" --appc_simple_discovery_uri_prefix="http://"
--appc_store_dir="/tmp/Endpoint_SlaveEndpointTest_UnauthorizedRequest_1_UlzKRI/store/appc"
--authenticate_http_executors="true" --authenticate_http_readonly="true" --authenticate_http_readwrite="true"
--authenticatee="crammd5" --authentication_backoff_factor="1secs" --authorizer="local" --cgroups_cpu_enable_pids_and_tids_count="false"
--cgroups_enable_cfs="false" --cgroups_hierarchy="/sys/fs/cgroup" --cgroups_limit_swap="false"
--cgroups_root="mesos" --container_disk_watch_interval="15secs" --containerizers="mesos" --credential="/tmp/Endpoint_SlaveEndpointTest_UnauthorizedRequest_1_UlzKRI/credential"
--default_role="*" --disallow_sharing_agent_pid_namespace="false" --disk_watch_interval="1mins"
--docker="docker" --docker_kill_orphans="true" --docker_registry="https://registry-1.docker.io"
--docker_remove_delay="6hrs" --docker_socket="/var/run/docker.sock" --docker_stop_timeout="0ns"
--docker_store_dir="/tmp/Endpoint_SlaveEndpointTest_UnauthorizedRequest_1_UlzKRI/store/docker"
--docker_volume_checkpoint_dir="/var/run/mesos/isolators/docker/volume" --enforce_container_disk_quota="false"
--executor_registration_timeout="1mins" --executor_reregistration_timeout="2secs" --executor_secret_key="/tmp/Endpoint_SlaveEndpointTest_UnauthorizedRequest_1_UlzKRI/executor_secret_key"
--executor_shutdown_grace_period="5secs" --fetcher_cache_dir="/tmp/Endpoint_SlaveEndpointTest_UnauthorizedRequest_1_UlzKRI/fetch"
--fetcher_cache_size="2GB" --frameworks_home="" --gc_delay="1weeks" --gc_disk_headroom="0.1"
--hadoop_home="" --help="false" --hostname_lookup="true" --http_command_executor="false" --http_credentials="/tmp/Endpoint_SlaveEndpointTest_UnauthorizedRequest_1_UlzKRI/http_credentials"
--http_heartbeat_interval="30secs" --initialize_driver_logging="true" --isolation="posix/cpu,posix/mem"
--launcher="posix" --launcher_dir="/mesos/mesos-1.5.0/_build/src" --logbufsecs="0" --logging_level="INFO"
--max_completed_executors_per_framework="150" --oversubscribed_resources_interval="15secs"
--perf_duration="10secs" --perf_interval="1mins" --port="5051" --qos_correction_interval_min="0ns"
--quiet="false" --recover="reconnect" --recovery_timeout="15mins" --registration_backoff_factor="10ms"
--resources="cpus:2;gpus:0;mem:1024;disk:1024;ports:[31000-32000]" --revocable_cpu_low_priority="true"
--runtime_dir="/tmp/Endpoint_SlaveEndpointTest_UnauthorizedRequest_1_UlzKRI" --sandbox_directory="/mnt/mesos/sandbox"
--strict="true" --switch_user="true" --systemd_enable_support="true" --systemd_runtime_directory="/run/systemd/system"
--version="false" --work_dir="/tmp/Endpoint_SlaveEndpointTest_UnauthorizedRequest_1_CRKK01"
--zk_session_timeout="10secs"
I0922 00:44:04.039625 25292 credentials.hpp:86] Loading credential for authentication from
'/tmp/Endpoint_SlaveEndpointTest_UnauthorizedRequest_1_UlzKRI/credential'
I0922 00:44:04.039752 25292 slave.cpp:287] Agent using credential for: test-principal
I0922 00:44:04.039773 25292 credentials.hpp:37] Loading credentials for authentication from
'/tmp/Endpoint_SlaveEndpointTest_UnauthorizedRequest_1_UlzKRI/http_credentials'
I0922 00:44:04.040010 25292 http.cpp:1045] Creating default 'basic' HTTP authenticator for
realm 'mesos-agent-executor'
I0922 00:44:04.040117 25292 http.cpp:1066] Creating default 'jwt' HTTP authenticator for realm
'mesos-agent-executor'
I0922 00:44:04.040360 25292 http.cpp:1045] Creating default 'basic' HTTP authenticator for
realm 'mesos-agent-readonly'
I0922 00:44:04.040498 25292 http.cpp:1066] Creating default 'jwt' HTTP authenticator for realm
'mesos-agent-readonly'
I0922 00:44:04.040742 25292 http.cpp:1045] Creating default 'basic' HTTP authenticator for
realm 'mesos-agent-readwrite'
I0922 00:44:04.040882 25292 http.cpp:1066] Creating default 'jwt' HTTP authenticator for realm
'mesos-agent-readwrite'
I0922 00:44:04.042620 25292 slave.cpp:585] Agent resources: [{"name":"cpus","scalar":{"value":2.0},"type":"SCALAR"},{"name":"mem","scalar":{"value":1024.0},"type":"SCALAR"},{"name":"disk","scalar":{"value":1024.0},"type":"SCALAR"},{"name":"ports","ranges":{"range":[{"begin":31000,"end":32000}]},"type":"RANGES"}]
I0922 00:44:04.042898 25292 slave.cpp:593] Agent attributes: [  ]
I0922 00:44:04.042927 25292 slave.cpp:602] Agent hostname: c666d2394154
I0922 00:44:04.043081 25287 status_update_manager.cpp:177] Pausing sending status updates
I0922 00:44:04.044551 25286 state.cpp:64] Recovering state from '/tmp/Endpoint_SlaveEndpointTest_UnauthorizedRequest_1_CRKK01/meta'
I0922 00:44:04.044909 25286 status_update_manager.cpp:203] Recovering status update manager
I0922 00:44:04.045135 25288 containerizer.cpp:648] Recovering containerizer
I0922 00:44:04.046813 25289 provisioner.cpp:416] Provisioner recovery complete
I0922 00:44:04.047334 25286 slave.cpp:6322] Finished recovery
I0922 00:44:04.047870 25286 slave.cpp:6504] Querying resource estimator for oversubscribable
resources
I0922 00:44:04.048135 25287 slave.cpp:6518] Received oversubscribable resources {} from the
resource estimator
I0922 00:44:04.050209 25295 process.cpp:3929] Handling HTTP event for process 'slave(819)'
with path: '/slave(819)/monitor/statistics.json'
I0922 00:44:04.052292 25296 http.cpp:1185] HTTP GET for /slave(819)/monitor/statistics.json
from 172.17.0.2:49907
I0922 00:44:04.052381 25296 http.cpp:976] Authorizing principal 'test-principal' to GET the
'/monitor/statistics.json' endpoint
I0922 00:44:04.054548 25292 slave.cpp:869] Agent terminating
[       OK ] Endpoint/SlaveEndpointTest.UnauthorizedRequest/1 (33 ms)
[ RUN      ] Endpoint/SlaveEndpointTest.UnauthorizedRequest/2
I0922 00:44:04.068112  6076 containerizer.cpp:292] Using isolation { environment_secret, posix/cpu,
posix/mem, filesystem/posix, network/cni }
W0922 00:44:04.068711  6076 backend.cpp:76] Failed to create 'aufs' backend: AufsBackend requires
root privileges
W0922 00:44:04.068856  6076 backend.cpp:76] Failed to create 'bind' backend: BindBackend requires
root privileges
I0922 00:44:04.068907  6076 provisioner.cpp:255] Using default backend 'copy'
I0922 00:44:04.072039 25286 slave.cpp:254] Mesos agent started on (820)@172.17.0.2:42130
I0922 00:44:04.072079 25286 slave.cpp:255] Flags at startup: --acls="" --appc_simple_discovery_uri_prefix="http://"
--appc_store_dir="/tmp/Endpoint_SlaveEndpointTest_UnauthorizedRequest_2_QsG9zu/store/appc"
--authenticate_http_executors="true" --authenticate_http_readonly="true" --authenticate_http_readwrite="true"
--authenticatee="crammd5" --authentication_backoff_factor="1secs" --authorizer="local" --cgroups_cpu_enable_pids_and_tids_count="false"
--cgroups_enable_cfs="false" --cgroups_hierarchy="/sys/fs/cgroup" --cgroups_limit_swap="false"
--cgroups_root="mesos" --container_disk_watch_interval="15secs" --containerizers="mesos" --credential="/tmp/Endpoint_SlaveEndpointTest_UnauthorizedRequest_2_QsG9zu/credential"
--default_role="*" --disallow_sharing_agent_pid_namespace="false" --disk_watch_interval="1mins"
--docker="docker" --docker_kill_orphans="true" --docker_registry="https://registry-1.docker.io"
--docker_remove_delay="6hrs" --docker_socket="/var/run/docker.sock" --docker_stop_timeout="0ns"
--docker_store_dir="/tmp/Endpoint_SlaveEndpointTest_UnauthorizedRequest_2_QsG9zu/store/docker"
--docker_volume_checkpoint_dir="/var/run/mesos/isolators/docker/volume" --enforce_container_disk_quota="false"
--executor_registration_timeout="1mins" --executor_reregistration_timeout="2secs" --executor_secret_key="/tmp/Endpoint_SlaveEndpointTest_UnauthorizedRequest_2_QsG9zu/executor_secret_key"
--executor_shutdown_grace_period="5secs" --fetcher_cache_dir="/tmp/Endpoint_SlaveEndpointTest_UnauthorizedRequest_2_QsG9zu/fetch"
--fetcher_cache_size="2GB" --frameworks_home="" --gc_delay="1weeks" --gc_disk_headroom="0.1"
--hadoop_home="" --help="false" --hostname_lookup="true" --http_command_executor="false" --http_credentials="/tmp/Endpoint_SlaveEndpointTest_UnauthorizedRequest_2_QsG9zu/http_credentials"
--http_heartbeat_interval="30secs" --initialize_driver_logging="true" --isolation="posix/cpu,posix/mem"
--launcher="posix" --launcher_dir="/mesos/mesos-1.5.0/_build/src" --logbufsecs="0" --logging_level="INFO"
--max_completed_executors_per_framework="150" --oversubscribed_resources_interval="15secs"
--perf_duration="10secs" --perf_interval="1mins" --port="5051" --qos_correction_interval_min="0ns"
--quiet="false" --recover="reconnect" --recovery_timeout="15mins" --registration_backoff_factor="10ms"
--resources="cpus:2;gpus:0;mem:1024;disk:1024;ports:[31000-32000]" --revocable_cpu_low_priority="true"
--runtime_dir="/tmp/Endpoint_SlaveEndpointTest_UnauthorizedRequest_2_QsG9zu" --sandbox_directory="/mnt/mesos/sandbox"
--strict="true" --switch_user="true" --systemd_enable_support="true" --systemd_runtime_directory="/run/systemd/system"
--version="false" --work_dir="/tmp/Endpoint_SlaveEndpointTest_UnauthorizedRequest_2_CrGKDN"
--zk_session_timeout="10secs"
I0922 00:44:04.072803 25286 credentials.hpp:86] Loading credential for authentication from
'/tmp/Endpoint_SlaveEndpointTest_UnauthorizedRequest_2_QsG9zu/credential'
I0922 00:44:04.073096 25286 slave.cpp:287] Agent using credential for: test-principal
I0922 00:44:04.073135 25286 credentials.hpp:37] Loading credentials for authentication from
'/tmp/Endpoint_SlaveEndpointTest_UnauthorizedRequest_2_QsG9zu/http_credentials'
I0922 00:44:04.073654 25286 http.cpp:1045] Creating default 'basic' HTTP authenticator for
realm 'mesos-agent-executor'
I0922 00:44:04.073839 25286 http.cpp:1066] Creating default 'jwt' HTTP authenticator for realm
'mesos-agent-executor'
I0922 00:44:04.074139 25286 http.cpp:1045] Creating default 'basic' HTTP authenticator for
realm 'mesos-agent-readonly'
I0922 00:44:04.074296 25286 http.cpp:1066] Creating default 'jwt' HTTP authenticator for realm
'mesos-agent-readonly'
I0922 00:44:04.074518 25286 http.cpp:1045] Creating default 'basic' HTTP authenticator for
realm 'mesos-agent-readwrite'
I0922 00:44:04.074611 25286 http.cpp:1066] Creating default 'jwt' HTTP authenticator for realm
'mesos-agent-readwrite'
I0922 00:44:04.075912 25286 slave.cpp:585] Agent resources: [{"name":"cpus","scalar":{"value":2.0},"type":"SCALAR"},{"name":"mem","scalar":{"value":1024.0},"type":"SCALAR"},{"name":"disk","scalar":{"value":1024.0},"type":"SCALAR"},{"name":"ports","ranges":{"range":[{"begin":31000,"end":32000}]},"type":"RANGES"}]
I0922 00:44:04.076112 25286 slave.cpp:593] Agent attributes: [  ]
I0922 00:44:04.076125 25286 slave.cpp:602] Agent hostname: c666d2394154
I0922 00:44:04.076318 25285 status_update_manager.cpp:177] Pausing sending status updates
I0922 00:44:04.077759 25291 state.cpp:64] Recovering state from '/tmp/Endpoint_SlaveEndpointTest_UnauthorizedRequest_2_CrGKDN/meta'
I0922 00:44:04.078169 25296 status_update_manager.cpp:203] Recovering status update manager
I0922 00:44:04.078375 25296 containerizer.cpp:648] Recovering containerizer
I0922 00:44:04.079826 25291 provisioner.cpp:416] Provisioner recovery complete
I0922 00:44:04.080289 25292 slave.cpp:6322] Finished recovery
I0922 00:44:04.080792 25292 slave.cpp:6504] Querying resource estimator for oversubscribable
resources
I0922 00:44:04.081070 25296 slave.cpp:6518] Received oversubscribable resources {} from the
resource estimator
I0922 00:44:04.083433 25287 process.cpp:3929] Handling HTTP event for process 'slave(820)'
with path: '/slave(820)/containers'
I0922 00:44:04.085606 25289 http.cpp:1185] HTTP GET for /slave(820)/containers from 172.17.0.2:49908
I0922 00:44:04.085700 25289 http.cpp:976] Authorizing principal 'test-principal' to GET the
'/containers' endpoint
I0922 00:44:04.088644 25290 slave.cpp:869] Agent terminating
[       OK ] Endpoint/SlaveEndpointTest.UnauthorizedRequest/2 (33 ms)
[ RUN      ] Endpoint/SlaveEndpointTest.NoAuthorizer/0
I0922 00:44:04.101740  6076 containerizer.cpp:292] Using isolation { environment_secret, posix/cpu,
posix/mem, filesystem/posix, network/cni }
W0922 00:44:04.102219  6076 backend.cpp:76] Failed to create 'aufs' backend: AufsBackend requires
root privileges
W0922 00:44:04.102324  6076 backend.cpp:76] Failed to create 'bind' backend: BindBackend requires
root privileges
I0922 00:44:04.102358  6076 provisioner.cpp:255] Using default backend 'copy'
I0922 00:44:04.103951  6076 cluster.cpp:448] Creating default 'local' authorizer
I0922 00:44:04.105895 25291 slave.cpp:254] Mesos agent started on (821)@172.17.0.2:42130
I0922 00:44:04.105934 25291 slave.cpp:255] Flags at startup: --acls="" --appc_simple_discovery_uri_prefix="http://"
--appc_store_dir="/tmp/Endpoint_SlaveEndpointTest_NoAuthorizer_0_gLxwEg/store/appc" --authenticate_http_executors="true"
--authenticate_http_readonly="true" --authenticate_http_readwrite="true" --authenticatee="crammd5"
--authentication_backoff_factor="1secs" --authorizer="local" --cgroups_cpu_enable_pids_and_tids_count="false"
--cgroups_enable_cfs="false" --cgroups_hierarchy="/sys/fs/cgroup" --cgroups_limit_swap="false"
--cgroups_root="mesos" --container_disk_watch_interval="15secs" --containerizers="mesos" --credential="/tmp/Endpoint_SlaveEndpointTest_NoAuthorizer_0_gLxwEg/credential"
--default_role="*" --disallow_sharing_agent_pid_namespace="false" --disk_watch_interval="1mins"
--docker="docker" --docker_kill_orphans="true" --docker_registry="https://registry-1.docker.io"
--docker_remove_delay="6hrs" --docker_socket="/var/run/docker.sock" --docker_stop_timeout="0ns"
--docker_store_dir="/tmp/Endpoint_SlaveEndpointTest_NoAuthorizer_0_gLxwEg/store/docker" --docker_volume_checkpoint_dir="/var/run/mesos/isolators/docker/volume"
--enforce_container_disk_quota="false" --executor_registration_timeout="1mins" --executor_reregistration_timeout="2secs"
--executor_secret_key="/tmp/Endpoint_SlaveEndpointTest_NoAuthorizer_0_gLxwEg/executor_secret_key"
--executor_shutdown_grace_period="5secs" --fetcher_cache_dir="/tmp/Endpoint_SlaveEndpointTest_NoAuthorizer_0_gLxwEg/fetch"
--fetcher_cache_size="2GB" --frameworks_home="" --gc_delay="1weeks" --gc_disk_headroom="0.1"
--hadoop_home="" --help="false" --hostname_lookup="true" --http_command_executor="false" --http_credentials="/tmp/Endpoint_SlaveEndpointTest_NoAuthorizer_0_gLxwEg/http_credentials"
--http_heartbeat_interval="30secs" --initialize_driver_logging="true" --isolation="posix/cpu,posix/mem"
--launcher="posix" --launcher_dir="/mesos/mesos-1.5.0/_build/src" --logbufsecs="0" --logging_level="INFO"
--max_completed_executors_per_framework="150" --oversubscribed_resources_interval="15secs"
--perf_duration="10secs" --perf_interval="1mins" --port="5051" --qos_correction_interval_min="0ns"
--quiet="false" --recover="reconnect" --recovery_timeout="15mins" --registration_backoff_factor="10ms"
--resources="cpus:2;gpus:0;mem:1024;disk:1024;ports:[31000-32000]" --revocable_cpu_low_priority="true"
--runtime_dir="/tmp/Endpoint_SlaveEndpointTest_NoAuthorizer_0_gLxwEg" --sandbox_directory="/mnt/mesos/sandbox"
--strict="true" --switch_user="true" --systemd_enable_support="true" --systemd_runtime_directory="/run/systemd/system"
--version="false" --work_dir="/tmp/Endpoint_SlaveEndpointTest_NoAuthorizer_0_ul4ACz" --zk_session_timeout="10secs"
I0922 00:44:04.106336 25291 credentials.hpp:86] Loading credential for authentication from
'/tmp/Endpoint_SlaveEndpointTest_NoAuthorizer_0_gLxwEg/credential'
I0922 00:44:04.106479 25291 slave.cpp:287] Agent using credential for: test-principal
I0922 00:44:04.106503 25291 credentials.hpp:37] Loading credentials for authentication from
'/tmp/Endpoint_SlaveEndpointTest_NoAuthorizer_0_gLxwEg/http_credentials'
I0922 00:44:04.106813 25291 http.cpp:1045] Creating default 'basic' HTTP authenticator for
realm 'mesos-agent-executor'
I0922 00:44:04.106933 25291 http.cpp:1066] Creating default 'jwt' HTTP authenticator for realm
'mesos-agent-executor'
I0922 00:44:04.107173 25291 http.cpp:1045] Creating default 'basic' HTTP authenticator for
realm 'mesos-agent-readonly'
I0922 00:44:04.107290 25291 http.cpp:1066] Creating default 'jwt' HTTP authenticator for realm
'mesos-agent-readonly'
I0922 00:44:04.107522 25291 http.cpp:1045] Creating default 'basic' HTTP authenticator for
realm 'mesos-agent-readwrite'
I0922 00:44:04.107650 25291 http.cpp:1066] Creating default 'jwt' HTTP authenticator for realm
'mesos-agent-readwrite'
I0922 00:44:04.109043 25291 slave.cpp:585] Agent resources: [{"name":"cpus","scalar":{"value":2.0},"type":"SCALAR"},{"name":"mem","scalar":{"value":1024.0},"type":"SCALAR"},{"name":"disk","scalar":{"value":1024.0},"type":"SCALAR"},{"name":"ports","ranges":{"range":[{"begin":31000,"end":32000}]},"type":"RANGES"}]
I0922 00:44:04.109259 25291 slave.cpp:593] Agent attributes: [  ]
I0922 00:44:04.109280 25291 slave.cpp:602] Agent hostname: c666d2394154
I0922 00:44:04.109421 25293 status_update_manager.cpp:177] Pausing sending status updates
I0922 00:44:04.111022 25287 state.cpp:64] Recovering state from '/tmp/Endpoint_SlaveEndpointTest_NoAuthorizer_0_ul4ACz/meta'
I0922 00:44:04.111413 25286 status_update_manager.cpp:203] Recovering status update manager
I0922 00:44:04.111611 25299 containerizer.cpp:648] Recovering containerizer
I0922 00:44:04.113098 25287 provisioner.cpp:416] Provisioner recovery complete
I0922 00:44:04.113476 25292 slave.cpp:6322] Finished recovery
I0922 00:44:04.113940 25292 slave.cpp:6504] Querying resource estimator for oversubscribable
resources
I0922 00:44:04.114198 25293 slave.cpp:6518] Received oversubscribable resources {} from the
resource estimator
I0922 00:44:04.116467 25290 process.cpp:3929] Handling HTTP event for process 'slave(821)'
with path: '/slave(821)/monitor/statistics'
I0922 00:44:04.118396 25292 http.cpp:1185] HTTP GET for /slave(821)/monitor/statistics from
172.17.0.2:49909
I0922 00:44:04.118480 25292 http.cpp:976] Authorizing principal 'test-principal' to GET the
'/monitor/statistics' endpoint
I0922 00:44:04.121860 25293 slave.cpp:869] Agent terminating
[       OK ] Endpoint/SlaveEndpointTest.NoAuthorizer/0 (33 ms)
[ RUN      ] Endpoint/SlaveEndpointTest.NoAuthorizer/1
I0922 00:44:04.135257  6076 containerizer.cpp:292] Using isolation { environment_secret, posix/cpu,
posix/mem, filesystem/posix, network/cni }
W0922 00:44:04.135756  6076 backend.cpp:76] Failed to create 'aufs' backend: AufsBackend requires
root privileges
W0922 00:44:04.135864  6076 backend.cpp:76] Failed to create 'bind' backend: BindBackend requires
root privileges
I0922 00:44:04.135928  6076 provisioner.cpp:255] Using default backend 'copy'
I0922 00:44:04.137621  6076 cluster.cpp:448] Creating default 'local' authorizer
I0922 00:44:04.139550 25284 slave.cpp:254] Mesos agent started on (822)@172.17.0.2:42130
I0922 00:44:04.139596 25284 slave.cpp:255] Flags at startup: --acls="" --appc_simple_discovery_uri_prefix="http://"
--appc_store_dir="/tmp/Endpoint_SlaveEndpointTest_NoAuthorizer_1_ywGA42/store/appc" --authenticate_http_executors="true"
--authenticate_http_readonly="true" --authenticate_http_readwrite="true" --authenticatee="crammd5"
--authentication_backoff_factor="1secs" --authorizer="local" --cgroups_cpu_enable_pids_and_tids_count="false"
--cgroups_enable_cfs="false" --cgroups_hierarchy="/sys/fs/cgroup" --cgroups_limit_swap="false"
--cgroups_root="mesos" --container_disk_watch_interval="15secs" --containerizers="mesos" --credential="/tmp/Endpoint_SlaveEndpointTest_NoAuthorizer_1_ywGA42/credential"
--default_role="*" --disallow_sharing_agent_pid_namespace="false" --disk_watch_interval="1mins"
--docker="docker" --docker_kill_orphans="true" --docker_registry="https://registry-1.docker.io"
--docker_remove_delay="6hrs" --docker_socket="/var/run/docker.sock" --docker_stop_timeout="0ns"
--docker_store_dir="/tmp/Endpoint_SlaveEndpointTest_NoAuthorizer_1_ywGA42/store/docker" --docker_volume_checkpoint_dir="/var/run/mesos/isolators/docker/volume"
--enforce_container_disk_quota="false" --executor_registration_timeout="1mins" --executor_reregistration_timeout="2secs"
--executor_secret_key="/tmp/Endpoint_SlaveEndpointTest_NoAuthorizer_1_ywGA42/executor_secret_key"
--executor_shutdown_grace_period="5secs" --fetcher_cache_dir="/tmp/Endpoint_SlaveEndpointTest_NoAuthorizer_1_ywGA42/fetch"
--fetcher_cache_size="2GB" --frameworks_home="" --gc_delay="1weeks" --gc_disk_headroom="0.1"
--hadoop_home="" --help="false" --hostname_lookup="true" --http_command_executor="false" --http_credentials="/tmp/Endpoint_SlaveEndpointTest_NoAuthorizer_1_ywGA42/http_credentials"
--http_heartbeat_interval="30secs" --initialize_driver_logging="true" --isolation="posix/cpu,posix/mem"
--launcher="posix" --launcher_dir="/mesos/mesos-1.5.0/_build/src" --logbufsecs="0" --logging_level="INFO"
--max_completed_executors_per_framework="150" --oversubscribed_resources_interval="15secs"
--perf_duration="10secs" --perf_interval="1mins" --port="5051" --qos_correction_interval_min="0ns"
--quiet="false" --recover="reconnect" --recovery_timeout="15mins" --registration_backoff_factor="10ms"
--resources="cpus:2;gpus:0;mem:1024;disk:1024;ports:[31000-32000]" --revocable_cpu_low_priority="true"
--runtime_dir="/tmp/Endpoint_SlaveEndpointTest_NoAuthorizer_1_ywGA42" --sandbox_directory="/mnt/mesos/sandbox"
--strict="true" --switch_user="true" --systemd_enable_support="true" --systemd_runtime_directory="/run/systemd/system"
--version="false" --work_dir="/tmp/Endpoint_SlaveEndpointTest_NoAuthorizer_1_etPeXl" --zk_session_timeout="10secs"
I0922 00:44:04.140118 25284 credentials.hpp:86] Loading credential for authentication from
'/tmp/Endpoint_SlaveEndpointTest_NoAuthorizer_1_ywGA42/credential'
I0922 00:44:04.140296 25284 slave.cpp:287] Agent using credential for: test-principal
I0922 00:44:04.140339 25284 credentials.hpp:37] Loading credentials for authentication from
'/tmp/Endpoint_SlaveEndpointTest_NoAuthorizer_1_ywGA42/http_credentials'
I0922 00:44:04.140686 25284 http.cpp:1045] Creating default 'basic' HTTP authenticator for
realm 'mesos-agent-executor'
I0922 00:44:04.140825 25284 http.cpp:1066] Creating default 'jwt' HTTP authenticator for realm
'mesos-agent-executor'
I0922 00:44:04.141063 25284 http.cpp:1045] Creating default 'basic' HTTP authenticator for
realm 'mesos-agent-readonly'
I0922 00:44:04.141299 25284 http.cpp:1066] Creating default 'jwt' HTTP authenticator for realm
'mesos-agent-readonly'
I0922 00:44:04.141594 25284 http.cpp:1045] Creating default 'basic' HTTP authenticator for
realm 'mesos-agent-readwrite'
I0922 00:44:04.141736 25284 http.cpp:1066] Creating default 'jwt' HTTP authenticator for realm
'mesos-agent-readwrite'
I0922 00:44:04.143430 25284 slave.cpp:585] Agent resources: [{"name":"cpus","scalar":{"value":2.0},"type":"SCALAR"},{"name":"mem","scalar":{"value":1024.0},"type":"SCALAR"},{"name":"disk","scalar":{"value":1024.0},"type":"SCALAR"},{"name":"ports","ranges":{"range":[{"begin":31000,"end":32000}]},"type":"RANGES"}]
I0922 00:44:04.143703 25284 slave.cpp:593] Agent attributes: [  ]
I0922 00:44:04.143723 25284 slave.cpp:602] Agent hostname: c666d2394154
I0922 00:44:04.143908 25289 status_update_manager.cpp:177] Pausing sending status updates
I0922 00:44:04.145282 25295 state.cpp:64] Recovering state from '/tmp/Endpoint_SlaveEndpointTest_NoAuthorizer_1_etPeXl/meta'
I0922 00:44:04.145588 25295 status_update_manager.cpp:203] Recovering status update manager
I0922 00:44:04.145817 25295 containerizer.cpp:648] Recovering containerizer
I0922 00:44:04.147265 25299 provisioner.cpp:416] Provisioner recovery complete
I0922 00:44:04.147699 25287 slave.cpp:6322] Finished recovery
I0922 00:44:04.148205 25287 slave.cpp:6504] Querying resource estimator for oversubscribable
resources
I0922 00:44:04.148432 25289 slave.cpp:6518] Received oversubscribable resources {} from the
resource estimator
I0922 00:44:04.151000 25285 process.cpp:3929] Handling HTTP event for process 'slave(822)'
with path: '/slave(822)/monitor/statistics.json'
I0922 00:44:04.152976 25290 http.cpp:1185] HTTP GET for /slave(822)/monitor/statistics.json
from 172.17.0.2:49910
I0922 00:44:04.153075 25290 http.cpp:976] Authorizing principal 'test-principal' to GET the
'/monitor/statistics.json' endpoint
I0922 00:44:04.156944  6076 slave.cpp:869] Agent terminating
[       OK ] Endpoint/SlaveEndpointTest.NoAuthorizer/1 (34 ms)
[ RUN      ] Endpoint/SlaveEndpointTest.NoAuthorizer/2
I0922 00:44:04.170671  6076 containerizer.cpp:292] Using isolation { environment_secret, posix/cpu,
posix/mem, filesystem/posix, network/cni }
W0922 00:44:04.171097  6076 backend.cpp:76] Failed to create 'aufs' backend: AufsBackend requires
root privileges
W0922 00:44:04.171192  6076 backend.cpp:76] Failed to create 'bind' backend: BindBackend requires
root privileges
I0922 00:44:04.171223  6076 provisioner.cpp:255] Using default backend 'copy'
I0922 00:44:04.172662  6076 cluster.cpp:448] Creating default 'local' authorizer
I0922 00:44:04.174298 25294 slave.cpp:254] Mesos agent started on (823)@172.17.0.2:42130
I0922 00:44:04.174348 25294 slave.cpp:255] Flags at startup: --acls="" --appc_simple_discovery_uri_prefix="http://"
--appc_store_dir="/tmp/Endpoint_SlaveEndpointTest_NoAuthorizer_2_AuffRP/store/appc" --authenticate_http_executors="true"
--authenticate_http_readonly="true" --authenticate_http_readwrite="true" --authenticatee="crammd5"
--authentication_backoff_factor="1secs" --authorizer="local" --cgroups_cpu_enable_pids_and_tids_count="false"
--cgroups_enable_cfs="false" --cgroups_hierarchy="/sys/fs/cgroup" --cgroups_limit_swap="false"
--cgroups_root="mesos" --container_disk_watch_interval="15secs" --containerizers="mesos" --credential="/tmp/Endpoint_SlaveEndpointTest_NoAuthorizer_2_AuffRP/credential"
--default_role="*" --disallow_sharing_agent_pid_namespace="false" --disk_watch_interval="1mins"
--docker="docker" --docker_kill_orphans="true" --docker_registry="https://registry-1.docker.io"
--docker_remove_delay="6hrs" --docker_socket="/var/run/docker.sock" --docker_stop_timeout="0ns"
--docker_store_dir="/tmp/Endpoint_SlaveEndpointTest_NoAuthorizer_2_AuffRP/store/docker" --docker_volume_checkpoint_dir="/var/run/mesos/isolators/docker/volume"
--enforce_container_disk_quota="false" --executor_registration_timeout="1mins" --executor_reregistration_timeout="2secs"
--executor_secret_key="/tmp/Endpoint_SlaveEndpointTest_NoAuthorizer_2_AuffRP/executor_secret_key"
--executor_shutdown_grace_period="5secs" --fetcher_cache_dir="/tmp/Endpoint_SlaveEndpointTest_NoAuthorizer_2_AuffRP/fetch"
--fetcher_cache_size="2GB" --frameworks_home="" --gc_delay="1weeks" --gc_disk_headroom="0.1"
--hadoop_home="" --help="false" --hostname_lookup="true" --http_command_executor="false" --http_credentials="/tmp/Endpoint_SlaveEndpointTest_NoAuthorizer_2_AuffRP/http_credentials"
--http_heartbeat_interval="30secs" --initialize_driver_logging="true" --isolation="posix/cpu,posix/mem"
--launcher="posix" --launcher_dir="/mesos/mesos-1.5.0/_build/src" --logbufsecs="0" --logging_level="INFO"
--max_completed_executors_per_framework="150" --oversubscribed_resources_interval="15secs"
--perf_duration="10secs" --perf_interval="1mins" --port="5051" --qos_correction_interval_min="0ns"
--quiet="false" --recover="reconnect" --recovery_timeout="15mins" --registration_backoff_factor="10ms"
--resources="cpus:2;gpus:0;mem:1024;disk:1024;ports:[31000-32000]" --revocable_cpu_low_priority="true"
--runtime_dir="/tmp/Endpoint_SlaveEndpointTest_NoAuthorizer_2_AuffRP" --sandbox_directory="/mnt/mesos/sandbox"
--strict="true" --switch_user="true" --systemd_enable_support="true" --systemd_runtime_directory="/run/systemd/system"
--version="false" --work_dir="/tmp/Endpoint_SlaveEndpointTest_NoAuthorizer_2_kK5bE8" --zk_session_timeout="10secs"
I0922 00:44:04.174868 25294 credentials.hpp:86] Loading credential for authentication from
'/tmp/Endpoint_SlaveEndpointTest_NoAuthorizer_2_AuffRP/credential'
I0922 00:44:04.175034 25294 slave.cpp:287] Agent using credential for: test-principal
I0922 00:44:04.175063 25294 credentials.hpp:37] Loading credentials for authentication from
'/tmp/Endpoint_SlaveEndpointTest_NoAuthorizer_2_AuffRP/http_credentials'
I0922 00:44:04.175390 25294 http.cpp:1045] Creating default 'basic' HTTP authenticator for
realm 'mesos-agent-executor'
I0922 00:44:04.175523 25294 http.cpp:1066] Creating default 'jwt' HTTP authenticator for realm
'mesos-agent-executor'
I0922 00:44:04.175755 25294 http.cpp:1045] Creating default 'basic' HTTP authenticator for
realm 'mesos-agent-readonly'
I0922 00:44:04.175882 25294 http.cpp:1066] Creating default 'jwt' HTTP authenticator for realm
'mesos-agent-readonly'
I0922 00:44:04.176111 25294 http.cpp:1045] Creating default 'basic' HTTP authenticator for
realm 'mesos-agent-readwrite'
I0922 00:44:04.176236 25294 http.cpp:1066] Creating default 'jwt' HTTP authenticator for realm
'mesos-agent-readwrite'
I0922 00:44:04.177925 25294 slave.cpp:585] Agent resources: [{"name":"cpus","scalar":{"value":2.0},"type":"SCALAR"},{"name":"mem","scalar":{"value":1024.0},"type":"SCALAR"},{"name":"disk","scalar":{"value":1024.0},"type":"SCALAR"},{"name":"ports","ranges":{"range":[{"begin":31000,"end":32000}]},"type":"RANGES"}]
I0922 00:44:04.178189 25294 slave.cpp:593] Agent attributes: [  ]
I0922 00:44:04.178205 25294 slave.cpp:602] Agent hostname: c666d2394154
I0922 00:44:04.178380 25287 status_update_manager.cpp:177] Pausing sending status updates
I0922 00:44:04.179795 25296 state.cpp:64] Recovering state from '/tmp/Endpoint_SlaveEndpointTest_NoAuthorizer_2_kK5bE8/meta'
I0922 00:44:04.180150 25297 status_update_manager.cpp:203] Recovering status update manager
I0922 00:44:04.180367 25293 containerizer.cpp:648] Recovering containerizer
I0922 00:44:04.181717 25296 provisioner.cpp:416] Provisioner recovery complete
I0922 00:44:04.182039 25298 slave.cpp:6322] Finished recovery
I0922 00:44:04.182539 25298 slave.cpp:6504] Querying resource estimator for oversubscribable
resources
I0922 00:44:04.182817 25287 slave.cpp:6518] Received oversubscribable resources {} from the
resource estimator
I0922 00:44:04.185147 25295 process.cpp:3929] Handling HTTP event for process 'slave(823)'
with path: '/slave(823)/containers'
I0922 00:44:04.187183 25291 http.cpp:1185] HTTP GET for /slave(823)/containers from 172.17.0.2:49911
I0922 00:44:04.187273 25291 http.cpp:976] Authorizing principal 'test-principal' to GET the
'/containers' endpoint
I0922 00:44:04.191855 25299 slave.cpp:869] Agent terminating
[       OK ] Endpoint/SlaveEndpointTest.NoAuthorizer/2 (34 ms)
[----------] 9 tests from Endpoint/SlaveEndpointTest (309 ms total)

[----------] 2 tests from ContainerizerType/DefaultContainerDNSFlagTest
[ RUN      ] ContainerizerType/DefaultContainerDNSFlagTest.ValidateFlag/0
[       OK ] ContainerizerType/DefaultContainerDNSFlagTest.ValidateFlag/0 (10 ms)
[ RUN      ] ContainerizerType/DefaultContainerDNSFlagTest.ValidateFlag/1
[       OK ] ContainerizerType/DefaultContainerDNSFlagTest.ValidateFlag/1 (8 ms)
[----------] 2 tests from ContainerizerType/DefaultContainerDNSFlagTest (18 ms total)

[----------] Global test environment tear-down
[==========] 1684 tests from 186 test cases ran. (634471 ms total)
[  PASSED  ] 1683 tests.
[  FAILED  ] 1 test, listed below:
[  FAILED  ] ReservationEndpointsTest.DifferentPrincipalsSameRole

 1 FAILED TEST
  YOU HAVE 20 DISABLED TESTS

I0922 00:44:04.275530 25300 process.cpp:1068] Failed to accept socket: future discarded
make[4]: *** [check-local] Error 1
make[4]: Leaving directory `/mesos/mesos-1.5.0/_build/src'
make[3]: *** [check-am] Error 2
make[3]: Leaving directory `/mesos/mesos-1.5.0/_build/src'
make[2]: *** [check] Error 2
make[2]: Leaving directory `/mesos/mesos-1.5.0/_build/src'
make[1]: *** [check-recursive] Error 1
make[1]: Leaving directory `/mesos/mesos-1.5.0/_build'
make: *** [distcheck] Error 1
+ docker rmi mesos-1506037468-30017
Untagged: mesos-1506037468-30017:latest
Deleted: sha256:aef82efbf4bcd974d114c5a86f99b8fdab83d704c950873d20415eaa7ae284fa
Deleted: sha256:6ec4455f37cb8569f002d3e17fd47c28e51b4799bc3622c6b7e0aa93f10ea8d4
Deleted: sha256:ae4a1e92ae3e6c6868bd1e00dace129d18caa565f39423de60feb88e7e35fa0b
Deleted: sha256:3650c1896fd695e8e76a6ccdde905ea2fbeec3b84ba5ca26d7f999a1b565b870
Deleted: sha256:836868898772a3f632c91f34c104d3fe943bf2a8cb378252fe8fc805271a5ded
Deleted: sha256:29521018e00fb0fb16c098cda7623356ccafee390b5bbcc057cccdeeabdd310b
Deleted: sha256:77eed2342d8a5db36a187b59c0d5e9c7820e50be369f499b2578a5af889adc4c
Deleted: sha256:313905a5a13f2669bbbba56f655cc89f694aa3b90afe057b5b6bff096bb3bfe7
Deleted: sha256:98a55e890f2298dc0e17a88f420306f4febb0c345b3a00cdaa19438dc52eb56c
Deleted: sha256:b77cd2ba5b5a09cdbc2ad92bce661dc8dee643038fabd0079b78f70bdba30015
Deleted: sha256:d258d11357d574dc94fcfc8b75d94f0bc95a791c7fb2cc6af17dec8a3fcd6195
Deleted: sha256:f420a07fdf8652cffcd1e05932c4b81716dada52d7ecccbde383fa6bc2bc743c
Deleted: sha256:4c252e7cfcd44e3ff29a134ad800de7c39549081fcfbe6f062d7afd0f94a7ad6
Deleted: sha256:997b23d50e2bf208a3e9165465d6c7dcb977afd77f648e905518f05cda250f3c
Deleted: sha256:d5337dde5d0300a6c8caaa680d9a57695db9c78d64af2f9be154466e13285eb3
Deleted: sha256:8852a9d325a7fddbc6067cef023d80813c2cdf7adc78e13d11657f586a1f8228
Deleted: sha256:98ea4c3890bced9ecae0122c0c9ad30dc8ea90d573728a9cf40d5fa9cf3fff3d
Deleted: sha256:f10702ed4b20c2de298ff60967f6808525331f28372397505f3c9903cbdef80b
Deleted: sha256:4894808132133dcecd9600ba36941398568dd3c97cb327bf1c7366152e456477
Deleted: sha256:fd9abddd04fb10872cdfb14e0d26ec63ac119fc94d6d18b1af64e9610b4c5f27
Deleted: sha256:be8ffb2ca945c4c5665d243845fcb6140479b21858afcd6927c1e4c8cb199a7f
Deleted: sha256:c234c4331708bef60b3284078bcddc3e0eed2262024ba7608cf71313af344e47
Deleted: sha256:f0c04d1f9488fdb4ff15f96edd6a5d9dccb871964952ca888da3f8c15433193b
Deleted: sha256:f192aadb2feabe50e4532188eac074adcb0e11820102cbae7435814ea6d2c239
Deleted: sha256:ed73f58336bfe307fd8d53a168795547c70117cb46f9682c615c5c46f0e5e29f
Deleted: sha256:791f758b060aa69287f1b6fa3e30e83ac1911712c0eec102e21cbe3a7b7d1590
Deleted: sha256:58d47cafd239b38298ee6901dbbd69418a9a1e71a77e5f43e2edfab15f056f25
Deleted: sha256:3f6d885f290d479da75e95132263dbc395f17ddfb9ffd9df6bdc233b9793d386
Build step 'Execute shell' marked build as failure

Mime
View raw message