mesos-builds mailing list archives

Site index · List index
Message view « Date » · « Thread »
Top « Date » · « Thread »
From Apache Jenkins Server <jenk...@builds.apache.org>
Subject Build failed in Jenkins: Mesos-Buildbot » autotools,gcc,--verbose --enable-libevent --enable-ssl,GLOG_v=1 MESOS_VERBOSE=1,ubuntu:14.04,(ubuntu)&&(!ubuntu-us1)&&(!ubuntu-eu2)&&(!qnode3)&&(!H23) #4253
Date Fri, 22 Sep 2017 02:03:33 GMT
See <https://builds.apache.org/job/Mesos-Buildbot/BUILDTOOL=autotools,COMPILER=gcc,CONFIGURATION=--verbose%20--enable-libevent%20--enable-ssl,ENVIRONMENT=GLOG_v=1%20MESOS_VERBOSE=1,OS=ubuntu%3A14.04,label_exp=(ubuntu)&&(!ubuntu-us1)&&(!ubuntu-eu2)&&(!qnode3)&&(!H23)/4253/display/redirect>

------------------------------------------
[...truncated 33.12 MB...]
I0922 02:03:23.418349 30199 http.cpp:1045] Creating default 'basic' HTTP authenticator for
realm 'mesos-agent-executor'
I0922 02:03:23.418463 30199 http.cpp:1066] Creating default 'jwt' HTTP authenticator for realm
'mesos-agent-executor'
I0922 02:03:23.418661 30199 http.cpp:1045] Creating default 'basic' HTTP authenticator for
realm 'mesos-agent-readonly'
I0922 02:03:23.418757 30199 http.cpp:1066] Creating default 'jwt' HTTP authenticator for realm
'mesos-agent-readonly'
I0922 02:03:23.418938 30199 http.cpp:1045] Creating default 'basic' HTTP authenticator for
realm 'mesos-agent-readwrite'
I0922 02:03:23.419041 30199 http.cpp:1066] Creating default 'jwt' HTTP authenticator for realm
'mesos-agent-readwrite'
I0922 02:03:23.420403 30199 slave.cpp:585] Agent resources: [{"name":"cpus","scalar":{"value":2.0},"type":"SCALAR"},{"name":"mem","scalar":{"value":1024.0},"type":"SCALAR"},{"name":"disk","scalar":{"value":1024.0},"type":"SCALAR"},{"name":"ports","ranges":{"range":[{"begin":31000,"end":32000}]},"type":"RANGES"}]
I0922 02:03:23.420630 30199 slave.cpp:593] Agent attributes: [  ]
I0922 02:03:23.420642 30199 slave.cpp:602] Agent hostname: 4c4f36eb85cd
I0922 02:03:23.420768 30212 status_update_manager.cpp:177] Pausing sending status updates
I0922 02:03:23.422157 30203 state.cpp:64] Recovering state from '/tmp/Endpoint_SlaveEndpointTest_UnauthorizedRequest_0_HWOmT7/meta'
I0922 02:03:23.422405 30210 status_update_manager.cpp:203] Recovering status update manager
I0922 02:03:23.422610 30207 containerizer.cpp:648] Recovering containerizer
I0922 02:03:23.423766 30209 provisioner.cpp:416] Provisioner recovery complete
I0922 02:03:23.424023 30212 slave.cpp:6322] Finished recovery
I0922 02:03:23.424477 30212 slave.cpp:6504] Querying resource estimator for oversubscribable
resources
I0922 02:03:23.424731 30194 slave.cpp:6518] Received oversubscribable resources {} from the
resource estimator
I0922 02:03:23.427043 30211 process.cpp:3929] Handling HTTP event for process 'slave(818)'
with path: '/slave(818)/monitor/statistics'
I0922 02:03:23.428640 30209 http.cpp:1185] HTTP GET for /slave(818)/monitor/statistics from
172.17.0.2:58496
I0922 02:03:23.428706 30209 http.cpp:976] Authorizing principal 'test-principal' to GET the
'/monitor/statistics' endpoint
I0922 02:03:23.430835 30199 slave.cpp:869] Agent terminating
[       OK ] Endpoint/SlaveEndpointTest.UnauthorizedRequest/0 (27 ms)
[ RUN      ] Endpoint/SlaveEndpointTest.UnauthorizedRequest/1
I0922 02:03:23.441107  8665 containerizer.cpp:292] Using isolation { environment_secret, posix/cpu,
posix/mem, filesystem/posix, network/cni }
W0922 02:03:23.441584  8665 backend.cpp:76] Failed to create 'aufs' backend: AufsBackend requires
root privileges
W0922 02:03:23.441697  8665 backend.cpp:76] Failed to create 'bind' backend: BindBackend requires
root privileges
I0922 02:03:23.441730  8665 provisioner.cpp:255] Using default backend 'copy'
I0922 02:03:23.445009 30207 slave.cpp:254] Mesos agent started on (819)@172.17.0.2:38078
I0922 02:03:23.445032 30207 slave.cpp:255] Flags at startup: --acls="" --appc_simple_discovery_uri_prefix="http://"
--appc_store_dir="/tmp/Endpoint_SlaveEndpointTest_UnauthorizedRequest_1_qX26Rm/store/appc"
--authenticate_http_executors="true" --authenticate_http_readonly="true" --authenticate_http_readwrite="true"
--authenticatee="crammd5" --authentication_backoff_factor="1secs" --authorizer="local" --cgroups_cpu_enable_pids_and_tids_count="false"
--cgroups_enable_cfs="false" --cgroups_hierarchy="/sys/fs/cgroup" --cgroups_limit_swap="false"
--cgroups_root="mesos" --container_disk_watch_interval="15secs" --containerizers="mesos" --credential="/tmp/Endpoint_SlaveEndpointTest_UnauthorizedRequest_1_qX26Rm/credential"
--default_role="*" --disallow_sharing_agent_pid_namespace="false" --disk_watch_interval="1mins"
--docker="docker" --docker_kill_orphans="true" --docker_registry="https://registry-1.docker.io"
--docker_remove_delay="6hrs" --docker_socket="/var/run/docker.sock" --docker_stop_timeout="0ns"
--docker_store_dir="/tmp/Endpoint_SlaveEndpointTest_UnauthorizedRequest_1_qX26Rm/store/docker"
--docker_volume_checkpoint_dir="/var/run/mesos/isolators/docker/volume" --enforce_container_disk_quota="false"
--executor_registration_timeout="1mins" --executor_reregistration_timeout="2secs" --executor_secret_key="/tmp/Endpoint_SlaveEndpointTest_UnauthorizedRequest_1_qX26Rm/executor_secret_key"
--executor_shutdown_grace_period="5secs" --fetcher_cache_dir="/tmp/Endpoint_SlaveEndpointTest_UnauthorizedRequest_1_qX26Rm/fetch"
--fetcher_cache_size="2GB" --frameworks_home="" --gc_delay="1weeks" --gc_disk_headroom="0.1"
--hadoop_home="" --help="false" --hostname_lookup="true" --http_command_executor="false" --http_credentials="/tmp/Endpoint_SlaveEndpointTest_UnauthorizedRequest_1_qX26Rm/http_credentials"
--http_heartbeat_interval="30secs" --initialize_driver_logging="true" --isolation="posix/cpu,posix/mem"
--launcher="posix" --launcher_dir="/mesos/mesos-1.5.0/_build/src" --logbufsecs="0" --logging_level="INFO"
--max_completed_executors_per_framework="150" --oversubscribed_resources_interval="15secs"
--perf_duration="10secs" --perf_interval="1mins" --port="5051" --qos_correction_interval_min="0ns"
--quiet="false" --recover="reconnect" --recovery_timeout="15mins" --registration_backoff_factor="10ms"
--resources="cpus:2;gpus:0;mem:1024;disk:1024;ports:[31000-32000]" --revocable_cpu_low_priority="true"
--runtime_dir="/tmp/Endpoint_SlaveEndpointTest_UnauthorizedRequest_1_qX26Rm" --sandbox_directory="/mnt/mesos/sandbox"
--strict="true" --switch_user="true" --systemd_enable_support="true" --systemd_runtime_directory="/run/systemd/system"
--version="false" --work_dir="/tmp/Endpoint_SlaveEndpointTest_UnauthorizedRequest_1_zEkPPU"
--zk_session_timeout="10secs"
I0922 02:03:23.445417 30207 credentials.hpp:86] Loading credential for authentication from
'/tmp/Endpoint_SlaveEndpointTest_UnauthorizedRequest_1_qX26Rm/credential'
I0922 02:03:23.445574 30207 slave.cpp:287] Agent using credential for: test-principal
I0922 02:03:23.445596 30207 credentials.hpp:37] Loading credentials for authentication from
'/tmp/Endpoint_SlaveEndpointTest_UnauthorizedRequest_1_qX26Rm/http_credentials'
I0922 02:03:23.445871 30207 http.cpp:1045] Creating default 'basic' HTTP authenticator for
realm 'mesos-agent-executor'
I0922 02:03:23.445992 30207 http.cpp:1066] Creating default 'jwt' HTTP authenticator for realm
'mesos-agent-executor'
I0922 02:03:23.446197 30207 http.cpp:1045] Creating default 'basic' HTTP authenticator for
realm 'mesos-agent-readonly'
I0922 02:03:23.446295 30207 http.cpp:1066] Creating default 'jwt' HTTP authenticator for realm
'mesos-agent-readonly'
I0922 02:03:23.446473 30207 http.cpp:1045] Creating default 'basic' HTTP authenticator for
realm 'mesos-agent-readwrite'
I0922 02:03:23.446571 30207 http.cpp:1066] Creating default 'jwt' HTTP authenticator for realm
'mesos-agent-readwrite'
I0922 02:03:23.447914 30207 slave.cpp:585] Agent resources: [{"name":"cpus","scalar":{"value":2.0},"type":"SCALAR"},{"name":"mem","scalar":{"value":1024.0},"type":"SCALAR"},{"name":"disk","scalar":{"value":1024.0},"type":"SCALAR"},{"name":"ports","ranges":{"range":[{"begin":31000,"end":32000}]},"type":"RANGES"}]
I0922 02:03:23.448143 30207 slave.cpp:593] Agent attributes: [  ]
I0922 02:03:23.448156 30207 slave.cpp:602] Agent hostname: 4c4f36eb85cd
I0922 02:03:23.448304 30200 status_update_manager.cpp:177] Pausing sending status updates
I0922 02:03:23.449621 30211 state.cpp:64] Recovering state from '/tmp/Endpoint_SlaveEndpointTest_UnauthorizedRequest_1_zEkPPU/meta'
I0922 02:03:23.449879 30202 status_update_manager.cpp:203] Recovering status update manager
I0922 02:03:23.450109 30213 containerizer.cpp:648] Recovering containerizer
I0922 02:03:23.451222 30197 provisioner.cpp:416] Provisioner recovery complete
I0922 02:03:23.451500 30200 slave.cpp:6322] Finished recovery
I0922 02:03:23.451902 30200 slave.cpp:6504] Querying resource estimator for oversubscribable
resources
I0922 02:03:23.452118 30198 slave.cpp:6518] Received oversubscribable resources {} from the
resource estimator
I0922 02:03:23.454144 30203 process.cpp:3929] Handling HTTP event for process 'slave(819)'
with path: '/slave(819)/monitor/statistics.json'
I0922 02:03:23.455752 30197 http.cpp:1185] HTTP GET for /slave(819)/monitor/statistics.json
from 172.17.0.2:58498
I0922 02:03:23.455816 30197 http.cpp:976] Authorizing principal 'test-principal' to GET the
'/monitor/statistics.json' endpoint
I0922 02:03:23.457922 30216 slave.cpp:869] Agent terminating
[       OK ] Endpoint/SlaveEndpointTest.UnauthorizedRequest/1 (26 ms)
[ RUN      ] Endpoint/SlaveEndpointTest.UnauthorizedRequest/2
I0922 02:03:23.468138  8665 containerizer.cpp:292] Using isolation { environment_secret, posix/cpu,
posix/mem, filesystem/posix, network/cni }
W0922 02:03:23.468610  8665 backend.cpp:76] Failed to create 'aufs' backend: AufsBackend requires
root privileges
W0922 02:03:23.468713  8665 backend.cpp:76] Failed to create 'bind' backend: BindBackend requires
root privileges
I0922 02:03:23.468744  8665 provisioner.cpp:255] Using default backend 'copy'
I0922 02:03:23.472007 30213 slave.cpp:254] Mesos agent started on (820)@172.17.0.2:38078
I0922 02:03:23.472028 30213 slave.cpp:255] Flags at startup: --acls="" --appc_simple_discovery_uri_prefix="http://"
--appc_store_dir="/tmp/Endpoint_SlaveEndpointTest_UnauthorizedRequest_2_IgEZeb/store/appc"
--authenticate_http_executors="true" --authenticate_http_readonly="true" --authenticate_http_readwrite="true"
--authenticatee="crammd5" --authentication_backoff_factor="1secs" --authorizer="local" --cgroups_cpu_enable_pids_and_tids_count="false"
--cgroups_enable_cfs="false" --cgroups_hierarchy="/sys/fs/cgroup" --cgroups_limit_swap="false"
--cgroups_root="mesos" --container_disk_watch_interval="15secs" --containerizers="mesos" --credential="/tmp/Endpoint_SlaveEndpointTest_UnauthorizedRequest_2_IgEZeb/credential"
--default_role="*" --disallow_sharing_agent_pid_namespace="false" --disk_watch_interval="1mins"
--docker="docker" --docker_kill_orphans="true" --docker_registry="https://registry-1.docker.io"
--docker_remove_delay="6hrs" --docker_socket="/var/run/docker.sock" --docker_stop_timeout="0ns"
--docker_store_dir="/tmp/Endpoint_SlaveEndpointTest_UnauthorizedRequest_2_IgEZeb/store/docker"
--docker_volume_checkpoint_dir="/var/run/mesos/isolators/docker/volume" --enforce_container_disk_quota="false"
--executor_registration_timeout="1mins" --executor_reregistration_timeout="2secs" --executor_secret_key="/tmp/Endpoint_SlaveEndpointTest_UnauthorizedRequest_2_IgEZeb/executor_secret_key"
--executor_shutdown_grace_period="5secs" --fetcher_cache_dir="/tmp/Endpoint_SlaveEndpointTest_UnauthorizedRequest_2_IgEZeb/fetch"
--fetcher_cache_size="2GB" --frameworks_home="" --gc_delay="1weeks" --gc_disk_headroom="0.1"
--hadoop_home="" --help="false" --hostname_lookup="true" --http_command_executor="false" --http_credentials="/tmp/Endpoint_SlaveEndpointTest_UnauthorizedRequest_2_IgEZeb/http_credentials"
--http_heartbeat_interval="30secs" --initialize_driver_logging="true" --isolation="posix/cpu,posix/mem"
--launcher="posix" --launcher_dir="/mesos/mesos-1.5.0/_build/src" --logbufsecs="0" --logging_level="INFO"
--max_completed_executors_per_framework="150" --oversubscribed_resources_interval="15secs"
--perf_duration="10secs" --perf_interval="1mins" --port="5051" --qos_correction_interval_min="0ns"
--quiet="false" --recover="reconnect" --recovery_timeout="15mins" --registration_backoff_factor="10ms"
--resources="cpus:2;gpus:0;mem:1024;disk:1024;ports:[31000-32000]" --revocable_cpu_low_priority="true"
--runtime_dir="/tmp/Endpoint_SlaveEndpointTest_UnauthorizedRequest_2_IgEZeb" --sandbox_directory="/mnt/mesos/sandbox"
--strict="true" --switch_user="true" --systemd_enable_support="true" --systemd_runtime_directory="/run/systemd/system"
--version="false" --work_dir="/tmp/Endpoint_SlaveEndpointTest_UnauthorizedRequest_2_L2cG8I"
--zk_session_timeout="10secs"
I0922 02:03:23.472450 30213 credentials.hpp:86] Loading credential for authentication from
'/tmp/Endpoint_SlaveEndpointTest_UnauthorizedRequest_2_IgEZeb/credential'
I0922 02:03:23.472605 30213 slave.cpp:287] Agent using credential for: test-principal
I0922 02:03:23.472635 30213 credentials.hpp:37] Loading credentials for authentication from
'/tmp/Endpoint_SlaveEndpointTest_UnauthorizedRequest_2_IgEZeb/http_credentials'
I0922 02:03:23.472935 30213 http.cpp:1045] Creating default 'basic' HTTP authenticator for
realm 'mesos-agent-executor'
I0922 02:03:23.473080 30213 http.cpp:1066] Creating default 'jwt' HTTP authenticator for realm
'mesos-agent-executor'
I0922 02:03:23.473316 30213 http.cpp:1045] Creating default 'basic' HTTP authenticator for
realm 'mesos-agent-readonly'
I0922 02:03:23.473431 30213 http.cpp:1066] Creating default 'jwt' HTTP authenticator for realm
'mesos-agent-readonly'
I0922 02:03:23.473646 30213 http.cpp:1045] Creating default 'basic' HTTP authenticator for
realm 'mesos-agent-readwrite'
I0922 02:03:23.473764 30213 http.cpp:1066] Creating default 'jwt' HTTP authenticator for realm
'mesos-agent-readwrite'
I0922 02:03:23.475134 30213 slave.cpp:585] Agent resources: [{"name":"cpus","scalar":{"value":2.0},"type":"SCALAR"},{"name":"mem","scalar":{"value":1024.0},"type":"SCALAR"},{"name":"disk","scalar":{"value":1024.0},"type":"SCALAR"},{"name":"ports","ranges":{"range":[{"begin":31000,"end":32000}]},"type":"RANGES"}]
I0922 02:03:23.475364 30213 slave.cpp:593] Agent attributes: [  ]
I0922 02:03:23.475378 30213 slave.cpp:602] Agent hostname: 4c4f36eb85cd
I0922 02:03:23.475524 30199 status_update_manager.cpp:177] Pausing sending status updates
I0922 02:03:23.476830 30193 state.cpp:64] Recovering state from '/tmp/Endpoint_SlaveEndpointTest_UnauthorizedRequest_2_L2cG8I/meta'
I0922 02:03:23.477090 30197 status_update_manager.cpp:203] Recovering status update manager
I0922 02:03:23.477303 30214 containerizer.cpp:648] Recovering containerizer
I0922 02:03:23.478467 30203 provisioner.cpp:416] Provisioner recovery complete
I0922 02:03:23.478762 30199 slave.cpp:6322] Finished recovery
I0922 02:03:23.479184 30199 slave.cpp:6504] Querying resource estimator for oversubscribable
resources
I0922 02:03:23.479432 30208 slave.cpp:6518] Received oversubscribable resources {} from the
resource estimator
I0922 02:03:23.481268 30216 process.cpp:3929] Handling HTTP event for process 'slave(820)'
with path: '/slave(820)/containers'
I0922 02:03:23.482934 30203 http.cpp:1185] HTTP GET for /slave(820)/containers from 172.17.0.2:58502
I0922 02:03:23.483005 30203 http.cpp:976] Authorizing principal 'test-principal' to GET the
'/containers' endpoint
I0922 02:03:23.484616 30201 slave.cpp:869] Agent terminating
[       OK ] Endpoint/SlaveEndpointTest.UnauthorizedRequest/2 (26 ms)
[ RUN      ] Endpoint/SlaveEndpointTest.NoAuthorizer/0
I0922 02:03:23.495126  8665 containerizer.cpp:292] Using isolation { environment_secret, posix/cpu,
posix/mem, filesystem/posix, network/cni }
W0922 02:03:23.495610  8665 backend.cpp:76] Failed to create 'aufs' backend: AufsBackend requires
root privileges
W0922 02:03:23.495730  8665 backend.cpp:76] Failed to create 'bind' backend: BindBackend requires
root privileges
I0922 02:03:23.495769  8665 provisioner.cpp:255] Using default backend 'copy'
I0922 02:03:23.497350  8665 cluster.cpp:448] Creating default 'local' authorizer
I0922 02:03:23.499249 30205 slave.cpp:254] Mesos agent started on (821)@172.17.0.2:38078
I0922 02:03:23.499280 30205 slave.cpp:255] Flags at startup: --acls="" --appc_simple_discovery_uri_prefix="http://"
--appc_store_dir="/tmp/Endpoint_SlaveEndpointTest_NoAuthorizer_0_KRkRRZ/store/appc" --authenticate_http_executors="true"
--authenticate_http_readonly="true" --authenticate_http_readwrite="true" --authenticatee="crammd5"
--authentication_backoff_factor="1secs" --authorizer="local" --cgroups_cpu_enable_pids_and_tids_count="false"
--cgroups_enable_cfs="false" --cgroups_hierarchy="/sys/fs/cgroup" --cgroups_limit_swap="false"
--cgroups_root="mesos" --container_disk_watch_interval="15secs" --containerizers="mesos" --credential="/tmp/Endpoint_SlaveEndpointTest_NoAuthorizer_0_KRkRRZ/credential"
--default_role="*" --disallow_sharing_agent_pid_namespace="false" --disk_watch_interval="1mins"
--docker="docker" --docker_kill_orphans="true" --docker_registry="https://registry-1.docker.io"
--docker_remove_delay="6hrs" --docker_socket="/var/run/docker.sock" --docker_stop_timeout="0ns"
--docker_store_dir="/tmp/Endpoint_SlaveEndpointTest_NoAuthorizer_0_KRkRRZ/store/docker" --docker_volume_checkpoint_dir="/var/run/mesos/isolators/docker/volume"
--enforce_container_disk_quota="false" --executor_registration_timeout="1mins" --executor_reregistration_timeout="2secs"
--executor_secret_key="/tmp/Endpoint_SlaveEndpointTest_NoAuthorizer_0_KRkRRZ/executor_secret_key"
--executor_shutdown_grace_period="5secs" --fetcher_cache_dir="/tmp/Endpoint_SlaveEndpointTest_NoAuthorizer_0_KRkRRZ/fetch"
--fetcher_cache_size="2GB" --frameworks_home="" --gc_delay="1weeks" --gc_disk_headroom="0.1"
--hadoop_home="" --help="false" --hostname_lookup="true" --http_command_executor="false" --http_credentials="/tmp/Endpoint_SlaveEndpointTest_NoAuthorizer_0_KRkRRZ/http_credentials"
--http_heartbeat_interval="30secs" --initialize_driver_logging="true" --isolation="posix/cpu,posix/mem"
--launcher="posix" --launcher_dir="/mesos/mesos-1.5.0/_build/src" --logbufsecs="0" --logging_level="INFO"
--max_completed_executors_per_framework="150" --oversubscribed_resources_interval="15secs"
--perf_duration="10secs" --perf_interval="1mins" --port="5051" --qos_correction_interval_min="0ns"
--quiet="false" --recover="reconnect" --recovery_timeout="15mins" --registration_backoff_factor="10ms"
--resources="cpus:2;gpus:0;mem:1024;disk:1024;ports:[31000-32000]" --revocable_cpu_low_priority="true"
--runtime_dir="/tmp/Endpoint_SlaveEndpointTest_NoAuthorizer_0_KRkRRZ" --sandbox_directory="/mnt/mesos/sandbox"
--strict="true" --switch_user="true" --systemd_enable_support="true" --systemd_runtime_directory="/run/systemd/system"
--version="false" --work_dir="/tmp/Endpoint_SlaveEndpointTest_NoAuthorizer_0_z0JzHx" --zk_session_timeout="10secs"
I0922 02:03:23.499899 30205 credentials.hpp:86] Loading credential for authentication from
'/tmp/Endpoint_SlaveEndpointTest_NoAuthorizer_0_KRkRRZ/credential'
I0922 02:03:23.500088 30205 slave.cpp:287] Agent using credential for: test-principal
I0922 02:03:23.500119 30205 credentials.hpp:37] Loading credentials for authentication from
'/tmp/Endpoint_SlaveEndpointTest_NoAuthorizer_0_KRkRRZ/http_credentials'
I0922 02:03:23.500517 30205 http.cpp:1045] Creating default 'basic' HTTP authenticator for
realm 'mesos-agent-executor'
I0922 02:03:23.500634 30205 http.cpp:1066] Creating default 'jwt' HTTP authenticator for realm
'mesos-agent-executor'
I0922 02:03:23.500823 30205 http.cpp:1045] Creating default 'basic' HTTP authenticator for
realm 'mesos-agent-readonly'
I0922 02:03:23.500921 30205 http.cpp:1066] Creating default 'jwt' HTTP authenticator for realm
'mesos-agent-readonly'
I0922 02:03:23.501163 30205 http.cpp:1045] Creating default 'basic' HTTP authenticator for
realm 'mesos-agent-readwrite'
I0922 02:03:23.501278 30205 http.cpp:1066] Creating default 'jwt' HTTP authenticator for realm
'mesos-agent-readwrite'
I0922 02:03:23.503279 30205 slave.cpp:585] Agent resources: [{"name":"cpus","scalar":{"value":2.0},"type":"SCALAR"},{"name":"mem","scalar":{"value":1024.0},"type":"SCALAR"},{"name":"disk","scalar":{"value":1024.0},"type":"SCALAR"},{"name":"ports","ranges":{"range":[{"begin":31000,"end":32000}]},"type":"RANGES"}]
I0922 02:03:23.503551 30205 slave.cpp:593] Agent attributes: [  ]
I0922 02:03:23.503566 30205 slave.cpp:602] Agent hostname: 4c4f36eb85cd
I0922 02:03:23.503690 30194 status_update_manager.cpp:177] Pausing sending status updates
I0922 02:03:23.505100 30214 state.cpp:64] Recovering state from '/tmp/Endpoint_SlaveEndpointTest_NoAuthorizer_0_z0JzHx/meta'
I0922 02:03:23.505353 30209 status_update_manager.cpp:203] Recovering status update manager
I0922 02:03:23.505523 30200 containerizer.cpp:648] Recovering containerizer
I0922 02:03:23.506757 30212 provisioner.cpp:416] Provisioner recovery complete
I0922 02:03:23.507115 30194 slave.cpp:6322] Finished recovery
I0922 02:03:23.507529 30194 slave.cpp:6504] Querying resource estimator for oversubscribable
resources
I0922 02:03:23.507736 30201 slave.cpp:6518] Received oversubscribable resources {} from the
resource estimator
I0922 02:03:23.509750 30193 process.cpp:3929] Handling HTTP event for process 'slave(821)'
with path: '/slave(821)/monitor/statistics'
I0922 02:03:23.511870 30216 http.cpp:1185] HTTP GET for /slave(821)/monitor/statistics from
172.17.0.2:58504
I0922 02:03:23.511932 30216 http.cpp:976] Authorizing principal 'test-principal' to GET the
'/monitor/statistics' endpoint
I0922 02:03:23.514839 30216 slave.cpp:869] Agent terminating
[       OK ] Endpoint/SlaveEndpointTest.NoAuthorizer/0 (30 ms)
[ RUN      ] Endpoint/SlaveEndpointTest.NoAuthorizer/1
I0922 02:03:23.525887  8665 containerizer.cpp:292] Using isolation { environment_secret, posix/cpu,
posix/mem, filesystem/posix, network/cni }
W0922 02:03:23.526335  8665 backend.cpp:76] Failed to create 'aufs' backend: AufsBackend requires
root privileges
W0922 02:03:23.526439  8665 backend.cpp:76] Failed to create 'bind' backend: BindBackend requires
root privileges
I0922 02:03:23.526469  8665 provisioner.cpp:255] Using default backend 'copy'
I0922 02:03:23.528117  8665 cluster.cpp:448] Creating default 'local' authorizer
I0922 02:03:23.530362 30193 slave.cpp:254] Mesos agent started on (822)@172.17.0.2:38078
I0922 02:03:23.530383 30193 slave.cpp:255] Flags at startup: --acls="" --appc_simple_discovery_uri_prefix="http://"
--appc_store_dir="/tmp/Endpoint_SlaveEndpointTest_NoAuthorizer_1_K3QHMO/store/appc" --authenticate_http_executors="true"
--authenticate_http_readonly="true" --authenticate_http_readwrite="true" --authenticatee="crammd5"
--authentication_backoff_factor="1secs" --authorizer="local" --cgroups_cpu_enable_pids_and_tids_count="false"
--cgroups_enable_cfs="false" --cgroups_hierarchy="/sys/fs/cgroup" --cgroups_limit_swap="false"
--cgroups_root="mesos" --container_disk_watch_interval="15secs" --containerizers="mesos" --credential="/tmp/Endpoint_SlaveEndpointTest_NoAuthorizer_1_K3QHMO/credential"
--default_role="*" --disallow_sharing_agent_pid_namespace="false" --disk_watch_interval="1mins"
--docker="docker" --docker_kill_orphans="true" --docker_registry="https://registry-1.docker.io"
--docker_remove_delay="6hrs" --docker_socket="/var/run/docker.sock" --docker_stop_timeout="0ns"
--docker_store_dir="/tmp/Endpoint_SlaveEndpointTest_NoAuthorizer_1_K3QHMO/store/docker" --docker_volume_checkpoint_dir="/var/run/mesos/isolators/docker/volume"
--enforce_container_disk_quota="false" --executor_registration_timeout="1mins" --executor_reregistration_timeout="2secs"
--executor_secret_key="/tmp/Endpoint_SlaveEndpointTest_NoAuthorizer_1_K3QHMO/executor_secret_key"
--executor_shutdown_grace_period="5secs" --fetcher_cache_dir="/tmp/Endpoint_SlaveEndpointTest_NoAuthorizer_1_K3QHMO/fetch"
--fetcher_cache_size="2GB" --frameworks_home="" --gc_delay="1weeks" --gc_disk_headroom="0.1"
--hadoop_home="" --help="false" --hostname_lookup="true" --http_command_executor="false" --http_credentials="/tmp/Endpoint_SlaveEndpointTest_NoAuthorizer_1_K3QHMO/http_credentials"
--http_heartbeat_interval="30secs" --initialize_driver_logging="true" --isolation="posix/cpu,posix/mem"
--launcher="posix" --launcher_dir="/mesos/mesos-1.5.0/_build/src" --logbufsecs="0" --logging_level="INFO"
--max_completed_executors_per_framework="150" --oversubscribed_resources_interval="15secs"
--perf_duration="10secs" --perf_interval="1mins" --port="5051" --qos_correction_interval_min="0ns"
--quiet="false" --recover="reconnect" --recovery_timeout="15mins" --registration_backoff_factor="10ms"
--resources="cpus:2;gpus:0;mem:1024;disk:1024;ports:[31000-32000]" --revocable_cpu_low_priority="true"
--runtime_dir="/tmp/Endpoint_SlaveEndpointTest_NoAuthorizer_1_K3QHMO" --sandbox_directory="/mnt/mesos/sandbox"
--strict="true" --switch_user="true" --systemd_enable_support="true" --systemd_runtime_directory="/run/systemd/system"
--version="false" --work_dir="/tmp/Endpoint_SlaveEndpointTest_NoAuthorizer_1_juQPxm" --zk_session_timeout="10secs"
I0922 02:03:23.530766 30193 credentials.hpp:86] Loading credential for authentication from
'/tmp/Endpoint_SlaveEndpointTest_NoAuthorizer_1_K3QHMO/credential'
I0922 02:03:23.530915 30193 slave.cpp:287] Agent using credential for: test-principal
I0922 02:03:23.530942 30193 credentials.hpp:37] Loading credentials for authentication from
'/tmp/Endpoint_SlaveEndpointTest_NoAuthorizer_1_K3QHMO/http_credentials'
I0922 02:03:23.531240 30193 http.cpp:1045] Creating default 'basic' HTTP authenticator for
realm 'mesos-agent-executor'
I0922 02:03:23.531370 30193 http.cpp:1066] Creating default 'jwt' HTTP authenticator for realm
'mesos-agent-executor'
I0922 02:03:23.531574 30193 http.cpp:1045] Creating default 'basic' HTTP authenticator for
realm 'mesos-agent-readonly'
I0922 02:03:23.531684 30193 http.cpp:1066] Creating default 'jwt' HTTP authenticator for realm
'mesos-agent-readonly'
I0922 02:03:23.531874 30193 http.cpp:1045] Creating default 'basic' HTTP authenticator for
realm 'mesos-agent-readwrite'
I0922 02:03:23.531985 30193 http.cpp:1066] Creating default 'jwt' HTTP authenticator for realm
'mesos-agent-readwrite'
I0922 02:03:23.533398 30193 slave.cpp:585] Agent resources: [{"name":"cpus","scalar":{"value":2.0},"type":"SCALAR"},{"name":"mem","scalar":{"value":1024.0},"type":"SCALAR"},{"name":"disk","scalar":{"value":1024.0},"type":"SCALAR"},{"name":"ports","ranges":{"range":[{"begin":31000,"end":32000}]},"type":"RANGES"}]
I0922 02:03:23.533632 30193 slave.cpp:593] Agent attributes: [  ]
I0922 02:03:23.533653 30193 slave.cpp:602] Agent hostname: 4c4f36eb85cd
I0922 02:03:23.533807 30194 status_update_manager.cpp:177] Pausing sending status updates
I0922 02:03:23.535354 30196 state.cpp:64] Recovering state from '/tmp/Endpoint_SlaveEndpointTest_NoAuthorizer_1_juQPxm/meta'
I0922 02:03:23.535653 30216 status_update_manager.cpp:203] Recovering status update manager
I0922 02:03:23.535842 30214 containerizer.cpp:648] Recovering containerizer
I0922 02:03:23.537312 30197 provisioner.cpp:416] Provisioner recovery complete
I0922 02:03:23.537650 30194 slave.cpp:6322] Finished recovery
I0922 02:03:23.538223 30194 slave.cpp:6504] Querying resource estimator for oversubscribable
resources
I0922 02:03:23.538542 30202 slave.cpp:6518] Received oversubscribable resources {} from the
resource estimator
I0922 02:03:23.541256 30214 process.cpp:3929] Handling HTTP event for process 'slave(822)'
with path: '/slave(822)/monitor/statistics.json'
I0922 02:03:23.543305 30213 http.cpp:1185] HTTP GET for /slave(822)/monitor/statistics.json
from 172.17.0.2:58506
I0922 02:03:23.543428 30213 http.cpp:976] Authorizing principal 'test-principal' to GET the
'/monitor/statistics.json' endpoint
I0922 02:03:23.558946  8665 slave.cpp:869] Agent terminating
[       OK ] Endpoint/SlaveEndpointTest.NoAuthorizer/1 (54 ms)
[ RUN      ] Endpoint/SlaveEndpointTest.NoAuthorizer/2
I0922 02:03:23.582181  8665 containerizer.cpp:292] Using isolation { environment_secret, posix/cpu,
posix/mem, filesystem/posix, network/cni }
W0922 02:03:23.582700  8665 backend.cpp:76] Failed to create 'aufs' backend: AufsBackend requires
root privileges
W0922 02:03:23.582823  8665 backend.cpp:76] Failed to create 'bind' backend: BindBackend requires
root privileges
I0922 02:03:23.582859  8665 provisioner.cpp:255] Using default backend 'copy'
I0922 02:03:23.584537  8665 cluster.cpp:448] Creating default 'local' authorizer
I0922 02:03:23.586712 30197 slave.cpp:254] Mesos agent started on (823)@172.17.0.2:38078
I0922 02:03:23.586757 30197 slave.cpp:255] Flags at startup: --acls="" --appc_simple_discovery_uri_prefix="http://"
--appc_store_dir="/tmp/Endpoint_SlaveEndpointTest_NoAuthorizer_2_6JyLaE/store/appc" --authenticate_http_executors="true"
--authenticate_http_readonly="true" --authenticate_http_readwrite="true" --authenticatee="crammd5"
--authentication_backoff_factor="1secs" --authorizer="local" --cgroups_cpu_enable_pids_and_tids_count="false"
--cgroups_enable_cfs="false" --cgroups_hierarchy="/sys/fs/cgroup" --cgroups_limit_swap="false"
--cgroups_root="mesos" --container_disk_watch_interval="15secs" --containerizers="mesos" --credential="/tmp/Endpoint_SlaveEndpointTest_NoAuthorizer_2_6JyLaE/credential"
--default_role="*" --disallow_sharing_agent_pid_namespace="false" --disk_watch_interval="1mins"
--docker="docker" --docker_kill_orphans="true" --docker_registry="https://registry-1.docker.io"
--docker_remove_delay="6hrs" --docker_socket="/var/run/docker.sock" --docker_stop_timeout="0ns"
--docker_store_dir="/tmp/Endpoint_SlaveEndpointTest_NoAuthorizer_2_6JyLaE/store/docker" --docker_volume_checkpoint_dir="/var/run/mesos/isolators/docker/volume"
--enforce_container_disk_quota="false" --executor_registration_timeout="1mins" --executor_reregistration_timeout="2secs"
--executor_secret_key="/tmp/Endpoint_SlaveEndpointTest_NoAuthorizer_2_6JyLaE/executor_secret_key"
--executor_shutdown_grace_period="5secs" --fetcher_cache_dir="/tmp/Endpoint_SlaveEndpointTest_NoAuthorizer_2_6JyLaE/fetch"
--fetcher_cache_size="2GB" --frameworks_home="" --gc_delay="1weeks" --gc_disk_headroom="0.1"
--hadoop_home="" --help="false" --hostname_lookup="true" --http_command_executor="false" --http_credentials="/tmp/Endpoint_SlaveEndpointTest_NoAuthorizer_2_6JyLaE/http_credentials"
--http_heartbeat_interval="30secs" --initialize_driver_logging="true" --isolation="posix/cpu,posix/mem"
--launcher="posix" --launcher_dir="/mesos/mesos-1.5.0/_build/src" --logbufsecs="0" --logging_level="INFO"
--max_completed_executors_per_framework="150" --oversubscribed_resources_interval="15secs"
--perf_duration="10secs" --perf_interval="1mins" --port="5051" --qos_correction_interval_min="0ns"
--quiet="false" --recover="reconnect" --recovery_timeout="15mins" --registration_backoff_factor="10ms"
--resources="cpus:2;gpus:0;mem:1024;disk:1024;ports:[31000-32000]" --revocable_cpu_low_priority="true"
--runtime_dir="/tmp/Endpoint_SlaveEndpointTest_NoAuthorizer_2_6JyLaE" --sandbox_directory="/mnt/mesos/sandbox"
--strict="true" --switch_user="true" --systemd_enable_support="true" --systemd_runtime_directory="/run/systemd/system"
--version="false" --work_dir="/tmp/Endpoint_SlaveEndpointTest_NoAuthorizer_2_XprDNb" --zk_session_timeout="10secs"
I0922 02:03:23.587327 30197 credentials.hpp:86] Loading credential for authentication from
'/tmp/Endpoint_SlaveEndpointTest_NoAuthorizer_2_6JyLaE/credential'
I0922 02:03:23.587613 30197 slave.cpp:287] Agent using credential for: test-principal
I0922 02:03:23.587637 30197 credentials.hpp:37] Loading credentials for authentication from
'/tmp/Endpoint_SlaveEndpointTest_NoAuthorizer_2_6JyLaE/http_credentials'
I0922 02:03:23.588009 30197 http.cpp:1045] Creating default 'basic' HTTP authenticator for
realm 'mesos-agent-executor'
I0922 02:03:23.588244 30197 http.cpp:1066] Creating default 'jwt' HTTP authenticator for realm
'mesos-agent-executor'
I0922 02:03:23.588541 30197 http.cpp:1045] Creating default 'basic' HTTP authenticator for
realm 'mesos-agent-readonly'
I0922 02:03:23.588670 30197 http.cpp:1066] Creating default 'jwt' HTTP authenticator for realm
'mesos-agent-readonly'
I0922 02:03:23.588896 30197 http.cpp:1045] Creating default 'basic' HTTP authenticator for
realm 'mesos-agent-readwrite'
I0922 02:03:23.589012 30197 http.cpp:1066] Creating default 'jwt' HTTP authenticator for realm
'mesos-agent-readwrite'
I0922 02:03:23.590692 30197 slave.cpp:585] Agent resources: [{"name":"cpus","scalar":{"value":2.0},"type":"SCALAR"},{"name":"mem","scalar":{"value":1024.0},"type":"SCALAR"},{"name":"disk","scalar":{"value":1024.0},"type":"SCALAR"},{"name":"ports","ranges":{"range":[{"begin":31000,"end":32000}]},"type":"RANGES"}]
I0922 02:03:23.590950 30197 slave.cpp:593] Agent attributes: [  ]
I0922 02:03:23.590963 30197 slave.cpp:602] Agent hostname: 4c4f36eb85cd
I0922 02:03:23.591204 30204 status_update_manager.cpp:177] Pausing sending status updates
I0922 02:03:23.592875 30200 state.cpp:64] Recovering state from '/tmp/Endpoint_SlaveEndpointTest_NoAuthorizer_2_XprDNb/meta'
I0922 02:03:23.593382 30193 status_update_manager.cpp:203] Recovering status update manager
I0922 02:03:23.593688 30213 containerizer.cpp:648] Recovering containerizer
I0922 02:03:23.595417 30214 provisioner.cpp:416] Provisioner recovery complete
I0922 02:03:23.595877 30211 slave.cpp:6322] Finished recovery
I0922 02:03:23.596385 30211 slave.cpp:6504] Querying resource estimator for oversubscribable
resources
I0922 02:03:23.596647 30199 slave.cpp:6518] Received oversubscribable resources {} from the
resource estimator
I0922 02:03:23.599643 30216 process.cpp:3929] Handling HTTP event for process 'slave(823)'
with path: '/slave(823)/containers'
I0922 02:03:23.602252 30203 http.cpp:1185] HTTP GET for /slave(823)/containers from 172.17.0.2:58510
I0922 02:03:23.602385 30203 http.cpp:976] Authorizing principal 'test-principal' to GET the
'/containers' endpoint
I0922 02:03:23.606897 30200 slave.cpp:869] Agent terminating
[       OK ] Endpoint/SlaveEndpointTest.NoAuthorizer/2 (37 ms)
[----------] 9 tests from Endpoint/SlaveEndpointTest (296 ms total)

[----------] 2 tests from ContainerizerType/DefaultContainerDNSFlagTest
[ RUN      ] ContainerizerType/DefaultContainerDNSFlagTest.ValidateFlag/0
[       OK ] ContainerizerType/DefaultContainerDNSFlagTest.ValidateFlag/0 (10 ms)
[ RUN      ] ContainerizerType/DefaultContainerDNSFlagTest.ValidateFlag/1
[       OK ] ContainerizerType/DefaultContainerDNSFlagTest.ValidateFlag/1 (10 ms)
[----------] 2 tests from ContainerizerType/DefaultContainerDNSFlagTest (20 ms total)

[----------] Global test environment tear-down
[==========] 1684 tests from 186 test cases ran. (661763 ms total)
[  PASSED  ] 1678 tests.
[  FAILED  ] 6 tests, listed below:
[  FAILED  ] CommandExecutorCheckTest.CommandCheckDeliveredAndReconciled
[  FAILED  ] DefaultExecutorCheckTest.CommandCheckDeliveredAndReconciled
[  FAILED  ] DefaultExecutorCheckTest.CommandCheckStatusChange
[  FAILED  ] DefaultExecutorCheckTest.CommandCheckSeesParentsEnv
[  FAILED  ] DefaultExecutorCheckTest.CommandCheckSharesWorkDirWithTask
[  FAILED  ] OversubscriptionTest.RescindRevocableOfferWithIncreasedRevocable

 6 FAILED TESTS
  YOU HAVE 20 DISABLED TESTS

I0922 02:03:23.710005 30217 process.cpp:1068] Failed to accept socket: future discarded
make[4]: *** [check-local] Error 1
make[4]: Leaving directory `/mesos/mesos-1.5.0/_build/src'
make[3]: *** [check-am] Error 2
make[3]: Leaving directory `/mesos/mesos-1.5.0/_build/src'
make[2]: *** [check] Error 2
make[2]: Leaving directory `/mesos/mesos-1.5.0/_build/src'
make[1]: *** [check-recursive] Error 1
make[1]: Leaving directory `/mesos/mesos-1.5.0/_build'
make: *** [distcheck] Error 1
+ docker rmi mesos-1506042264-14333
Untagged: mesos-1506042264-14333:latest
Deleted: sha256:08882e798d812fb90696df2137aeca1e798dbaed5c246509f3593120a08b454d
Deleted: sha256:53edcb5c2581ce0cfdd41d10bef383da15e3b19b7f1be0c640bbaae31fe0882b
Deleted: sha256:75d0fc9a744aaef34302a6bca7cf4910bb8a413eacc5a922e24febbef60746d7
Deleted: sha256:178a6fe05f273cf21558b44bded86fb3c918b53cbc9104bc66649af10960b3e2
Deleted: sha256:fabd11af0a4ee4076803a03aa0cbc7e808dfb28aa0e7343ce92e56a30537acc8
Deleted: sha256:0a839a9ef7c88cc555a685caf98b9c13cfad1095710f8b7c07534d341b3741e8
Deleted: sha256:61b454ba26fa52ec5d748cf76f0a9aef7ae81a6a7021ab58760e60346c4a19c9
Deleted: sha256:6eded8e965d13119d1b39a8b4149debc7c48fa9a8a9c632b21114eaa73c3a5de
Deleted: sha256:c7145f999742c37047d98ef4250d852bcbeabd06599124ee0c3fd18426fc2e1b
Deleted: sha256:2648b23109fa79df310aeff5880a7415e359de8575f78a839d0c7b5da32546f6
Deleted: sha256:89b65702e4619a9a9d6cce4b319c76d8899d3e262d49de649703ec0a41dc17fa
Deleted: sha256:797ca085c6aaed3070d7d8a84c01e21422bec4e50862e8c529ca0f3a3884eb6d
Deleted: sha256:ad02c853a29a691e9243538681cb9e6864c3700cd79702324bbf7948a84b7052
Deleted: sha256:9a4fab577924c2afd655a85620aa34eef9186622ea1ed4c012de6acdb2f4b27d
Deleted: sha256:345507503cda4533272f61771c43213dbee5ab1d3599e607d7e7890141ae8b27
Deleted: sha256:e5cdbf1c9be519c0264b9e52755c0da1709c0714a61dd2e0a102756901400921
Deleted: sha256:b433a4d078b1098fff7bb98f817aa96f9bfd0ae52bd49acd9b6209a0fc0ad670
Deleted: sha256:e6a7f7da19b02a350ed6b3b42f94235b50cd87f6e11bab7e6d79a33a9bd633a7
Deleted: sha256:2a5c690c29957ede83d6640e3deac6adcd79f47c4890f0a49769f8be550b107b
Deleted: sha256:be90d5463711da600c217417123751977ae4aac24a9d86172fa826acd592df53
Deleted: sha256:1b973ee2324fda2a93a177ce89a02c784cc7d7a1d3ded1a6b6ba17c3f6dc948c
Deleted: sha256:02c1814765ec996be760062f0761a04f6eb49fe68a06ab1b7b23eb36fba65c56
Deleted: sha256:8829ef424d200fb2371cb405f2a80ad96b476acd46f2770ba98e0732cb740f8a
Deleted: sha256:591d8c8353a94012395a118bd946cdf18827a4324f5dff04d3d6613dc5099e31
Deleted: sha256:4aeb5d843665eaf10701bb2eb9097fe909bc14b1b3b9c11c424e82184d3969ad
Deleted: sha256:4a750e0a474123f5c5052b5dfa4110a46af4ddc633d18898c208a30052681a0b
Deleted: sha256:e3cce6bfad43789b0e6acc4c8d18d65f9b8d64bd8ade2bddcbfb47e5337088d6
Deleted: sha256:afff4941a1054be22cf4abfb579a0d00a7c76ff2212a02b84e0ba3766253f12e
Build step 'Execute shell' marked build as failure

Mime
View raw message