mesos-builds mailing list archives

Site index · List index
Message view « Date » · « Thread »
Top « Date » · « Thread »
From Apache Jenkins Server <jenk...@builds.apache.org>
Subject Build failed in Jenkins: Mesos-Buildbot » autotools,gcc,--verbose,GLOG_v=1 MESOS_VERBOSE=1,centos:7,(ubuntu)&&(!ubuntu-us1)&&(!ubuntu-eu2) #4191
Date Sun, 03 Sep 2017 01:24:54 GMT
See <https://builds.apache.org/job/Mesos-Buildbot/BUILDTOOL=autotools,COMPILER=gcc,CONFIGURATION=--verbose,ENVIRONMENT=GLOG_v=1%20MESOS_VERBOSE=1,OS=centos%3A7,label_exp=(ubuntu)&&(!ubuntu-us1)&&(!ubuntu-eu2)/4191/display/redirect>

------------------------------------------
[...truncated 30.89 MB...]
I0903 01:24:27.963626  6112 slave.cpp:565] Agent resources: [{"name":"cpus","scalar":{"value":2.0},"type":"SCALAR"},{"name":"mem","scalar":{"value":1024.0},"type":"SCALAR"},{"name":"disk","scalar":{"value":1024.0},"type":"SCALAR"},{"name":"ports","ranges":{"range":[{"begin":31000,"end":32000}]},"type":"RANGES"}]
I0903 01:24:27.964073  6112 slave.cpp:573] Agent attributes: [  ]
I0903 01:24:27.964095  6112 slave.cpp:582] Agent hostname: 85c9db29604a
I0903 01:24:27.964431  6114 status_update_manager.cpp:177] Pausing sending status updates
I0903 01:24:27.966580  6118 state.cpp:64] Recovering state from '/tmp/Endpoint_SlaveEndpointTest_AuthorizedRequest_2_xodIQ3/meta'
I0903 01:24:27.967119  6114 status_update_manager.cpp:203] Recovering status update manager
I0903 01:24:27.967489  6112 containerizer.cpp:609] Recovering containerizer
I0903 01:24:27.969965  6112 provisioner.cpp:416] Provisioner recovery complete
I0903 01:24:27.970537  6113 slave.cpp:6295] Finished recovery
I0903 01:24:27.971264  6113 slave.cpp:6477] Querying resource estimator for oversubscribable
resources
I0903 01:24:27.971693  6119 slave.cpp:6491] Received oversubscribable resources {} from the
resource estimator
I0903 01:24:27.975842  6115 process.cpp:3933] Handling HTTP event for process 'slave(796)'
with path: '/slave(796)/containers'
I0903 01:24:27.977926  6119 http.cpp:1166] HTTP GET for /slave(796)/containers from 172.17.0.2:55772
I0903 01:24:27.978076  6119 http.cpp:957] Authorizing principal 'test-principal' to GET the
'/containers' endpoint
I0903 01:24:27.984143  6093 slave.cpp:843] Agent terminating
[       OK ] Endpoint/SlaveEndpointTest.AuthorizedRequest/2 (50 ms)
[ RUN      ] Endpoint/SlaveEndpointTest.UnauthorizedRequest/0
I0903 01:24:28.002650  6093 containerizer.cpp:246] Using isolation: posix/cpu,posix/mem,filesystem/posix,network/cni,environment_secret
W0903 01:24:28.003439  6093 backend.cpp:76] Failed to create 'overlay' backend: OverlayBackend
requires root privileges
W0903 01:24:28.003640  6093 backend.cpp:76] Failed to create 'bind' backend: BindBackend requires
root privileges
I0903 01:24:28.003685  6093 provisioner.cpp:255] Using default backend 'copy'
I0903 01:24:28.009377  6119 slave.cpp:250] Mesos agent started on (797)@172.17.0.2:46631
I0903 01:24:28.009420  6119 slave.cpp:251] Flags at startup: --acls="" --appc_simple_discovery_uri_prefix="http://"
--appc_store_dir="/tmp/Endpoint_SlaveEndpointTest_UnauthorizedRequest_0_ekkl2i/store/appc"
--authenticate_http_readonly="true" --authenticate_http_readwrite="true" --authenticatee="crammd5"
--authentication_backoff_factor="1secs" --authorizer="local" --cgroups_cpu_enable_pids_and_tids_count="false"
--cgroups_enable_cfs="false" --cgroups_hierarchy="/sys/fs/cgroup" --cgroups_limit_swap="false"
--cgroups_root="mesos" --container_disk_watch_interval="15secs" --containerizers="mesos" --credential="/tmp/Endpoint_SlaveEndpointTest_UnauthorizedRequest_0_ekkl2i/credential"
--default_role="*" --disallow_sharing_agent_pid_namespace="false" --disk_watch_interval="1mins"
--docker="docker" --docker_kill_orphans="true" --docker_registry="https://registry-1.docker.io"
--docker_remove_delay="6hrs" --docker_socket="/var/run/docker.sock" --docker_stop_timeout="0ns"
--docker_store_dir="/tmp/Endpoint_SlaveEndpointTest_UnauthorizedRequest_0_ekkl2i/store/docker"
--docker_volume_checkpoint_dir="/var/run/mesos/isolators/docker/volume" --enforce_container_disk_quota="false"
--executor_registration_timeout="1mins" --executor_reregistration_timeout="2secs" --executor_shutdown_grace_period="5secs"
--fetcher_cache_dir="/tmp/Endpoint_SlaveEndpointTest_UnauthorizedRequest_0_ekkl2i/fetch" --fetcher_cache_size="2GB"
--frameworks_home="" --gc_delay="1weeks" --gc_disk_headroom="0.1" --hadoop_home="" --help="false"
--hostname_lookup="true" --http_command_executor="false" --http_credentials="/tmp/Endpoint_SlaveEndpointTest_UnauthorizedRequest_0_ekkl2i/http_credentials"
--http_heartbeat_interval="30secs" --initialize_driver_logging="true" --isolation="posix/cpu,posix/mem"
--launcher="posix" --launcher_dir="/mesos/mesos-1.4.0/_build/src" --logbufsecs="0" --logging_level="INFO"
--max_completed_executors_per_framework="150" --oversubscribed_resources_interval="15secs"
--perf_duration="10secs" --perf_interval="1mins" --port="5051" --qos_correction_interval_min="0ns"
--quiet="false" --recover="reconnect" --recovery_timeout="15mins" --registration_backoff_factor="10ms"
--resources="cpus:2;gpus:0;mem:1024;disk:1024;ports:[31000-32000]" --revocable_cpu_low_priority="true"
--runtime_dir="/tmp/Endpoint_SlaveEndpointTest_UnauthorizedRequest_0_ekkl2i" --sandbox_directory="/mnt/mesos/sandbox"
--strict="true" --switch_user="true" --systemd_enable_support="true" --systemd_runtime_directory="/run/systemd/system"
--version="false" --work_dir="/tmp/Endpoint_SlaveEndpointTest_UnauthorizedRequest_0_V8hpXf"
I0903 01:24:28.010165  6119 credentials.hpp:86] Loading credential for authentication from
'/tmp/Endpoint_SlaveEndpointTest_UnauthorizedRequest_0_ekkl2i/credential'
I0903 01:24:28.010416  6119 slave.cpp:283] Agent using credential for: test-principal
I0903 01:24:28.010439  6119 credentials.hpp:37] Loading credentials for authentication from
'/tmp/Endpoint_SlaveEndpointTest_UnauthorizedRequest_0_ekkl2i/http_credentials'
I0903 01:24:28.010807  6119 http.cpp:1026] Creating default 'basic' HTTP authenticator for
realm 'mesos-agent-readonly'
I0903 01:24:28.011119  6119 http.cpp:1026] Creating default 'basic' HTTP authenticator for
realm 'mesos-agent-readwrite'
I0903 01:24:28.013402  6119 slave.cpp:565] Agent resources: [{"name":"cpus","scalar":{"value":2.0},"type":"SCALAR"},{"name":"mem","scalar":{"value":1024.0},"type":"SCALAR"},{"name":"disk","scalar":{"value":1024.0},"type":"SCALAR"},{"name":"ports","ranges":{"range":[{"begin":31000,"end":32000}]},"type":"RANGES"}]
I0903 01:24:28.013845  6119 slave.cpp:573] Agent attributes: [  ]
I0903 01:24:28.013869  6119 slave.cpp:582] Agent hostname: 85c9db29604a
I0903 01:24:28.014147  6118 status_update_manager.cpp:177] Pausing sending status updates
I0903 01:24:28.016343  6117 state.cpp:64] Recovering state from '/tmp/Endpoint_SlaveEndpointTest_UnauthorizedRequest_0_V8hpXf/meta'
I0903 01:24:28.016832  6112 status_update_manager.cpp:203] Recovering status update manager
I0903 01:24:28.017144  6115 containerizer.cpp:609] Recovering containerizer
I0903 01:24:28.019436  6116 provisioner.cpp:416] Provisioner recovery complete
I0903 01:24:28.019963  6112 slave.cpp:6295] Finished recovery
I0903 01:24:28.020629  6112 slave.cpp:6477] Querying resource estimator for oversubscribable
resources
I0903 01:24:28.021039  6113 slave.cpp:6491] Received oversubscribable resources {} from the
resource estimator
I0903 01:24:28.025071  6117 process.cpp:3933] Handling HTTP event for process 'slave(797)'
with path: '/slave(797)/monitor/statistics'
I0903 01:24:28.027109  6113 http.cpp:1166] HTTP GET for /slave(797)/monitor/statistics from
172.17.0.2:55774
I0903 01:24:28.027297  6113 http.cpp:957] Authorizing principal 'test-principal' to GET the
'/monitor/statistics' endpoint
I0903 01:24:28.031285  6112 slave.cpp:843] Agent terminating
[       OK ] Endpoint/SlaveEndpointTest.UnauthorizedRequest/0 (46 ms)
[ RUN      ] Endpoint/SlaveEndpointTest.UnauthorizedRequest/1
I0903 01:24:28.049015  6093 containerizer.cpp:246] Using isolation: posix/cpu,posix/mem,filesystem/posix,network/cni,environment_secret
W0903 01:24:28.049803  6093 backend.cpp:76] Failed to create 'overlay' backend: OverlayBackend
requires root privileges
W0903 01:24:28.050004  6093 backend.cpp:76] Failed to create 'bind' backend: BindBackend requires
root privileges
I0903 01:24:28.050057  6093 provisioner.cpp:255] Using default backend 'copy'
I0903 01:24:28.055725  6119 slave.cpp:250] Mesos agent started on (798)@172.17.0.2:46631
I0903 01:24:28.055768  6119 slave.cpp:251] Flags at startup: --acls="" --appc_simple_discovery_uri_prefix="http://"
--appc_store_dir="/tmp/Endpoint_SlaveEndpointTest_UnauthorizedRequest_1_gnCMLv/store/appc"
--authenticate_http_readonly="true" --authenticate_http_readwrite="true" --authenticatee="crammd5"
--authentication_backoff_factor="1secs" --authorizer="local" --cgroups_cpu_enable_pids_and_tids_count="false"
--cgroups_enable_cfs="false" --cgroups_hierarchy="/sys/fs/cgroup" --cgroups_limit_swap="false"
--cgroups_root="mesos" --container_disk_watch_interval="15secs" --containerizers="mesos" --credential="/tmp/Endpoint_SlaveEndpointTest_UnauthorizedRequest_1_gnCMLv/credential"
--default_role="*" --disallow_sharing_agent_pid_namespace="false" --disk_watch_interval="1mins"
--docker="docker" --docker_kill_orphans="true" --docker_registry="https://registry-1.docker.io"
--docker_remove_delay="6hrs" --docker_socket="/var/run/docker.sock" --docker_stop_timeout="0ns"
--docker_store_dir="/tmp/Endpoint_SlaveEndpointTest_UnauthorizedRequest_1_gnCMLv/store/docker"
--docker_volume_checkpoint_dir="/var/run/mesos/isolators/docker/volume" --enforce_container_disk_quota="false"
--executor_registration_timeout="1mins" --executor_reregistration_timeout="2secs" --executor_shutdown_grace_period="5secs"
--fetcher_cache_dir="/tmp/Endpoint_SlaveEndpointTest_UnauthorizedRequest_1_gnCMLv/fetch" --fetcher_cache_size="2GB"
--frameworks_home="" --gc_delay="1weeks" --gc_disk_headroom="0.1" --hadoop_home="" --help="false"
--hostname_lookup="true" --http_command_executor="false" --http_credentials="/tmp/Endpoint_SlaveEndpointTest_UnauthorizedRequest_1_gnCMLv/http_credentials"
--http_heartbeat_interval="30secs" --initialize_driver_logging="true" --isolation="posix/cpu,posix/mem"
--launcher="posix" --launcher_dir="/mesos/mesos-1.4.0/_build/src" --logbufsecs="0" --logging_level="INFO"
--max_completed_executors_per_framework="150" --oversubscribed_resources_interval="15secs"
--perf_duration="10secs" --perf_interval="1mins" --port="5051" --qos_correction_interval_min="0ns"
--quiet="false" --recover="reconnect" --recovery_timeout="15mins" --registration_backoff_factor="10ms"
--resources="cpus:2;gpus:0;mem:1024;disk:1024;ports:[31000-32000]" --revocable_cpu_low_priority="true"
--runtime_dir="/tmp/Endpoint_SlaveEndpointTest_UnauthorizedRequest_1_gnCMLv" --sandbox_directory="/mnt/mesos/sandbox"
--strict="true" --switch_user="true" --systemd_enable_support="true" --systemd_runtime_directory="/run/systemd/system"
--version="false" --work_dir="/tmp/Endpoint_SlaveEndpointTest_UnauthorizedRequest_1_BKjkzs"
I0903 01:24:28.056524  6119 credentials.hpp:86] Loading credential for authentication from
'/tmp/Endpoint_SlaveEndpointTest_UnauthorizedRequest_1_gnCMLv/credential'
I0903 01:24:28.056785  6119 slave.cpp:283] Agent using credential for: test-principal
I0903 01:24:28.056816  6119 credentials.hpp:37] Loading credentials for authentication from
'/tmp/Endpoint_SlaveEndpointTest_UnauthorizedRequest_1_gnCMLv/http_credentials'
I0903 01:24:28.057216  6119 http.cpp:1026] Creating default 'basic' HTTP authenticator for
realm 'mesos-agent-readonly'
I0903 01:24:28.057494  6119 http.cpp:1026] Creating default 'basic' HTTP authenticator for
realm 'mesos-agent-readwrite'
I0903 01:24:28.059811  6119 slave.cpp:565] Agent resources: [{"name":"cpus","scalar":{"value":2.0},"type":"SCALAR"},{"name":"mem","scalar":{"value":1024.0},"type":"SCALAR"},{"name":"disk","scalar":{"value":1024.0},"type":"SCALAR"},{"name":"ports","ranges":{"range":[{"begin":31000,"end":32000}]},"type":"RANGES"}]
I0903 01:24:28.060256  6119 slave.cpp:573] Agent attributes: [  ]
I0903 01:24:28.060278  6119 slave.cpp:582] Agent hostname: 85c9db29604a
I0903 01:24:28.060607  6114 status_update_manager.cpp:177] Pausing sending status updates
I0903 01:24:28.062723  6113 state.cpp:64] Recovering state from '/tmp/Endpoint_SlaveEndpointTest_UnauthorizedRequest_1_BKjkzs/meta'
I0903 01:24:28.063204  6114 status_update_manager.cpp:203] Recovering status update manager
I0903 01:24:28.063508  6119 containerizer.cpp:609] Recovering containerizer
I0903 01:24:28.065668  6116 provisioner.cpp:416] Provisioner recovery complete
I0903 01:24:28.066480  6113 slave.cpp:6295] Finished recovery
I0903 01:24:28.067204  6113 slave.cpp:6477] Querying resource estimator for oversubscribable
resources
I0903 01:24:28.067566  6119 slave.cpp:6491] Received oversubscribable resources {} from the
resource estimator
I0903 01:24:28.071591  6114 process.cpp:3933] Handling HTTP event for process 'slave(798)'
with path: '/slave(798)/monitor/statistics.json'
I0903 01:24:28.073786  6119 http.cpp:1166] HTTP GET for /slave(798)/monitor/statistics.json
from 172.17.0.2:55776
I0903 01:24:28.073909  6119 http.cpp:957] Authorizing principal 'test-principal' to GET the
'/monitor/statistics.json' endpoint
I0903 01:24:28.077355  6114 slave.cpp:843] Agent terminating
[       OK ] Endpoint/SlaveEndpointTest.UnauthorizedRequest/1 (46 ms)
[ RUN      ] Endpoint/SlaveEndpointTest.UnauthorizedRequest/2
I0903 01:24:28.095136  6093 containerizer.cpp:246] Using isolation: posix/cpu,posix/mem,filesystem/posix,network/cni,environment_secret
W0903 01:24:28.095916  6093 backend.cpp:76] Failed to create 'overlay' backend: OverlayBackend
requires root privileges
W0903 01:24:28.096118  6093 backend.cpp:76] Failed to create 'bind' backend: BindBackend requires
root privileges
I0903 01:24:28.096163  6093 provisioner.cpp:255] Using default backend 'copy'
I0903 01:24:28.102244  6119 slave.cpp:250] Mesos agent started on (799)@172.17.0.2:46631
I0903 01:24:28.102286  6119 slave.cpp:251] Flags at startup: --acls="" --appc_simple_discovery_uri_prefix="http://"
--appc_store_dir="/tmp/Endpoint_SlaveEndpointTest_UnauthorizedRequest_2_OCEcZI/store/appc"
--authenticate_http_readonly="true" --authenticate_http_readwrite="true" --authenticatee="crammd5"
--authentication_backoff_factor="1secs" --authorizer="local" --cgroups_cpu_enable_pids_and_tids_count="false"
--cgroups_enable_cfs="false" --cgroups_hierarchy="/sys/fs/cgroup" --cgroups_limit_swap="false"
--cgroups_root="mesos" --container_disk_watch_interval="15secs" --containerizers="mesos" --credential="/tmp/Endpoint_SlaveEndpointTest_UnauthorizedRequest_2_OCEcZI/credential"
--default_role="*" --disallow_sharing_agent_pid_namespace="false" --disk_watch_interval="1mins"
--docker="docker" --docker_kill_orphans="true" --docker_registry="https://registry-1.docker.io"
--docker_remove_delay="6hrs" --docker_socket="/var/run/docker.sock" --docker_stop_timeout="0ns"
--docker_store_dir="/tmp/Endpoint_SlaveEndpointTest_UnauthorizedRequest_2_OCEcZI/store/docker"
--docker_volume_checkpoint_dir="/var/run/mesos/isolators/docker/volume" --enforce_container_disk_quota="false"
--executor_registration_timeout="1mins" --executor_reregistration_timeout="2secs" --executor_shutdown_grace_period="5secs"
--fetcher_cache_dir="/tmp/Endpoint_SlaveEndpointTest_UnauthorizedRequest_2_OCEcZI/fetch" --fetcher_cache_size="2GB"
--frameworks_home="" --gc_delay="1weeks" --gc_disk_headroom="0.1" --hadoop_home="" --help="false"
--hostname_lookup="true" --http_command_executor="false" --http_credentials="/tmp/Endpoint_SlaveEndpointTest_UnauthorizedRequest_2_OCEcZI/http_credentials"
--http_heartbeat_interval="30secs" --initialize_driver_logging="true" --isolation="posix/cpu,posix/mem"
--launcher="posix" --launcher_dir="/mesos/mesos-1.4.0/_build/src" --logbufsecs="0" --logging_level="INFO"
--max_completed_executors_per_framework="150" --oversubscribed_resources_interval="15secs"
--perf_duration="10secs" --perf_interval="1mins" --port="5051" --qos_correction_interval_min="0ns"
--quiet="false" --recover="reconnect" --recovery_timeout="15mins" --registration_backoff_factor="10ms"
--resources="cpus:2;gpus:0;mem:1024;disk:1024;ports:[31000-32000]" --revocable_cpu_low_priority="true"
--runtime_dir="/tmp/Endpoint_SlaveEndpointTest_UnauthorizedRequest_2_OCEcZI" --sandbox_directory="/mnt/mesos/sandbox"
--strict="true" --switch_user="true" --systemd_enable_support="true" --systemd_runtime_directory="/run/systemd/system"
--version="false" --work_dir="/tmp/Endpoint_SlaveEndpointTest_UnauthorizedRequest_2_ZoHgFF"
I0903 01:24:28.103006  6119 credentials.hpp:86] Loading credential for authentication from
'/tmp/Endpoint_SlaveEndpointTest_UnauthorizedRequest_2_OCEcZI/credential'
I0903 01:24:28.103255  6119 slave.cpp:283] Agent using credential for: test-principal
I0903 01:24:28.103279  6119 credentials.hpp:37] Loading credentials for authentication from
'/tmp/Endpoint_SlaveEndpointTest_UnauthorizedRequest_2_OCEcZI/http_credentials'
I0903 01:24:28.103631  6119 http.cpp:1026] Creating default 'basic' HTTP authenticator for
realm 'mesos-agent-readonly'
I0903 01:24:28.103902  6119 http.cpp:1026] Creating default 'basic' HTTP authenticator for
realm 'mesos-agent-readwrite'
I0903 01:24:28.106142  6119 slave.cpp:565] Agent resources: [{"name":"cpus","scalar":{"value":2.0},"type":"SCALAR"},{"name":"mem","scalar":{"value":1024.0},"type":"SCALAR"},{"name":"disk","scalar":{"value":1024.0},"type":"SCALAR"},{"name":"ports","ranges":{"range":[{"begin":31000,"end":32000}]},"type":"RANGES"}]
I0903 01:24:28.106580  6119 slave.cpp:573] Agent attributes: [  ]
I0903 01:24:28.106602  6119 slave.cpp:582] Agent hostname: 85c9db29604a
I0903 01:24:28.106847  6112 status_update_manager.cpp:177] Pausing sending status updates
I0903 01:24:28.108995  6115 state.cpp:64] Recovering state from '/tmp/Endpoint_SlaveEndpointTest_UnauthorizedRequest_2_ZoHgFF/meta'
I0903 01:24:28.109570  6116 status_update_manager.cpp:203] Recovering status update manager
I0903 01:24:28.109877  6115 containerizer.cpp:609] Recovering containerizer
I0903 01:24:28.112288  6115 provisioner.cpp:416] Provisioner recovery complete
I0903 01:24:28.113026  6112 slave.cpp:6295] Finished recovery
I0903 01:24:28.113613  6112 slave.cpp:6477] Querying resource estimator for oversubscribable
resources
I0903 01:24:28.113986  6118 slave.cpp:6491] Received oversubscribable resources {} from the
resource estimator
I0903 01:24:28.118013  6116 process.cpp:3933] Handling HTTP event for process 'slave(799)'
with path: '/slave(799)/containers'
I0903 01:24:28.120036  6118 http.cpp:1166] HTTP GET for /slave(799)/containers from 172.17.0.2:55778
I0903 01:24:28.120168  6118 http.cpp:957] Authorizing principal 'test-principal' to GET the
'/containers' endpoint
I0903 01:24:28.123754  6093 slave.cpp:843] Agent terminating
[       OK ] Endpoint/SlaveEndpointTest.UnauthorizedRequest/2 (46 ms)
[ RUN      ] Endpoint/SlaveEndpointTest.NoAuthorizer/0
I0903 01:24:28.141993  6093 containerizer.cpp:246] Using isolation: posix/cpu,posix/mem,filesystem/posix,network/cni,environment_secret
W0903 01:24:28.142876  6093 backend.cpp:76] Failed to create 'overlay' backend: OverlayBackend
requires root privileges
W0903 01:24:28.143084  6093 backend.cpp:76] Failed to create 'bind' backend: BindBackend requires
root privileges
I0903 01:24:28.143203  6093 provisioner.cpp:255] Using default backend 'copy'
I0903 01:24:28.146069  6093 cluster.cpp:448] Creating default 'local' authorizer
I0903 01:24:28.149327  6114 slave.cpp:250] Mesos agent started on (800)@172.17.0.2:46631
I0903 01:24:28.149369  6114 slave.cpp:251] Flags at startup: --acls="" --appc_simple_discovery_uri_prefix="http://"
--appc_store_dir="/tmp/Endpoint_SlaveEndpointTest_NoAuthorizer_0_AR6HGW/store/appc" --authenticate_http_readonly="true"
--authenticate_http_readwrite="true" --authenticatee="crammd5" --authentication_backoff_factor="1secs"
--authorizer="local" --cgroups_cpu_enable_pids_and_tids_count="false" --cgroups_enable_cfs="false"
--cgroups_hierarchy="/sys/fs/cgroup" --cgroups_limit_swap="false" --cgroups_root="mesos" --container_disk_watch_interval="15secs"
--containerizers="mesos" --credential="/tmp/Endpoint_SlaveEndpointTest_NoAuthorizer_0_AR6HGW/credential"
--default_role="*" --disallow_sharing_agent_pid_namespace="false" --disk_watch_interval="1mins"
--docker="docker" --docker_kill_orphans="true" --docker_registry="https://registry-1.docker.io"
--docker_remove_delay="6hrs" --docker_socket="/var/run/docker.sock" --docker_stop_timeout="0ns"
--docker_store_dir="/tmp/Endpoint_SlaveEndpointTest_NoAuthorizer_0_AR6HGW/store/docker" --docker_volume_checkpoint_dir="/var/run/mesos/isolators/docker/volume"
--enforce_container_disk_quota="false" --executor_registration_timeout="1mins" --executor_reregistration_timeout="2secs"
--executor_shutdown_grace_period="5secs" --fetcher_cache_dir="/tmp/Endpoint_SlaveEndpointTest_NoAuthorizer_0_AR6HGW/fetch"
--fetcher_cache_size="2GB" --frameworks_home="" --gc_delay="1weeks" --gc_disk_headroom="0.1"
--hadoop_home="" --help="false" --hostname_lookup="true" --http_command_executor="false" --http_credentials="/tmp/Endpoint_SlaveEndpointTest_NoAuthorizer_0_AR6HGW/http_credentials"
--http_heartbeat_interval="30secs" --initialize_driver_logging="true" --isolation="posix/cpu,posix/mem"
--launcher="posix" --launcher_dir="/mesos/mesos-1.4.0/_build/src" --logbufsecs="0" --logging_level="INFO"
--max_completed_executors_per_framework="150" --oversubscribed_resources_interval="15secs"
--perf_duration="10secs" --perf_interval="1mins" --port="5051" --qos_correction_interval_min="0ns"
--quiet="false" --recover="reconnect" --recovery_timeout="15mins" --registration_backoff_factor="10ms"
--resources="cpus:2;gpus:0;mem:1024;disk:1024;ports:[31000-32000]" --revocable_cpu_low_priority="true"
--runtime_dir="/tmp/Endpoint_SlaveEndpointTest_NoAuthorizer_0_AR6HGW" --sandbox_directory="/mnt/mesos/sandbox"
--strict="true" --switch_user="true" --systemd_enable_support="true" --systemd_runtime_directory="/run/systemd/system"
--version="false" --work_dir="/tmp/Endpoint_SlaveEndpointTest_NoAuthorizer_0_jJZffT"
I0903 01:24:28.150236  6114 credentials.hpp:86] Loading credential for authentication from
'/tmp/Endpoint_SlaveEndpointTest_NoAuthorizer_0_AR6HGW/credential'
I0903 01:24:28.150625  6114 slave.cpp:283] Agent using credential for: test-principal
I0903 01:24:28.150668  6114 credentials.hpp:37] Loading credentials for authentication from
'/tmp/Endpoint_SlaveEndpointTest_NoAuthorizer_0_AR6HGW/http_credentials'
I0903 01:24:28.151175  6114 http.cpp:1026] Creating default 'basic' HTTP authenticator for
realm 'mesos-agent-readonly'
I0903 01:24:28.151518  6114 http.cpp:1026] Creating default 'basic' HTTP authenticator for
realm 'mesos-agent-readwrite'
I0903 01:24:28.153923  6114 slave.cpp:565] Agent resources: [{"name":"cpus","scalar":{"value":2.0},"type":"SCALAR"},{"name":"mem","scalar":{"value":1024.0},"type":"SCALAR"},{"name":"disk","scalar":{"value":1024.0},"type":"SCALAR"},{"name":"ports","ranges":{"range":[{"begin":31000,"end":32000}]},"type":"RANGES"}]
I0903 01:24:28.154367  6114 slave.cpp:573] Agent attributes: [  ]
I0903 01:24:28.154389  6114 slave.cpp:582] Agent hostname: 85c9db29604a
I0903 01:24:28.154600  6116 status_update_manager.cpp:177] Pausing sending status updates
I0903 01:24:28.156855  6118 state.cpp:64] Recovering state from '/tmp/Endpoint_SlaveEndpointTest_NoAuthorizer_0_jJZffT/meta'
I0903 01:24:28.157361  6119 status_update_manager.cpp:203] Recovering status update manager
I0903 01:24:28.157661  6112 containerizer.cpp:609] Recovering containerizer
I0903 01:24:28.159857  6112 provisioner.cpp:416] Provisioner recovery complete
I0903 01:24:28.160436  6117 slave.cpp:6295] Finished recovery
I0903 01:24:28.161218  6117 slave.cpp:6477] Querying resource estimator for oversubscribable
resources
I0903 01:24:28.161550  6113 slave.cpp:6491] Received oversubscribable resources {} from the
resource estimator
I0903 01:24:28.165962  6119 process.cpp:3933] Handling HTTP event for process 'slave(800)'
with path: '/slave(800)/monitor/statistics'
I0903 01:24:28.168126  6113 http.cpp:1166] HTTP GET for /slave(800)/monitor/statistics from
172.17.0.2:55780
I0903 01:24:28.168246  6113 http.cpp:957] Authorizing principal 'test-principal' to GET the
'/monitor/statistics' endpoint
I0903 01:24:28.173557  6116 slave.cpp:843] Agent terminating
[       OK ] Endpoint/SlaveEndpointTest.NoAuthorizer/0 (49 ms)
[ RUN      ] Endpoint/SlaveEndpointTest.NoAuthorizer/1
I0903 01:24:28.192072  6093 containerizer.cpp:246] Using isolation: posix/cpu,posix/mem,filesystem/posix,network/cni,environment_secret
W0903 01:24:28.192848  6093 backend.cpp:76] Failed to create 'overlay' backend: OverlayBackend
requires root privileges
W0903 01:24:28.193051  6093 backend.cpp:76] Failed to create 'bind' backend: BindBackend requires
root privileges
I0903 01:24:28.193101  6093 provisioner.cpp:255] Using default backend 'copy'
I0903 01:24:28.195847  6093 cluster.cpp:448] Creating default 'local' authorizer
I0903 01:24:28.199009  6112 slave.cpp:250] Mesos agent started on (801)@172.17.0.2:46631
I0903 01:24:28.199050  6112 slave.cpp:251] Flags at startup: --acls="" --appc_simple_discovery_uri_prefix="http://"
--appc_store_dir="/tmp/Endpoint_SlaveEndpointTest_NoAuthorizer_1_M9xcUa/store/appc" --authenticate_http_readonly="true"
--authenticate_http_readwrite="true" --authenticatee="crammd5" --authentication_backoff_factor="1secs"
--authorizer="local" --cgroups_cpu_enable_pids_and_tids_count="false" --cgroups_enable_cfs="false"
--cgroups_hierarchy="/sys/fs/cgroup" --cgroups_limit_swap="false" --cgroups_root="mesos" --container_disk_watch_interval="15secs"
--containerizers="mesos" --credential="/tmp/Endpoint_SlaveEndpointTest_NoAuthorizer_1_M9xcUa/credential"
--default_role="*" --disallow_sharing_agent_pid_namespace="false" --disk_watch_interval="1mins"
--docker="docker" --docker_kill_orphans="true" --docker_registry="https://registry-1.docker.io"
--docker_remove_delay="6hrs" --docker_socket="/var/run/docker.sock" --docker_stop_timeout="0ns"
--docker_store_dir="/tmp/Endpoint_SlaveEndpointTest_NoAuthorizer_1_M9xcUa/store/docker" --docker_volume_checkpoint_dir="/var/run/mesos/isolators/docker/volume"
--enforce_container_disk_quota="false" --executor_registration_timeout="1mins" --executor_reregistration_timeout="2secs"
--executor_shutdown_grace_period="5secs" --fetcher_cache_dir="/tmp/Endpoint_SlaveEndpointTest_NoAuthorizer_1_M9xcUa/fetch"
--fetcher_cache_size="2GB" --frameworks_home="" --gc_delay="1weeks" --gc_disk_headroom="0.1"
--hadoop_home="" --help="false" --hostname_lookup="true" --http_command_executor="false" --http_credentials="/tmp/Endpoint_SlaveEndpointTest_NoAuthorizer_1_M9xcUa/http_credentials"
--http_heartbeat_interval="30secs" --initialize_driver_logging="true" --isolation="posix/cpu,posix/mem"
--launcher="posix" --launcher_dir="/mesos/mesos-1.4.0/_build/src" --logbufsecs="0" --logging_level="INFO"
--max_completed_executors_per_framework="150" --oversubscribed_resources_interval="15secs"
--perf_duration="10secs" --perf_interval="1mins" --port="5051" --qos_correction_interval_min="0ns"
--quiet="false" --recover="reconnect" --recovery_timeout="15mins" --registration_backoff_factor="10ms"
--resources="cpus:2;gpus:0;mem:1024;disk:1024;ports:[31000-32000]" --revocable_cpu_low_priority="true"
--runtime_dir="/tmp/Endpoint_SlaveEndpointTest_NoAuthorizer_1_M9xcUa" --sandbox_directory="/mnt/mesos/sandbox"
--strict="true" --switch_user="true" --systemd_enable_support="true" --systemd_runtime_directory="/run/systemd/system"
--version="false" --work_dir="/tmp/Endpoint_SlaveEndpointTest_NoAuthorizer_1_FIsEk7"
I0903 01:24:28.199807  6112 credentials.hpp:86] Loading credential for authentication from
'/tmp/Endpoint_SlaveEndpointTest_NoAuthorizer_1_M9xcUa/credential'
I0903 01:24:28.200079  6112 slave.cpp:283] Agent using credential for: test-principal
I0903 01:24:28.200107  6112 credentials.hpp:37] Loading credentials for authentication from
'/tmp/Endpoint_SlaveEndpointTest_NoAuthorizer_1_M9xcUa/http_credentials'
I0903 01:24:28.200481  6112 http.cpp:1026] Creating default 'basic' HTTP authenticator for
realm 'mesos-agent-readonly'
I0903 01:24:28.200769  6112 http.cpp:1026] Creating default 'basic' HTTP authenticator for
realm 'mesos-agent-readwrite'
I0903 01:24:28.202975  6112 slave.cpp:565] Agent resources: [{"name":"cpus","scalar":{"value":2.0},"type":"SCALAR"},{"name":"mem","scalar":{"value":1024.0},"type":"SCALAR"},{"name":"disk","scalar":{"value":1024.0},"type":"SCALAR"},{"name":"ports","ranges":{"range":[{"begin":31000,"end":32000}]},"type":"RANGES"}]
I0903 01:24:28.203416  6112 slave.cpp:573] Agent attributes: [  ]
I0903 01:24:28.203439  6112 slave.cpp:582] Agent hostname: 85c9db29604a
I0903 01:24:28.203697  6114 status_update_manager.cpp:177] Pausing sending status updates
I0903 01:24:28.205879  6115 state.cpp:64] Recovering state from '/tmp/Endpoint_SlaveEndpointTest_NoAuthorizer_1_FIsEk7/meta'
I0903 01:24:28.206387  6119 status_update_manager.cpp:203] Recovering status update manager
I0903 01:24:28.206673  6118 containerizer.cpp:609] Recovering containerizer
I0903 01:24:28.208890  6113 provisioner.cpp:416] Provisioner recovery complete
I0903 01:24:28.209367  6119 slave.cpp:6295] Finished recovery
I0903 01:24:28.210021  6119 slave.cpp:6477] Querying resource estimator for oversubscribable
resources
I0903 01:24:28.210407  6113 slave.cpp:6491] Received oversubscribable resources {} from the
resource estimator
I0903 01:24:28.214476  6116 process.cpp:3933] Handling HTTP event for process 'slave(801)'
with path: '/slave(801)/monitor/statistics.json'
I0903 01:24:28.216645  6117 http.cpp:1166] HTTP GET for /slave(801)/monitor/statistics.json
from 172.17.0.2:55782
I0903 01:24:28.216912  6117 http.cpp:957] Authorizing principal 'test-principal' to GET the
'/monitor/statistics.json' endpoint
I0903 01:24:28.222282  6093 slave.cpp:843] Agent terminating
[       OK ] Endpoint/SlaveEndpointTest.NoAuthorizer/1 (48 ms)
[ RUN      ] Endpoint/SlaveEndpointTest.NoAuthorizer/2
I0903 01:24:28.240506  6093 containerizer.cpp:246] Using isolation: posix/cpu,posix/mem,filesystem/posix,network/cni,environment_secret
W0903 01:24:28.241287  6093 backend.cpp:76] Failed to create 'overlay' backend: OverlayBackend
requires root privileges
W0903 01:24:28.241495  6093 backend.cpp:76] Failed to create 'bind' backend: BindBackend requires
root privileges
I0903 01:24:28.241541  6093 provisioner.cpp:255] Using default backend 'copy'
I0903 01:24:28.244313  6093 cluster.cpp:448] Creating default 'local' authorizer
I0903 01:24:28.247386  6114 slave.cpp:250] Mesos agent started on (802)@172.17.0.2:46631
I0903 01:24:28.247428  6114 slave.cpp:251] Flags at startup: --acls="" --appc_simple_discovery_uri_prefix="http://"
--appc_store_dir="/tmp/Endpoint_SlaveEndpointTest_NoAuthorizer_2_K4edDp/store/appc" --authenticate_http_readonly="true"
--authenticate_http_readwrite="true" --authenticatee="crammd5" --authentication_backoff_factor="1secs"
--authorizer="local" --cgroups_cpu_enable_pids_and_tids_count="false" --cgroups_enable_cfs="false"
--cgroups_hierarchy="/sys/fs/cgroup" --cgroups_limit_swap="false" --cgroups_root="mesos" --container_disk_watch_interval="15secs"
--containerizers="mesos" --credential="/tmp/Endpoint_SlaveEndpointTest_NoAuthorizer_2_K4edDp/credential"
--default_role="*" --disallow_sharing_agent_pid_namespace="false" --disk_watch_interval="1mins"
--docker="docker" --docker_kill_orphans="true" --docker_registry="https://registry-1.docker.io"
--docker_remove_delay="6hrs" --docker_socket="/var/run/docker.sock" --docker_stop_timeout="0ns"
--docker_store_dir="/tmp/Endpoint_SlaveEndpointTest_NoAuthorizer_2_K4edDp/store/docker" --docker_volume_checkpoint_dir="/var/run/mesos/isolators/docker/volume"
--enforce_container_disk_quota="false" --executor_registration_timeout="1mins" --executor_reregistration_timeout="2secs"
--executor_shutdown_grace_period="5secs" --fetcher_cache_dir="/tmp/Endpoint_SlaveEndpointTest_NoAuthorizer_2_K4edDp/fetch"
--fetcher_cache_size="2GB" --frameworks_home="" --gc_delay="1weeks" --gc_disk_headroom="0.1"
--hadoop_home="" --help="false" --hostname_lookup="true" --http_command_executor="false" --http_credentials="/tmp/Endpoint_SlaveEndpointTest_NoAuthorizer_2_K4edDp/http_credentials"
--http_heartbeat_interval="30secs" --initialize_driver_logging="true" --isolation="posix/cpu,posix/mem"
--launcher="posix" --launcher_dir="/mesos/mesos-1.4.0/_build/src" --logbufsecs="0" --logging_level="INFO"
--max_completed_executors_per_framework="150" --oversubscribed_resources_interval="15secs"
--perf_duration="10secs" --perf_interval="1mins" --port="5051" --qos_correction_interval_min="0ns"
--quiet="false" --recover="reconnect" --recovery_timeout="15mins" --registration_backoff_factor="10ms"
--resources="cpus:2;gpus:0;mem:1024;disk:1024;ports:[31000-32000]" --revocable_cpu_low_priority="true"
--runtime_dir="/tmp/Endpoint_SlaveEndpointTest_NoAuthorizer_2_K4edDp" --sandbox_directory="/mnt/mesos/sandbox"
--strict="true" --switch_user="true" --systemd_enable_support="true" --systemd_runtime_directory="/run/systemd/system"
--version="false" --work_dir="/tmp/Endpoint_SlaveEndpointTest_NoAuthorizer_2_F4yNVl"
I0903 01:24:28.248212  6114 credentials.hpp:86] Loading credential for authentication from
'/tmp/Endpoint_SlaveEndpointTest_NoAuthorizer_2_K4edDp/credential'
I0903 01:24:28.248492  6114 slave.cpp:283] Agent using credential for: test-principal
I0903 01:24:28.248524  6114 credentials.hpp:37] Loading credentials for authentication from
'/tmp/Endpoint_SlaveEndpointTest_NoAuthorizer_2_K4edDp/http_credentials'
I0903 01:24:28.248919  6114 http.cpp:1026] Creating default 'basic' HTTP authenticator for
realm 'mesos-agent-readonly'
I0903 01:24:28.249168  6114 http.cpp:1026] Creating default 'basic' HTTP authenticator for
realm 'mesos-agent-readwrite'
I0903 01:24:28.251374  6114 slave.cpp:565] Agent resources: [{"name":"cpus","scalar":{"value":2.0},"type":"SCALAR"},{"name":"mem","scalar":{"value":1024.0},"type":"SCALAR"},{"name":"disk","scalar":{"value":1024.0},"type":"SCALAR"},{"name":"ports","ranges":{"range":[{"begin":31000,"end":32000}]},"type":"RANGES"}]
I0903 01:24:28.251813  6114 slave.cpp:573] Agent attributes: [  ]
I0903 01:24:28.251833  6114 slave.cpp:582] Agent hostname: 85c9db29604a
I0903 01:24:28.252074  6119 status_update_manager.cpp:177] Pausing sending status updates
I0903 01:24:28.254287  6114 state.cpp:64] Recovering state from '/tmp/Endpoint_SlaveEndpointTest_NoAuthorizer_2_F4yNVl/meta'
I0903 01:24:28.254699  6113 status_update_manager.cpp:203] Recovering status update manager
I0903 01:24:28.254994  6113 containerizer.cpp:609] Recovering containerizer
I0903 01:24:28.257413  6112 provisioner.cpp:416] Provisioner recovery complete
I0903 01:24:28.258023  6119 slave.cpp:6295] Finished recovery
I0903 01:24:28.258615  6119 slave.cpp:6477] Querying resource estimator for oversubscribable
resources
I0903 01:24:28.259053  6118 slave.cpp:6491] Received oversubscribable resources {} from the
resource estimator
I0903 01:24:28.263141  6118 process.cpp:3933] Handling HTTP event for process 'slave(802)'
with path: '/slave(802)/containers'
I0903 01:24:28.265399  6114 http.cpp:1166] HTTP GET for /slave(802)/containers from 172.17.0.2:55784
I0903 01:24:28.265524  6114 http.cpp:957] Authorizing principal 'test-principal' to GET the
'/containers' endpoint
I0903 01:24:28.271277  6093 slave.cpp:843] Agent terminating
[       OK ] Endpoint/SlaveEndpointTest.NoAuthorizer/2 (49 ms)
[----------] 9 tests from Endpoint/SlaveEndpointTest (434 ms total)

[----------] 2 tests from ContainerizerType/DefaultContainerDNSFlagTest
[ RUN      ] ContainerizerType/DefaultContainerDNSFlagTest.ValidateFlag/0
[       OK ] ContainerizerType/DefaultContainerDNSFlagTest.ValidateFlag/0 (21 ms)
[ RUN      ] ContainerizerType/DefaultContainerDNSFlagTest.ValidateFlag/1
[       OK ] ContainerizerType/DefaultContainerDNSFlagTest.ValidateFlag/1 (19 ms)
[----------] 2 tests from ContainerizerType/DefaultContainerDNSFlagTest (40 ms total)

[----------] Global test environment tear-down
[==========] 1652 tests from 182 test cases ran. (787948 ms total)
[  PASSED  ] 1647 tests.
[  FAILED  ] 5 tests, listed below:
[  FAILED  ] CommandExecutorCheckTest.CommandCheckDeliveredAndReconciled
[  FAILED  ] DefaultExecutorCheckTest.CommandCheckDeliveredAndReconciled
[  FAILED  ] DefaultExecutorCheckTest.CommandCheckStatusChange
[  FAILED  ] DefaultExecutorCheckTest.CommandCheckSeesParentsEnv
[  FAILED  ] DefaultExecutorCheckTest.CommandCheckSharesWorkDirWithTask

 5 FAILED TESTS
  YOU HAVE 20 DISABLED TESTS

I0903 01:24:28.463870  6120 process.cpp:1072] Failed to accept socket: future discarded
make[4]: *** [check-local] Error 1
make[4]: Leaving directory `/mesos/mesos-1.4.0/_build/src'
make[3]: *** [check-am] Error 2
make[3]: Leaving directory `/mesos/mesos-1.4.0/_build/src'
make[2]: *** [check] Error 2
make[2]: Leaving directory `/mesos/mesos-1.4.0/_build/src'
make[1]: *** [check-recursive] Error 1
make[1]: Leaving directory `/mesos/mesos-1.4.0/_build'
make: *** [distcheck] Error 1
+ docker rmi mesos-1504396668-20040
Untagged: mesos-1504396668-20040:latest
Deleted: sha256:9acac68512a02673b9a2c1c910642e569017ce75f8f3b0e965d9fa201c03ee37
Deleted: sha256:6b81a8f45a1985860daff3b661671554c4b459df9709efccbb56ea7890c82aa0
Deleted: sha256:f85681252422c50dcc4ffc88395af5580c1b3e416db662b2fa62f331a3a2dac8
Deleted: sha256:a92c3bebeb6b14f9bf4d3b01d2f462d772da71adb0e24c21c5d8faf931cbc38a
Deleted: sha256:8c39ff64ce9253e4b33dfec19bd32d5b345a5842e1215a3a43c395e4c0dc556e
Deleted: sha256:fbff624d00a340534df56643524665078166e7233857fd4fe74cd4f2aeb93343
Deleted: sha256:8f7d0e059b1a52ef35b369d62fb311c3cae2b47a6edbb63a50322699194d58b5
Deleted: sha256:256acc3db98ff62b9825f432ea6ddbaec39884cb1deecfc254f97f147787069b
Deleted: sha256:b7bab7d23fd239d9d829775af80119cc928360f2068be0c059a1b4b2b2ab8ddc
Deleted: sha256:0a1146ec74fa323a7b5451caff74a1462a1d20e5260fc270b9f1838ac13b593c
Deleted: sha256:f119e1efa2ca819b6c1e4ed67a6e75c5649b2c688a60dca0ea7375d3e18dc58e
Deleted: sha256:f2c80b6bc7a1b5cc66140731f07d04e64d0a63980c2e00a135009db0d6701fb2
Deleted: sha256:97608f4225faf5b1248d8b862aedcaaf14265ba699ce99e8a4f4041c334c07c4
Deleted: sha256:68af5612ed9b21b566d1fdef0f3f6986c110e121eee5e439a86e3602ad43a01f
Deleted: sha256:f7bba99034c32d74831b5de3d36f96d6cc2c829d1b65fd7b39c63103167c6261
Deleted: sha256:3cedcb9caf33af3322ce2ca7963eb9a241f5e03108c0a499dfbc966fb24274b2
Deleted: sha256:7693fb24bf86043fee95115e6eef350432367d4674c92f2ced4e7beeaea311e3
Deleted: sha256:d7a7821f343c07e5e804694c9066faa7bf69b705aea1a1527661a0a5cb0d10dc
Deleted: sha256:794cb3352ca2321ab1d3e99d6d8332fd623beda66038bb3641c92882d23dd501
Deleted: sha256:8d6dd7a62208733b1176d2e63c6968291dc8733d2a000d5b90c632ef103b711c
Deleted: sha256:bc7a2377b1d5ea2aac7bc38a4855b2103739701e3a727847aa8474994a66ba8f
Deleted: sha256:065b308646cb24c6a3a51bb72f49ec09f6b776ec943bc6ec9185acf55b7b4b72
Deleted: sha256:619435504f9a8e41ffe3cd20f754faf6370f87c687d30a29a38eca9251c9f2e0
Deleted: sha256:133e9da8d62e3fa7203081caed19df842206d51605e7b9423af8b33c10a0fbba
Deleted: sha256:82f6a66cfbf74aafe23e3efab3a5da38cd48e22e2b57ecfcc2ff7e2e79b0790b
Build step 'Execute shell' marked build as failure
Not sending mail to unregistered user yujie.jay@gmail.com
Not sending mail to unregistered user songzihao1990@gmail.com

Mime
View raw message