mesos-builds mailing list archives

Site index · List index
Message view « Date » · « Thread »
Top « Date » · « Thread »
From Apache Jenkins Server <jenk...@builds.apache.org>
Subject Build failed in Jenkins: Mesos-Buildbot » autotools,clang,--verbose,GLOG_v=1 MESOS_VERBOSE=1,ubuntu:14.04,(ubuntu)&&(!ubuntu-us1)&&(!ubuntu-eu2)&&(!qnode3)&&(!H23) #4239
Date Tue, 19 Sep 2017 11:12:57 GMT
See <https://builds.apache.org/job/Mesos-Buildbot/BUILDTOOL=autotools,COMPILER=clang,CONFIGURATION=--verbose,ENVIRONMENT=GLOG_v=1%20MESOS_VERBOSE=1,OS=ubuntu%3A14.04,label_exp=(ubuntu)&&(!ubuntu-us1)&&(!ubuntu-eu2)&&(!qnode3)&&(!H23)/4239/display/redirect>

------------------------------------------
[...truncated 31.14 MB...]
I0919 11:12:44.796579  4074 http.cpp:1045] Creating default 'basic' HTTP authenticator for
realm 'mesos-agent-readwrite'
I0919 11:12:44.797920  4074 slave.cpp:583] Agent resources: [{"name":"cpus","scalar":{"value":2.0},"type":"SCALAR"},{"name":"mem","scalar":{"value":1024.0},"type":"SCALAR"},{"name":"disk","scalar":{"value":1024.0},"type":"SCALAR"},{"name":"ports","ranges":{"range":[{"begin":31000,"end":32000}]},"type":"RANGES"}]
I0919 11:12:44.798137  4074 slave.cpp:591] Agent attributes: [  ]
I0919 11:12:44.798151  4074 slave.cpp:600] Agent hostname: c625abe5be45
I0919 11:12:44.798301  4057 status_update_manager.cpp:177] Pausing sending status updates
I0919 11:12:44.799608  4072 state.cpp:64] Recovering state from '/tmp/Endpoint_SlaveEndpointTest_AuthorizedRequest_2_5XRLMC/meta'
I0919 11:12:44.799945  4075 status_update_manager.cpp:203] Recovering status update manager
I0919 11:12:44.800137  4064 containerizer.cpp:648] Recovering containerizer
I0919 11:12:44.801532  4060 provisioner.cpp:416] Provisioner recovery complete
I0919 11:12:44.801869  4054 slave.cpp:6298] Finished recovery
I0919 11:12:44.802283  4054 slave.cpp:6480] Querying resource estimator for oversubscribable
resources
I0919 11:12:44.802522  4071 slave.cpp:6494] Received oversubscribable resources {} from the
resource estimator
I0919 11:12:44.804944  4061 process.cpp:3929] Handling HTTP event for process 'slave(810)'
with path: '/slave(810)/containers'
I0919 11:12:44.806116  4070 http.cpp:1185] HTTP GET for /slave(810)/containers from 172.17.0.8:49934
I0919 11:12:44.806201  4070 http.cpp:976] Authorizing principal 'test-principal' to GET the
'/containers' endpoint
I0919 11:12:44.810209  4071 slave.cpp:861] Agent terminating
[       OK ] Endpoint/SlaveEndpointTest.AuthorizedRequest/2 (30 ms)
[ RUN      ] Endpoint/SlaveEndpointTest.UnauthorizedRequest/0
I0919 11:12:44.821126  4034 containerizer.cpp:292] Using isolation { environment_secret, posix/cpu,
posix/mem, filesystem/posix, network/cni }
W0919 11:12:44.821583  4034 backend.cpp:76] Failed to create 'aufs' backend: AufsBackend requires
root privileges
W0919 11:12:44.821696  4034 backend.cpp:76] Failed to create 'bind' backend: BindBackend requires
root privileges
I0919 11:12:44.821733  4034 provisioner.cpp:255] Using default backend 'copy'
I0919 11:12:44.825260  4062 slave.cpp:252] Mesos agent started on (811)@172.17.0.8:37510
I0919 11:12:44.825299  4062 slave.cpp:253] Flags at startup: --acls="" --appc_simple_discovery_uri_prefix="http://"
--appc_store_dir="/tmp/Endpoint_SlaveEndpointTest_UnauthorizedRequest_0_5PfPqi/store/appc"
--authenticate_http_readonly="true" --authenticate_http_readwrite="true" --authenticatee="crammd5"
--authentication_backoff_factor="1secs" --authorizer="local" --cgroups_cpu_enable_pids_and_tids_count="false"
--cgroups_enable_cfs="false" --cgroups_hierarchy="/sys/fs/cgroup" --cgroups_limit_swap="false"
--cgroups_root="mesos" --container_disk_watch_interval="15secs" --containerizers="mesos" --credential="/tmp/Endpoint_SlaveEndpointTest_UnauthorizedRequest_0_5PfPqi/credential"
--default_role="*" --disallow_sharing_agent_pid_namespace="false" --disk_watch_interval="1mins"
--docker="docker" --docker_kill_orphans="true" --docker_registry="https://registry-1.docker.io"
--docker_remove_delay="6hrs" --docker_socket="/var/run/docker.sock" --docker_stop_timeout="0ns"
--docker_store_dir="/tmp/Endpoint_SlaveEndpointTest_UnauthorizedRequest_0_5PfPqi/store/docker"
--docker_volume_checkpoint_dir="/var/run/mesos/isolators/docker/volume" --enforce_container_disk_quota="false"
--executor_registration_timeout="1mins" --executor_reregistration_timeout="2secs" --executor_shutdown_grace_period="5secs"
--fetcher_cache_dir="/tmp/Endpoint_SlaveEndpointTest_UnauthorizedRequest_0_5PfPqi/fetch" --fetcher_cache_size="2GB"
--frameworks_home="" --gc_delay="1weeks" --gc_disk_headroom="0.1" --hadoop_home="" --help="false"
--hostname_lookup="true" --http_command_executor="false" --http_credentials="/tmp/Endpoint_SlaveEndpointTest_UnauthorizedRequest_0_5PfPqi/http_credentials"
--http_heartbeat_interval="30secs" --initialize_driver_logging="true" --isolation="posix/cpu,posix/mem"
--launcher="posix" --launcher_dir="/mesos/mesos-1.5.0/_build/src" --logbufsecs="0" --logging_level="INFO"
--max_completed_executors_per_framework="150" --oversubscribed_resources_interval="15secs"
--perf_duration="10secs" --perf_interval="1mins" --port="5051" --qos_correction_interval_min="0ns"
--quiet="false" --recover="reconnect" --recovery_timeout="15mins" --registration_backoff_factor="10ms"
--resources="cpus:2;gpus:0;mem:1024;disk:1024;ports:[31000-32000]" --revocable_cpu_low_priority="true"
--runtime_dir="/tmp/Endpoint_SlaveEndpointTest_UnauthorizedRequest_0_5PfPqi" --sandbox_directory="/mnt/mesos/sandbox"
--strict="true" --switch_user="true" --systemd_enable_support="true" --systemd_runtime_directory="/run/systemd/system"
--version="false" --work_dir="/tmp/Endpoint_SlaveEndpointTest_UnauthorizedRequest_0_D0VzSy"
--zk_session_timeout="10secs"
I0919 11:12:44.825798  4062 credentials.hpp:86] Loading credential for authentication from
'/tmp/Endpoint_SlaveEndpointTest_UnauthorizedRequest_0_5PfPqi/credential'
I0919 11:12:44.825978  4062 slave.cpp:285] Agent using credential for: test-principal
I0919 11:12:44.826015  4062 credentials.hpp:37] Loading credentials for authentication from
'/tmp/Endpoint_SlaveEndpointTest_UnauthorizedRequest_0_5PfPqi/http_credentials'
I0919 11:12:44.826314  4062 http.cpp:1045] Creating default 'basic' HTTP authenticator for
realm 'mesos-agent-readonly'
I0919 11:12:44.826483  4062 http.cpp:1045] Creating default 'basic' HTTP authenticator for
realm 'mesos-agent-readwrite'
I0919 11:12:44.827929  4062 slave.cpp:583] Agent resources: [{"name":"cpus","scalar":{"value":2.0},"type":"SCALAR"},{"name":"mem","scalar":{"value":1024.0},"type":"SCALAR"},{"name":"disk","scalar":{"value":1024.0},"type":"SCALAR"},{"name":"ports","ranges":{"range":[{"begin":31000,"end":32000}]},"type":"RANGES"}]
I0919 11:12:44.828150  4062 slave.cpp:591] Agent attributes: [  ]
I0919 11:12:44.828161  4062 slave.cpp:600] Agent hostname: c625abe5be45
I0919 11:12:44.828305  4054 status_update_manager.cpp:177] Pausing sending status updates
I0919 11:12:44.829720  4075 state.cpp:64] Recovering state from '/tmp/Endpoint_SlaveEndpointTest_UnauthorizedRequest_0_D0VzSy/meta'
I0919 11:12:44.830005  4071 status_update_manager.cpp:203] Recovering status update manager
I0919 11:12:44.830178  4071 containerizer.cpp:648] Recovering containerizer
I0919 11:12:44.831534  4069 provisioner.cpp:416] Provisioner recovery complete
I0919 11:12:44.832028  4054 slave.cpp:6298] Finished recovery
I0919 11:12:44.832468  4054 slave.cpp:6480] Querying resource estimator for oversubscribable
resources
I0919 11:12:44.832720  4056 slave.cpp:6494] Received oversubscribable resources {} from the
resource estimator
I0919 11:12:44.834940  4058 process.cpp:3929] Handling HTTP event for process 'slave(811)'
with path: '/slave(811)/monitor/statistics'
I0919 11:12:44.836239  4061 http.cpp:1185] HTTP GET for /slave(811)/monitor/statistics from
172.17.0.8:49936
I0919 11:12:44.836315  4061 http.cpp:976] Authorizing principal 'test-principal' to GET the
'/monitor/statistics' endpoint
I0919 11:12:44.838121  4058 slave.cpp:861] Agent terminating
[       OK ] Endpoint/SlaveEndpointTest.UnauthorizedRequest/0 (28 ms)
[ RUN      ] Endpoint/SlaveEndpointTest.UnauthorizedRequest/1
I0919 11:12:44.849078  4034 containerizer.cpp:292] Using isolation { environment_secret, posix/cpu,
posix/mem, filesystem/posix, network/cni }
W0919 11:12:44.849524  4034 backend.cpp:76] Failed to create 'aufs' backend: AufsBackend requires
root privileges
W0919 11:12:44.849625  4034 backend.cpp:76] Failed to create 'bind' backend: BindBackend requires
root privileges
I0919 11:12:44.849654  4034 provisioner.cpp:255] Using default backend 'copy'
I0919 11:12:44.852977  4062 slave.cpp:252] Mesos agent started on (812)@172.17.0.8:37510
I0919 11:12:44.853011  4062 slave.cpp:253] Flags at startup: --acls="" --appc_simple_discovery_uri_prefix="http://"
--appc_store_dir="/tmp/Endpoint_SlaveEndpointTest_UnauthorizedRequest_1_Zxh1Re/store/appc"
--authenticate_http_readonly="true" --authenticate_http_readwrite="true" --authenticatee="crammd5"
--authentication_backoff_factor="1secs" --authorizer="local" --cgroups_cpu_enable_pids_and_tids_count="false"
--cgroups_enable_cfs="false" --cgroups_hierarchy="/sys/fs/cgroup" --cgroups_limit_swap="false"
--cgroups_root="mesos" --container_disk_watch_interval="15secs" --containerizers="mesos" --credential="/tmp/Endpoint_SlaveEndpointTest_UnauthorizedRequest_1_Zxh1Re/credential"
--default_role="*" --disallow_sharing_agent_pid_namespace="false" --disk_watch_interval="1mins"
--docker="docker" --docker_kill_orphans="true" --docker_registry="https://registry-1.docker.io"
--docker_remove_delay="6hrs" --docker_socket="/var/run/docker.sock" --docker_stop_timeout="0ns"
--docker_store_dir="/tmp/Endpoint_SlaveEndpointTest_UnauthorizedRequest_1_Zxh1Re/store/docker"
--docker_volume_checkpoint_dir="/var/run/mesos/isolators/docker/volume" --enforce_container_disk_quota="false"
--executor_registration_timeout="1mins" --executor_reregistration_timeout="2secs" --executor_shutdown_grace_period="5secs"
--fetcher_cache_dir="/tmp/Endpoint_SlaveEndpointTest_UnauthorizedRequest_1_Zxh1Re/fetch" --fetcher_cache_size="2GB"
--frameworks_home="" --gc_delay="1weeks" --gc_disk_headroom="0.1" --hadoop_home="" --help="false"
--hostname_lookup="true" --http_command_executor="false" --http_credentials="/tmp/Endpoint_SlaveEndpointTest_UnauthorizedRequest_1_Zxh1Re/http_credentials"
--http_heartbeat_interval="30secs" --initialize_driver_logging="true" --isolation="posix/cpu,posix/mem"
--launcher="posix" --launcher_dir="/mesos/mesos-1.5.0/_build/src" --logbufsecs="0" --logging_level="INFO"
--max_completed_executors_per_framework="150" --oversubscribed_resources_interval="15secs"
--perf_duration="10secs" --perf_interval="1mins" --port="5051" --qos_correction_interval_min="0ns"
--quiet="false" --recover="reconnect" --recovery_timeout="15mins" --registration_backoff_factor="10ms"
--resources="cpus:2;gpus:0;mem:1024;disk:1024;ports:[31000-32000]" --revocable_cpu_low_priority="true"
--runtime_dir="/tmp/Endpoint_SlaveEndpointTest_UnauthorizedRequest_1_Zxh1Re" --sandbox_directory="/mnt/mesos/sandbox"
--strict="true" --switch_user="true" --systemd_enable_support="true" --systemd_runtime_directory="/run/systemd/system"
--version="false" --work_dir="/tmp/Endpoint_SlaveEndpointTest_UnauthorizedRequest_1_ftnCfv"
--zk_session_timeout="10secs"
I0919 11:12:44.853580  4062 credentials.hpp:86] Loading credential for authentication from
'/tmp/Endpoint_SlaveEndpointTest_UnauthorizedRequest_1_Zxh1Re/credential'
I0919 11:12:44.853788  4062 slave.cpp:285] Agent using credential for: test-principal
I0919 11:12:44.853852  4062 credentials.hpp:37] Loading credentials for authentication from
'/tmp/Endpoint_SlaveEndpointTest_UnauthorizedRequest_1_Zxh1Re/http_credentials'
I0919 11:12:44.854215  4062 http.cpp:1045] Creating default 'basic' HTTP authenticator for
realm 'mesos-agent-readonly'
I0919 11:12:44.854375  4062 http.cpp:1045] Creating default 'basic' HTTP authenticator for
realm 'mesos-agent-readwrite'
I0919 11:12:44.855921  4062 slave.cpp:583] Agent resources: [{"name":"cpus","scalar":{"value":2.0},"type":"SCALAR"},{"name":"mem","scalar":{"value":1024.0},"type":"SCALAR"},{"name":"disk","scalar":{"value":1024.0},"type":"SCALAR"},{"name":"ports","ranges":{"range":[{"begin":31000,"end":32000}]},"type":"RANGES"}]
I0919 11:12:44.856143  4062 slave.cpp:591] Agent attributes: [  ]
I0919 11:12:44.856160  4062 slave.cpp:600] Agent hostname: c625abe5be45
I0919 11:12:44.856318  4072 status_update_manager.cpp:177] Pausing sending status updates
I0919 11:12:44.857697  4070 state.cpp:64] Recovering state from '/tmp/Endpoint_SlaveEndpointTest_UnauthorizedRequest_1_ftnCfv/meta'
I0919 11:12:44.857980  4059 status_update_manager.cpp:203] Recovering status update manager
I0919 11:12:44.858243  4053 containerizer.cpp:648] Recovering containerizer
I0919 11:12:44.859763  4075 provisioner.cpp:416] Provisioner recovery complete
I0919 11:12:44.860298  4064 slave.cpp:6298] Finished recovery
I0919 11:12:44.860780  4064 slave.cpp:6480] Querying resource estimator for oversubscribable
resources
I0919 11:12:44.861073  4066 slave.cpp:6494] Received oversubscribable resources {} from the
resource estimator
I0919 11:12:44.863108  4060 process.cpp:3929] Handling HTTP event for process 'slave(812)'
with path: '/slave(812)/monitor/statistics.json'
I0919 11:12:44.864701  4052 http.cpp:1185] HTTP GET for /slave(812)/monitor/statistics.json
from 172.17.0.8:49938
I0919 11:12:44.864774  4052 http.cpp:976] Authorizing principal 'test-principal' to GET the
'/monitor/statistics.json' endpoint
I0919 11:12:44.867167  4034 slave.cpp:861] Agent terminating
[       OK ] Endpoint/SlaveEndpointTest.UnauthorizedRequest/1 (29 ms)
[ RUN      ] Endpoint/SlaveEndpointTest.UnauthorizedRequest/2
I0919 11:12:44.878984  4034 containerizer.cpp:292] Using isolation { environment_secret, posix/cpu,
posix/mem, filesystem/posix, network/cni }
W0919 11:12:44.879575  4034 backend.cpp:76] Failed to create 'aufs' backend: AufsBackend requires
root privileges
W0919 11:12:44.879711  4034 backend.cpp:76] Failed to create 'bind' backend: BindBackend requires
root privileges
I0919 11:12:44.879746  4034 provisioner.cpp:255] Using default backend 'copy'
I0919 11:12:44.883836  4059 slave.cpp:252] Mesos agent started on (813)@172.17.0.8:37510
I0919 11:12:44.883869  4059 slave.cpp:253] Flags at startup: --acls="" --appc_simple_discovery_uri_prefix="http://"
--appc_store_dir="/tmp/Endpoint_SlaveEndpointTest_UnauthorizedRequest_2_FTAwAb/store/appc"
--authenticate_http_readonly="true" --authenticate_http_readwrite="true" --authenticatee="crammd5"
--authentication_backoff_factor="1secs" --authorizer="local" --cgroups_cpu_enable_pids_and_tids_count="false"
--cgroups_enable_cfs="false" --cgroups_hierarchy="/sys/fs/cgroup" --cgroups_limit_swap="false"
--cgroups_root="mesos" --container_disk_watch_interval="15secs" --containerizers="mesos" --credential="/tmp/Endpoint_SlaveEndpointTest_UnauthorizedRequest_2_FTAwAb/credential"
--default_role="*" --disallow_sharing_agent_pid_namespace="false" --disk_watch_interval="1mins"
--docker="docker" --docker_kill_orphans="true" --docker_registry="https://registry-1.docker.io"
--docker_remove_delay="6hrs" --docker_socket="/var/run/docker.sock" --docker_stop_timeout="0ns"
--docker_store_dir="/tmp/Endpoint_SlaveEndpointTest_UnauthorizedRequest_2_FTAwAb/store/docker"
--docker_volume_checkpoint_dir="/var/run/mesos/isolators/docker/volume" --enforce_container_disk_quota="false"
--executor_registration_timeout="1mins" --executor_reregistration_timeout="2secs" --executor_shutdown_grace_period="5secs"
--fetcher_cache_dir="/tmp/Endpoint_SlaveEndpointTest_UnauthorizedRequest_2_FTAwAb/fetch" --fetcher_cache_size="2GB"
--frameworks_home="" --gc_delay="1weeks" --gc_disk_headroom="0.1" --hadoop_home="" --help="false"
--hostname_lookup="true" --http_command_executor="false" --http_credentials="/tmp/Endpoint_SlaveEndpointTest_UnauthorizedRequest_2_FTAwAb/http_credentials"
--http_heartbeat_interval="30secs" --initialize_driver_logging="true" --isolation="posix/cpu,posix/mem"
--launcher="posix" --launcher_dir="/mesos/mesos-1.5.0/_build/src" --logbufsecs="0" --logging_level="INFO"
--max_completed_executors_per_framework="150" --oversubscribed_resources_interval="15secs"
--perf_duration="10secs" --perf_interval="1mins" --port="5051" --qos_correction_interval_min="0ns"
--quiet="false" --recover="reconnect" --recovery_timeout="15mins" --registration_backoff_factor="10ms"
--resources="cpus:2;gpus:0;mem:1024;disk:1024;ports:[31000-32000]" --revocable_cpu_low_priority="true"
--runtime_dir="/tmp/Endpoint_SlaveEndpointTest_UnauthorizedRequest_2_FTAwAb" --sandbox_directory="/mnt/mesos/sandbox"
--strict="true" --switch_user="true" --systemd_enable_support="true" --systemd_runtime_directory="/run/systemd/system"
--version="false" --work_dir="/tmp/Endpoint_SlaveEndpointTest_UnauthorizedRequest_2_37vKTr"
--zk_session_timeout="10secs"
I0919 11:12:44.884228  4059 credentials.hpp:86] Loading credential for authentication from
'/tmp/Endpoint_SlaveEndpointTest_UnauthorizedRequest_2_FTAwAb/credential'
I0919 11:12:44.884362  4059 slave.cpp:285] Agent using credential for: test-principal
I0919 11:12:44.884385  4059 credentials.hpp:37] Loading credentials for authentication from
'/tmp/Endpoint_SlaveEndpointTest_UnauthorizedRequest_2_FTAwAb/http_credentials'
I0919 11:12:44.884593  4059 http.cpp:1045] Creating default 'basic' HTTP authenticator for
realm 'mesos-agent-readonly'
I0919 11:12:44.884743  4059 http.cpp:1045] Creating default 'basic' HTTP authenticator for
realm 'mesos-agent-readwrite'
I0919 11:12:44.886478  4059 slave.cpp:583] Agent resources: [{"name":"cpus","scalar":{"value":2.0},"type":"SCALAR"},{"name":"mem","scalar":{"value":1024.0},"type":"SCALAR"},{"name":"disk","scalar":{"value":1024.0},"type":"SCALAR"},{"name":"ports","ranges":{"range":[{"begin":31000,"end":32000}]},"type":"RANGES"}]
I0919 11:12:44.886868  4059 slave.cpp:591] Agent attributes: [  ]
I0919 11:12:44.886904  4059 slave.cpp:600] Agent hostname: c625abe5be45
I0919 11:12:44.887173  4068 status_update_manager.cpp:177] Pausing sending status updates
I0919 11:12:44.888715  4070 state.cpp:64] Recovering state from '/tmp/Endpoint_SlaveEndpointTest_UnauthorizedRequest_2_37vKTr/meta'
I0919 11:12:44.889024  4075 status_update_manager.cpp:203] Recovering status update manager
I0919 11:12:44.889236  4062 containerizer.cpp:648] Recovering containerizer
I0919 11:12:44.890305  4069 provisioner.cpp:416] Provisioner recovery complete
I0919 11:12:44.890712  4068 slave.cpp:6298] Finished recovery
I0919 11:12:44.891146  4068 slave.cpp:6480] Querying resource estimator for oversubscribable
resources
I0919 11:12:44.891454  4056 slave.cpp:6494] Received oversubscribable resources {} from the
resource estimator
I0919 11:12:44.893744  4055 process.cpp:3929] Handling HTTP event for process 'slave(813)'
with path: '/slave(813)/containers'
I0919 11:12:44.894794  4073 http.cpp:1185] HTTP GET for /slave(813)/containers from 172.17.0.8:49940
I0919 11:12:44.894858  4073 http.cpp:976] Authorizing principal 'test-principal' to GET the
'/containers' endpoint
I0919 11:12:44.897303  4034 slave.cpp:861] Agent terminating
[       OK ] Endpoint/SlaveEndpointTest.UnauthorizedRequest/2 (32 ms)
[ RUN      ] Endpoint/SlaveEndpointTest.NoAuthorizer/0
I0919 11:12:44.914054  4034 containerizer.cpp:292] Using isolation { environment_secret, posix/cpu,
posix/mem, filesystem/posix, network/cni }
W0919 11:12:44.914757  4034 backend.cpp:76] Failed to create 'aufs' backend: AufsBackend requires
root privileges
W0919 11:12:44.914909  4034 backend.cpp:76] Failed to create 'bind' backend: BindBackend requires
root privileges
I0919 11:12:44.914944  4034 provisioner.cpp:255] Using default backend 'copy'
I0919 11:12:44.916625  4034 cluster.cpp:448] Creating default 'local' authorizer
I0919 11:12:44.919219  4061 slave.cpp:252] Mesos agent started on (814)@172.17.0.8:37510
I0919 11:12:44.919260  4061 slave.cpp:253] Flags at startup: --acls="" --appc_simple_discovery_uri_prefix="http://"
--appc_store_dir="/tmp/Endpoint_SlaveEndpointTest_NoAuthorizer_0_RYKgC8/store/appc" --authenticate_http_readonly="true"
--authenticate_http_readwrite="true" --authenticatee="crammd5" --authentication_backoff_factor="1secs"
--authorizer="local" --cgroups_cpu_enable_pids_and_tids_count="false" --cgroups_enable_cfs="false"
--cgroups_hierarchy="/sys/fs/cgroup" --cgroups_limit_swap="false" --cgroups_root="mesos" --container_disk_watch_interval="15secs"
--containerizers="mesos" --credential="/tmp/Endpoint_SlaveEndpointTest_NoAuthorizer_0_RYKgC8/credential"
--default_role="*" --disallow_sharing_agent_pid_namespace="false" --disk_watch_interval="1mins"
--docker="docker" --docker_kill_orphans="true" --docker_registry="https://registry-1.docker.io"
--docker_remove_delay="6hrs" --docker_socket="/var/run/docker.sock" --docker_stop_timeout="0ns"
--docker_store_dir="/tmp/Endpoint_SlaveEndpointTest_NoAuthorizer_0_RYKgC8/store/docker" --docker_volume_checkpoint_dir="/var/run/mesos/isolators/docker/volume"
--enforce_container_disk_quota="false" --executor_registration_timeout="1mins" --executor_reregistration_timeout="2secs"
--executor_shutdown_grace_period="5secs" --fetcher_cache_dir="/tmp/Endpoint_SlaveEndpointTest_NoAuthorizer_0_RYKgC8/fetch"
--fetcher_cache_size="2GB" --frameworks_home="" --gc_delay="1weeks" --gc_disk_headroom="0.1"
--hadoop_home="" --help="false" --hostname_lookup="true" --http_command_executor="false" --http_credentials="/tmp/Endpoint_SlaveEndpointTest_NoAuthorizer_0_RYKgC8/http_credentials"
--http_heartbeat_interval="30secs" --initialize_driver_logging="true" --isolation="posix/cpu,posix/mem"
--launcher="posix" --launcher_dir="/mesos/mesos-1.5.0/_build/src" --logbufsecs="0" --logging_level="INFO"
--max_completed_executors_per_framework="150" --oversubscribed_resources_interval="15secs"
--perf_duration="10secs" --perf_interval="1mins" --port="5051" --qos_correction_interval_min="0ns"
--quiet="false" --recover="reconnect" --recovery_timeout="15mins" --registration_backoff_factor="10ms"
--resources="cpus:2;gpus:0;mem:1024;disk:1024;ports:[31000-32000]" --revocable_cpu_low_priority="true"
--runtime_dir="/tmp/Endpoint_SlaveEndpointTest_NoAuthorizer_0_RYKgC8" --sandbox_directory="/mnt/mesos/sandbox"
--strict="true" --switch_user="true" --systemd_enable_support="true" --systemd_runtime_directory="/run/systemd/system"
--version="false" --work_dir="/tmp/Endpoint_SlaveEndpointTest_NoAuthorizer_0_ADBwQo" --zk_session_timeout="10secs"
I0919 11:12:44.919684  4061 credentials.hpp:86] Loading credential for authentication from
'/tmp/Endpoint_SlaveEndpointTest_NoAuthorizer_0_RYKgC8/credential'
I0919 11:12:44.919865  4061 slave.cpp:285] Agent using credential for: test-principal
I0919 11:12:44.919893  4061 credentials.hpp:37] Loading credentials for authentication from
'/tmp/Endpoint_SlaveEndpointTest_NoAuthorizer_0_RYKgC8/http_credentials'
I0919 11:12:44.920157  4061 http.cpp:1045] Creating default 'basic' HTTP authenticator for
realm 'mesos-agent-readonly'
I0919 11:12:44.920490  4061 http.cpp:1045] Creating default 'basic' HTTP authenticator for
realm 'mesos-agent-readwrite'
I0919 11:12:44.922538  4061 slave.cpp:583] Agent resources: [{"name":"cpus","scalar":{"value":2.0},"type":"SCALAR"},{"name":"mem","scalar":{"value":1024.0},"type":"SCALAR"},{"name":"disk","scalar":{"value":1024.0},"type":"SCALAR"},{"name":"ports","ranges":{"range":[{"begin":31000,"end":32000}]},"type":"RANGES"}]
I0919 11:12:44.922951  4061 slave.cpp:591] Agent attributes: [  ]
I0919 11:12:44.922976  4061 slave.cpp:600] Agent hostname: c625abe5be45
I0919 11:12:44.923213  4070 status_update_manager.cpp:177] Pausing sending status updates
I0919 11:12:44.925351  4073 state.cpp:64] Recovering state from '/tmp/Endpoint_SlaveEndpointTest_NoAuthorizer_0_ADBwQo/meta'
I0919 11:12:44.925716  4066 status_update_manager.cpp:203] Recovering status update manager
I0919 11:12:44.925907  4066 containerizer.cpp:648] Recovering containerizer
I0919 11:12:44.927395  4063 provisioner.cpp:416] Provisioner recovery complete
I0919 11:12:44.927815  4063 slave.cpp:6298] Finished recovery
I0919 11:12:44.928257  4063 slave.cpp:6480] Querying resource estimator for oversubscribable
resources
I0919 11:12:44.928534  4057 slave.cpp:6494] Received oversubscribable resources {} from the
resource estimator
I0919 11:12:44.930915  4074 process.cpp:3929] Handling HTTP event for process 'slave(814)'
with path: '/slave(814)/monitor/statistics'
I0919 11:12:44.932126  4075 http.cpp:1185] HTTP GET for /slave(814)/monitor/statistics from
172.17.0.8:49942
I0919 11:12:44.932245  4075 http.cpp:976] Authorizing principal 'test-principal' to GET the
'/monitor/statistics' endpoint
I0919 11:12:44.936018  4062 slave.cpp:861] Agent terminating
[       OK ] Endpoint/SlaveEndpointTest.NoAuthorizer/0 (38 ms)
[ RUN      ] Endpoint/SlaveEndpointTest.NoAuthorizer/1
I0919 11:12:44.949287  4034 containerizer.cpp:292] Using isolation { environment_secret, posix/cpu,
posix/mem, filesystem/posix, network/cni }
W0919 11:12:44.949833  4034 backend.cpp:76] Failed to create 'aufs' backend: AufsBackend requires
root privileges
W0919 11:12:44.949964  4034 backend.cpp:76] Failed to create 'bind' backend: BindBackend requires
root privileges
I0919 11:12:44.950011  4034 provisioner.cpp:255] Using default backend 'copy'
I0919 11:12:44.951849  4034 cluster.cpp:448] Creating default 'local' authorizer
I0919 11:12:44.953783  4061 slave.cpp:252] Mesos agent started on (815)@172.17.0.8:37510
I0919 11:12:44.953831  4061 slave.cpp:253] Flags at startup: --acls="" --appc_simple_discovery_uri_prefix="http://"
--appc_store_dir="/tmp/Endpoint_SlaveEndpointTest_NoAuthorizer_1_lFl7Z5/store/appc" --authenticate_http_readonly="true"
--authenticate_http_readwrite="true" --authenticatee="crammd5" --authentication_backoff_factor="1secs"
--authorizer="local" --cgroups_cpu_enable_pids_and_tids_count="false" --cgroups_enable_cfs="false"
--cgroups_hierarchy="/sys/fs/cgroup" --cgroups_limit_swap="false" --cgroups_root="mesos" --container_disk_watch_interval="15secs"
--containerizers="mesos" --credential="/tmp/Endpoint_SlaveEndpointTest_NoAuthorizer_1_lFl7Z5/credential"
--default_role="*" --disallow_sharing_agent_pid_namespace="false" --disk_watch_interval="1mins"
--docker="docker" --docker_kill_orphans="true" --docker_registry="https://registry-1.docker.io"
--docker_remove_delay="6hrs" --docker_socket="/var/run/docker.sock" --docker_stop_timeout="0ns"
--docker_store_dir="/tmp/Endpoint_SlaveEndpointTest_NoAuthorizer_1_lFl7Z5/store/docker" --docker_volume_checkpoint_dir="/var/run/mesos/isolators/docker/volume"
--enforce_container_disk_quota="false" --executor_registration_timeout="1mins" --executor_reregistration_timeout="2secs"
--executor_shutdown_grace_period="5secs" --fetcher_cache_dir="/tmp/Endpoint_SlaveEndpointTest_NoAuthorizer_1_lFl7Z5/fetch"
--fetcher_cache_size="2GB" --frameworks_home="" --gc_delay="1weeks" --gc_disk_headroom="0.1"
--hadoop_home="" --help="false" --hostname_lookup="true" --http_command_executor="false" --http_credentials="/tmp/Endpoint_SlaveEndpointTest_NoAuthorizer_1_lFl7Z5/http_credentials"
--http_heartbeat_interval="30secs" --initialize_driver_logging="true" --isolation="posix/cpu,posix/mem"
--launcher="posix" --launcher_dir="/mesos/mesos-1.5.0/_build/src" --logbufsecs="0" --logging_level="INFO"
--max_completed_executors_per_framework="150" --oversubscribed_resources_interval="15secs"
--perf_duration="10secs" --perf_interval="1mins" --port="5051" --qos_correction_interval_min="0ns"
--quiet="false" --recover="reconnect" --recovery_timeout="15mins" --registration_backoff_factor="10ms"
--resources="cpus:2;gpus:0;mem:1024;disk:1024;ports:[31000-32000]" --revocable_cpu_low_priority="true"
--runtime_dir="/tmp/Endpoint_SlaveEndpointTest_NoAuthorizer_1_lFl7Z5" --sandbox_directory="/mnt/mesos/sandbox"
--strict="true" --switch_user="true" --systemd_enable_support="true" --systemd_runtime_directory="/run/systemd/system"
--version="false" --work_dir="/tmp/Endpoint_SlaveEndpointTest_NoAuthorizer_1_hxkT8l" --zk_session_timeout="10secs"
I0919 11:12:44.954198  4061 credentials.hpp:86] Loading credential for authentication from
'/tmp/Endpoint_SlaveEndpointTest_NoAuthorizer_1_lFl7Z5/credential'
I0919 11:12:44.954355  4061 slave.cpp:285] Agent using credential for: test-principal
I0919 11:12:44.954378  4061 credentials.hpp:37] Loading credentials for authentication from
'/tmp/Endpoint_SlaveEndpointTest_NoAuthorizer_1_lFl7Z5/http_credentials'
I0919 11:12:44.954670  4061 http.cpp:1045] Creating default 'basic' HTTP authenticator for
realm 'mesos-agent-readonly'
I0919 11:12:44.954843  4061 http.cpp:1045] Creating default 'basic' HTTP authenticator for
realm 'mesos-agent-readwrite'
I0919 11:12:44.957000  4061 slave.cpp:583] Agent resources: [{"name":"cpus","scalar":{"value":2.0},"type":"SCALAR"},{"name":"mem","scalar":{"value":1024.0},"type":"SCALAR"},{"name":"disk","scalar":{"value":1024.0},"type":"SCALAR"},{"name":"ports","ranges":{"range":[{"begin":31000,"end":32000}]},"type":"RANGES"}]
I0919 11:12:44.957309  4061 slave.cpp:591] Agent attributes: [  ]
I0919 11:12:44.957324  4061 slave.cpp:600] Agent hostname: c625abe5be45
I0919 11:12:44.957506  4052 status_update_manager.cpp:177] Pausing sending status updates
I0919 11:12:44.959010  4075 state.cpp:64] Recovering state from '/tmp/Endpoint_SlaveEndpointTest_NoAuthorizer_1_hxkT8l/meta'
I0919 11:12:44.959259  4062 status_update_manager.cpp:203] Recovering status update manager
I0919 11:12:44.959517  4062 containerizer.cpp:648] Recovering containerizer
I0919 11:12:44.961328  4056 provisioner.cpp:416] Provisioner recovery complete
I0919 11:12:44.961721  4074 slave.cpp:6298] Finished recovery
I0919 11:12:44.962182  4074 slave.cpp:6480] Querying resource estimator for oversubscribable
resources
I0919 11:12:44.962385  4070 slave.cpp:6494] Received oversubscribable resources {} from the
resource estimator
I0919 11:12:44.964423  4057 process.cpp:3929] Handling HTTP event for process 'slave(815)'
with path: '/slave(815)/monitor/statistics.json'
I0919 11:12:44.965713  4072 http.cpp:1185] HTTP GET for /slave(815)/monitor/statistics.json
from 172.17.0.8:49944
I0919 11:12:44.965792  4072 http.cpp:976] Authorizing principal 'test-principal' to GET the
'/monitor/statistics.json' endpoint
I0919 11:12:44.969749  4034 slave.cpp:861] Agent terminating
[       OK ] Endpoint/SlaveEndpointTest.NoAuthorizer/1 (33 ms)
[ RUN      ] Endpoint/SlaveEndpointTest.NoAuthorizer/2
I0919 11:12:44.985782  4034 containerizer.cpp:292] Using isolation { environment_secret, posix/cpu,
posix/mem, filesystem/posix, network/cni }
W0919 11:12:44.986528  4034 backend.cpp:76] Failed to create 'aufs' backend: AufsBackend requires
root privileges
W0919 11:12:44.986698  4034 backend.cpp:76] Failed to create 'bind' backend: BindBackend requires
root privileges
I0919 11:12:44.986742  4034 provisioner.cpp:255] Using default backend 'copy'
I0919 11:12:44.989542  4034 cluster.cpp:448] Creating default 'local' authorizer
I0919 11:12:44.992009  4057 slave.cpp:252] Mesos agent started on (816)@172.17.0.8:37510
I0919 11:12:44.992051  4057 slave.cpp:253] Flags at startup: --acls="" --appc_simple_discovery_uri_prefix="http://"
--appc_store_dir="/tmp/Endpoint_SlaveEndpointTest_NoAuthorizer_2_Ta99H3/store/appc" --authenticate_http_readonly="true"
--authenticate_http_readwrite="true" --authenticatee="crammd5" --authentication_backoff_factor="1secs"
--authorizer="local" --cgroups_cpu_enable_pids_and_tids_count="false" --cgroups_enable_cfs="false"
--cgroups_hierarchy="/sys/fs/cgroup" --cgroups_limit_swap="false" --cgroups_root="mesos" --container_disk_watch_interval="15secs"
--containerizers="mesos" --credential="/tmp/Endpoint_SlaveEndpointTest_NoAuthorizer_2_Ta99H3/credential"
--default_role="*" --disallow_sharing_agent_pid_namespace="false" --disk_watch_interval="1mins"
--docker="docker" --docker_kill_orphans="true" --docker_registry="https://registry-1.docker.io"
--docker_remove_delay="6hrs" --docker_socket="/var/run/docker.sock" --docker_stop_timeout="0ns"
--docker_store_dir="/tmp/Endpoint_SlaveEndpointTest_NoAuthorizer_2_Ta99H3/store/docker" --docker_volume_checkpoint_dir="/var/run/mesos/isolators/docker/volume"
--enforce_container_disk_quota="false" --executor_registration_timeout="1mins" --executor_reregistration_timeout="2secs"
--executor_shutdown_grace_period="5secs" --fetcher_cache_dir="/tmp/Endpoint_SlaveEndpointTest_NoAuthorizer_2_Ta99H3/fetch"
--fetcher_cache_size="2GB" --frameworks_home="" --gc_delay="1weeks" --gc_disk_headroom="0.1"
--hadoop_home="" --help="false" --hostname_lookup="true" --http_command_executor="false" --http_credentials="/tmp/Endpoint_SlaveEndpointTest_NoAuthorizer_2_Ta99H3/http_credentials"
--http_heartbeat_interval="30secs" --initialize_driver_logging="true" --isolation="posix/cpu,posix/mem"
--launcher="posix" --launcher_dir="/mesos/mesos-1.5.0/_build/src" --logbufsecs="0" --logging_level="INFO"
--max_completed_executors_per_framework="150" --oversubscribed_resources_interval="15secs"
--perf_duration="10secs" --perf_interval="1mins" --port="5051" --qos_correction_interval_min="0ns"
--quiet="false" --recover="reconnect" --recovery_timeout="15mins" --registration_backoff_factor="10ms"
--resources="cpus:2;gpus:0;mem:1024;disk:1024;ports:[31000-32000]" --revocable_cpu_low_priority="true"
--runtime_dir="/tmp/Endpoint_SlaveEndpointTest_NoAuthorizer_2_Ta99H3" --sandbox_directory="/mnt/mesos/sandbox"
--strict="true" --switch_user="true" --systemd_enable_support="true" --systemd_runtime_directory="/run/systemd/system"
--version="false" --work_dir="/tmp/Endpoint_SlaveEndpointTest_NoAuthorizer_2_RtFPLj" --zk_session_timeout="10secs"
I0919 11:12:44.992449  4057 credentials.hpp:86] Loading credential for authentication from
'/tmp/Endpoint_SlaveEndpointTest_NoAuthorizer_2_Ta99H3/credential'
I0919 11:12:44.992602  4057 slave.cpp:285] Agent using credential for: test-principal
I0919 11:12:44.992627  4057 credentials.hpp:37] Loading credentials for authentication from
'/tmp/Endpoint_SlaveEndpointTest_NoAuthorizer_2_Ta99H3/http_credentials'
I0919 11:12:44.992904  4057 http.cpp:1045] Creating default 'basic' HTTP authenticator for
realm 'mesos-agent-readonly'
I0919 11:12:44.993119  4057 http.cpp:1045] Creating default 'basic' HTTP authenticator for
realm 'mesos-agent-readwrite'
I0919 11:12:44.994463  4057 slave.cpp:583] Agent resources: [{"name":"cpus","scalar":{"value":2.0},"type":"SCALAR"},{"name":"mem","scalar":{"value":1024.0},"type":"SCALAR"},{"name":"disk","scalar":{"value":1024.0},"type":"SCALAR"},{"name":"ports","ranges":{"range":[{"begin":31000,"end":32000}]},"type":"RANGES"}]
I0919 11:12:44.994676  4057 slave.cpp:591] Agent attributes: [  ]
I0919 11:12:44.994693  4057 slave.cpp:600] Agent hostname: c625abe5be45
I0919 11:12:44.994807  4056 status_update_manager.cpp:177] Pausing sending status updates
I0919 11:12:44.996202  4066 state.cpp:64] Recovering state from '/tmp/Endpoint_SlaveEndpointTest_NoAuthorizer_2_RtFPLj/meta'
I0919 11:12:44.996631  4067 status_update_manager.cpp:203] Recovering status update manager
I0919 11:12:44.996809  4067 containerizer.cpp:648] Recovering containerizer
I0919 11:12:44.998085  4062 provisioner.cpp:416] Provisioner recovery complete
I0919 11:12:44.998682  4072 slave.cpp:6298] Finished recovery
I0919 11:12:44.999217  4072 slave.cpp:6480] Querying resource estimator for oversubscribable
resources
I0919 11:12:44.999512  4065 slave.cpp:6494] Received oversubscribable resources {} from the
resource estimator
I0919 11:12:45.001922  4075 process.cpp:3929] Handling HTTP event for process 'slave(816)'
with path: '/slave(816)/containers'
I0919 11:12:45.003121  4059 http.cpp:1185] HTTP GET for /slave(816)/containers from 172.17.0.8:49946
I0919 11:12:45.003199  4059 http.cpp:976] Authorizing principal 'test-principal' to GET the
'/containers' endpoint
I0919 11:12:45.007552  4034 slave.cpp:861] Agent terminating
[       OK ] Endpoint/SlaveEndpointTest.NoAuthorizer/2 (38 ms)
[----------] 9 tests from Endpoint/SlaveEndpointTest (297 ms total)

[----------] 2 tests from ContainerizerType/DefaultContainerDNSFlagTest
[ RUN      ] ContainerizerType/DefaultContainerDNSFlagTest.ValidateFlag/0
[       OK ] ContainerizerType/DefaultContainerDNSFlagTest.ValidateFlag/0 (11 ms)
[ RUN      ] ContainerizerType/DefaultContainerDNSFlagTest.ValidateFlag/1
[       OK ] ContainerizerType/DefaultContainerDNSFlagTest.ValidateFlag/1 (9 ms)
[----------] 2 tests from ContainerizerType/DefaultContainerDNSFlagTest (20 ms total)

[----------] Global test environment tear-down
[==========] 1667 tests from 183 test cases ran. (518932 ms total)
[  PASSED  ] 1665 tests.
[  FAILED  ] 2 tests, listed below:
[  FAILED  ] ExamplesTest.TestFramework
[  FAILED  ] ExamplesTest.NoExecutorFramework

 2 FAILED TESTS
  YOU HAVE 20 DISABLED TESTS

I0919 11:12:45.096297  4076 process.cpp:1068] Failed to accept socket: future discarded
make[4]: *** [check-local] Error 1
make[4]: Leaving directory `/mesos/mesos-1.5.0/_build/src'
make[3]: *** [check-am] Error 2
make[3]: Leaving directory `/mesos/mesos-1.5.0/_build/src'
make[2]: *** [check] Error 2
make[2]: Leaving directory `/mesos/mesos-1.5.0/_build/src'
make[1]: *** [check-recursive] Error 1
make[1]: Leaving directory `/mesos/mesos-1.5.0/_build'
make: *** [distcheck] Error 1
+ docker rmi mesos-1505816587-13517
Untagged: mesos-1505816587-13517:latest
Deleted: sha256:af0791dec12fb412542918ca06c0876bceef66b398e3f37e4d05957fdf3da2cd
Deleted: sha256:c968ef1731c313e2e82804732f1c86b5972834ad744da8b8b885564552c814cb
Deleted: sha256:b017e15577892c45edc2ccb7206faac86a40a71b2b6fd379338c7f368fec5e3d
Deleted: sha256:2ec5cf3e3651bfef4cd0ba043bb9eeaf167531d934d32f051d8c940469ee1f2d
Deleted: sha256:ce575cbca157759cc2cb3f302a36b22e56301213ab95454b230374092e75d3af
Deleted: sha256:7eff17395e6c22b63079d41e63c0ec1d36c588c1348a98b0e9b5fe85135854d4
Deleted: sha256:82ea61154634d0dac55291572c3686b55e70da9cede274cc0a7fd6b05d1eb987
Deleted: sha256:b0c4cd806a63300dca9f5967de5f1ff43fbace0bff4f1a27741c3dca7f537788
Deleted: sha256:91f7f64188e93731f91124793d8313e2c3233c167430c89128e27bc2de389f81
Deleted: sha256:5e216724db776ac2c992f4aa745866047434e91f9a113211bdaa4fa12229fc74
Deleted: sha256:988cb4f687476276fbf4f00b32861f7fea528dc5543d98ea041f18a3ef44f752
Deleted: sha256:19c297cf8d75e53afb1bfa8e406db7bf27d3c9f4e2976f40c6382e6f95aad447
Deleted: sha256:3e9d68d7b228bc2bcee1db72a54face788c5bb8e5704e99580bb2fcc36d6c3c2
Deleted: sha256:20f6917d2a7faa5742249a447a66d69d168ea5c9f3b32408b53aa5aa0acda2c0
Deleted: sha256:b225ce7ab98d452eb99e3d08e90bcdb9b854d5c0404200760f9f46a0e4665a09
Deleted: sha256:7f08e6d91003fdcffc971f46342c0d1c6702bb82463ae2b6c5aec80e63e83f58
Deleted: sha256:7cc46d076fd6e037638c9231ebb88d0fc9012ecc5dc00daa009ee2acaad49638
Deleted: sha256:8215f457da144b044b0b7b44604b1d263781a669cafe439598b6844d16fc925d
Deleted: sha256:8a92132c2be575512f32a6f7977d43175a1e26c319351ddc102a7706e8add37b
Deleted: sha256:78b4478f8993eeb3ce18640e0c6f435419ed67ecd27dc21f8339a291b7f85660
Deleted: sha256:3b0ed07e8961556262057698323f9992e5bb1c115361f7f6fa9dba158359952a
Deleted: sha256:c0b4f415faa5fc721c94fde6b65b58682bb5e33752c5bfc44857175df8502822
Deleted: sha256:61f13037abba5ea6abf64ed9f4d057a348e4e56b83c6a21d9c8e70da353758be
Deleted: sha256:0dfcb20aa07cce7f037fc46c566fa69860616b81d130a05500ac0dc172587dd4
Deleted: sha256:ca8018b4a7188a88ec9cf2f1c210fb0e8dc976d557b6a4aef92cc386d8257a2c
Deleted: sha256:70f3e8af9295a975120ee60ba896773c438daefa8a728526f633bee1a75089b3
Deleted: sha256:1d25ce718585fa9884326efc305b41a1595a115960f59b29e4dde5bc85ece9c4
Deleted: sha256:4c0838bf74df6f59ded602696e1b335497a2975d96b0e1e850c7558958ad211e
Build step 'Execute shell' marked build as failure
Not sending mail to unregistered user yujie.jay@gmail.com

Mime
View raw message