mesos-builds mailing list archives

Site index · List index
Message view « Date » · « Thread »
Top « Date » · « Thread »
From Apache Jenkins Server <jenk...@builds.apache.org>
Subject Build failed in Jenkins: Mesos-Reviewbot #19618
Date Fri, 29 Sep 2017 03:11:12 GMT
See <https://builds.apache.org/job/Mesos-Reviewbot/19618/display/redirect>

------------------------------------------
[...truncated 31.79 MB...]
I0929 03:11:05.216277  5802 credentials.hpp:37] Loading credentials for authentication from
'/tmp/Endpoint_SlaveEndpointTest_AuthorizedRequest_2_u8oA3A/http_credentials'
I0929 03:11:05.216624  5802 http.cpp:1045] Creating default 'basic' HTTP authenticator for
realm 'mesos-agent-readonly'
I0929 03:11:05.216841  5802 http.cpp:1045] Creating default 'basic' HTTP authenticator for
realm 'mesos-agent-readwrite'
I0929 03:11:05.218453  5802 slave.cpp:585] Agent resources: [{"name":"cpus","scalar":{"value":2.0},"type":"SCALAR"},{"name":"mem","scalar":{"value":1024.0},"type":"SCALAR"},{"name":"disk","scalar":{"value":1024.0},"type":"SCALAR"},{"name":"ports","ranges":{"range":[{"begin":31000,"end":32000}]},"type":"RANGES"}]
I0929 03:11:05.218731  5802 slave.cpp:593] Agent attributes: [  ]
I0929 03:11:05.218749  5802 slave.cpp:602] Agent hostname: 6074363ed244
I0929 03:11:05.218924  5790 status_update_manager.cpp:177] Pausing sending status updates
I0929 03:11:05.220629  5805 state.cpp:64] Recovering state from '/tmp/Endpoint_SlaveEndpointTest_AuthorizedRequest_2_rFTAHG/meta'
I0929 03:11:05.220919  5805 status_update_manager.cpp:203] Recovering status update manager
I0929 03:11:05.221196  5800 containerizer.cpp:648] Recovering containerizer
I0929 03:11:05.222678  5809 provisioner.cpp:416] Provisioner recovery complete
I0929 03:11:05.223114  5794 slave.cpp:6322] Finished recovery
I0929 03:11:05.223731  5794 slave.cpp:6504] Querying resource estimator for oversubscribable
resources
I0929 03:11:05.223992  5792 slave.cpp:6518] Received oversubscribable resources {} from the
resource estimator
I0929 03:11:05.227068  5798 process.cpp:3929] Handling HTTP event for process 'slave(811)'
with path: '/slave(811)/containers'
I0929 03:11:05.228488  5799 http.cpp:1185] HTTP GET for /slave(811)/containers from 172.17.0.2:44284
I0929 03:11:05.228579  5799 http.cpp:976] Authorizing principal 'test-principal' to GET the
'/containers' endpoint
I0929 03:11:05.233189  5771 slave.cpp:869] Agent terminating
[       OK ] Endpoint/SlaveEndpointTest.AuthorizedRequest/2 (34 ms)
[ RUN      ] Endpoint/SlaveEndpointTest.UnauthorizedRequest/0
I0929 03:11:05.246451  5771 containerizer.cpp:292] Using isolation { environment_secret, posix/cpu,
posix/mem, filesystem/posix, network/cni }
W0929 03:11:05.246994  5771 backend.cpp:76] Failed to create 'aufs' backend: AufsBackend requires
root privileges
W0929 03:11:05.247119  5771 backend.cpp:76] Failed to create 'bind' backend: BindBackend requires
root privileges
I0929 03:11:05.247156  5771 provisioner.cpp:255] Using default backend 'copy'
I0929 03:11:05.251441  5813 slave.cpp:254] Mesos agent started on (812)@172.17.0.2:34996
I0929 03:11:05.251467  5813 slave.cpp:255] Flags at startup: --acls="" --appc_simple_discovery_uri_prefix="http://"
--appc_store_dir="/tmp/Endpoint_SlaveEndpointTest_UnauthorizedRequest_0_S0NXKe/store/appc"
--authenticate_http_readonly="true" --authenticate_http_readwrite="true" --authenticatee="crammd5"
--authentication_backoff_factor="1secs" --authorizer="local" --cgroups_cpu_enable_pids_and_tids_count="false"
--cgroups_enable_cfs="false" --cgroups_hierarchy="/sys/fs/cgroup" --cgroups_limit_swap="false"
--cgroups_root="mesos" --container_disk_watch_interval="15secs" --containerizers="mesos" --credential="/tmp/Endpoint_SlaveEndpointTest_UnauthorizedRequest_0_S0NXKe/credential"
--default_role="*" --disallow_sharing_agent_pid_namespace="false" --disk_watch_interval="1mins"
--docker="docker" --docker_kill_orphans="true" --docker_registry="https://registry-1.docker.io"
--docker_remove_delay="6hrs" --docker_socket="/var/run/docker.sock" --docker_stop_timeout="0ns"
--docker_store_dir="/tmp/Endpoint_SlaveEndpointTest_UnauthorizedRequest_0_S0NXKe/store/docker"
--docker_volume_checkpoint_dir="/var/run/mesos/isolators/docker/volume" --enforce_container_disk_quota="false"
--executor_registration_timeout="1mins" --executor_reregistration_timeout="2secs" --executor_shutdown_grace_period="5secs"
--fetcher_cache_dir="/tmp/Endpoint_SlaveEndpointTest_UnauthorizedRequest_0_S0NXKe/fetch" --fetcher_cache_size="2GB"
--frameworks_home="" --gc_delay="1weeks" --gc_disk_headroom="0.1" --hadoop_home="" --help="false"
--hostname_lookup="true" --http_command_executor="false" --http_credentials="/tmp/Endpoint_SlaveEndpointTest_UnauthorizedRequest_0_S0NXKe/http_credentials"
--http_heartbeat_interval="30secs" --initialize_driver_logging="true" --isolation="posix/cpu,posix/mem"
--launcher="posix" --launcher_dir="/mesos/mesos-1.5.0/_build/src" --logbufsecs="0" --logging_level="INFO"
--max_completed_executors_per_framework="150" --oversubscribed_resources_interval="15secs"
--perf_duration="10secs" --perf_interval="1mins" --port="5051" --qos_correction_interval_min="0ns"
--quiet="false" --recover="reconnect" --recovery_timeout="15mins" --registration_backoff_factor="10ms"
--resources="cpus:2;gpus:0;mem:1024;disk:1024;ports:[31000-32000]" --revocable_cpu_low_priority="true"
--runtime_dir="/tmp/Endpoint_SlaveEndpointTest_UnauthorizedRequest_0_S0NXKe" --sandbox_directory="/mnt/mesos/sandbox"
--strict="true" --switch_user="true" --systemd_enable_support="true" --systemd_runtime_directory="/run/systemd/system"
--version="false" --work_dir="/tmp/Endpoint_SlaveEndpointTest_UnauthorizedRequest_0_F0oNjk"
--zk_session_timeout="10secs"
I0929 03:11:05.251813  5813 credentials.hpp:86] Loading credential for authentication from
'/tmp/Endpoint_SlaveEndpointTest_UnauthorizedRequest_0_S0NXKe/credential'
I0929 03:11:05.251969  5813 slave.cpp:287] Agent using credential for: test-principal
I0929 03:11:05.251992  5813 credentials.hpp:37] Loading credentials for authentication from
'/tmp/Endpoint_SlaveEndpointTest_UnauthorizedRequest_0_S0NXKe/http_credentials'
I0929 03:11:05.252215  5813 http.cpp:1045] Creating default 'basic' HTTP authenticator for
realm 'mesos-agent-readonly'
I0929 03:11:05.252387  5813 http.cpp:1045] Creating default 'basic' HTTP authenticator for
realm 'mesos-agent-readwrite'
I0929 03:11:05.253705  5813 slave.cpp:585] Agent resources: [{"name":"cpus","scalar":{"value":2.0},"type":"SCALAR"},{"name":"mem","scalar":{"value":1024.0},"type":"SCALAR"},{"name":"disk","scalar":{"value":1024.0},"type":"SCALAR"},{"name":"ports","ranges":{"range":[{"begin":31000,"end":32000}]},"type":"RANGES"}]
I0929 03:11:05.253933  5813 slave.cpp:593] Agent attributes: [  ]
I0929 03:11:05.253948  5813 slave.cpp:602] Agent hostname: 6074363ed244
I0929 03:11:05.254070  5811 status_update_manager.cpp:177] Pausing sending status updates
I0929 03:11:05.255986  5800 state.cpp:64] Recovering state from '/tmp/Endpoint_SlaveEndpointTest_UnauthorizedRequest_0_F0oNjk/meta'
I0929 03:11:05.256278  5800 status_update_manager.cpp:203] Recovering status update manager
I0929 03:11:05.256521  5800 containerizer.cpp:648] Recovering containerizer
I0929 03:11:05.257849  5803 provisioner.cpp:416] Provisioner recovery complete
I0929 03:11:05.258222  5811 slave.cpp:6322] Finished recovery
I0929 03:11:05.258728  5811 slave.cpp:6504] Querying resource estimator for oversubscribable
resources
I0929 03:11:05.259011  5798 slave.cpp:6518] Received oversubscribable resources {} from the
resource estimator
I0929 03:11:05.261590  5807 process.cpp:3929] Handling HTTP event for process 'slave(812)'
with path: '/slave(812)/monitor/statistics'
I0929 03:11:05.263072  5806 http.cpp:1185] HTTP GET for /slave(812)/monitor/statistics from
172.17.0.2:44288
I0929 03:11:05.263149  5806 http.cpp:976] Authorizing principal 'test-principal' to GET the
'/monitor/statistics' endpoint
I0929 03:11:05.266082  5771 slave.cpp:869] Agent terminating
[       OK ] Endpoint/SlaveEndpointTest.UnauthorizedRequest/0 (31 ms)
[ RUN      ] Endpoint/SlaveEndpointTest.UnauthorizedRequest/1
I0929 03:11:05.278350  5771 containerizer.cpp:292] Using isolation { environment_secret, posix/cpu,
posix/mem, filesystem/posix, network/cni }
W0929 03:11:05.278823  5771 backend.cpp:76] Failed to create 'aufs' backend: AufsBackend requires
root privileges
W0929 03:11:05.278926  5771 backend.cpp:76] Failed to create 'bind' backend: BindBackend requires
root privileges
I0929 03:11:05.278957  5771 provisioner.cpp:255] Using default backend 'copy'
I0929 03:11:05.282622  5793 slave.cpp:254] Mesos agent started on (813)@172.17.0.2:34996
I0929 03:11:05.282651  5793 slave.cpp:255] Flags at startup: --acls="" --appc_simple_discovery_uri_prefix="http://"
--appc_store_dir="/tmp/Endpoint_SlaveEndpointTest_UnauthorizedRequest_1_4d51LS/store/appc"
--authenticate_http_readonly="true" --authenticate_http_readwrite="true" --authenticatee="crammd5"
--authentication_backoff_factor="1secs" --authorizer="local" --cgroups_cpu_enable_pids_and_tids_count="false"
--cgroups_enable_cfs="false" --cgroups_hierarchy="/sys/fs/cgroup" --cgroups_limit_swap="false"
--cgroups_root="mesos" --container_disk_watch_interval="15secs" --containerizers="mesos" --credential="/tmp/Endpoint_SlaveEndpointTest_UnauthorizedRequest_1_4d51LS/credential"
--default_role="*" --disallow_sharing_agent_pid_namespace="false" --disk_watch_interval="1mins"
--docker="docker" --docker_kill_orphans="true" --docker_registry="https://registry-1.docker.io"
--docker_remove_delay="6hrs" --docker_socket="/var/run/docker.sock" --docker_stop_timeout="0ns"
--docker_store_dir="/tmp/Endpoint_SlaveEndpointTest_UnauthorizedRequest_1_4d51LS/store/docker"
--docker_volume_checkpoint_dir="/var/run/mesos/isolators/docker/volume" --enforce_container_disk_quota="false"
--executor_registration_timeout="1mins" --executor_reregistration_timeout="2secs" --executor_shutdown_grace_period="5secs"
--fetcher_cache_dir="/tmp/Endpoint_SlaveEndpointTest_UnauthorizedRequest_1_4d51LS/fetch" --fetcher_cache_size="2GB"
--frameworks_home="" --gc_delay="1weeks" --gc_disk_headroom="0.1" --hadoop_home="" --help="false"
--hostname_lookup="true" --http_command_executor="false" --http_credentials="/tmp/Endpoint_SlaveEndpointTest_UnauthorizedRequest_1_4d51LS/http_credentials"
--http_heartbeat_interval="30secs" --initialize_driver_logging="true" --isolation="posix/cpu,posix/mem"
--launcher="posix" --launcher_dir="/mesos/mesos-1.5.0/_build/src" --logbufsecs="0" --logging_level="INFO"
--max_completed_executors_per_framework="150" --oversubscribed_resources_interval="15secs"
--perf_duration="10secs" --perf_interval="1mins" --port="5051" --qos_correction_interval_min="0ns"
--quiet="false" --recover="reconnect" --recovery_timeout="15mins" --registration_backoff_factor="10ms"
--resources="cpus:2;gpus:0;mem:1024;disk:1024;ports:[31000-32000]" --revocable_cpu_low_priority="true"
--runtime_dir="/tmp/Endpoint_SlaveEndpointTest_UnauthorizedRequest_1_4d51LS" --sandbox_directory="/mnt/mesos/sandbox"
--strict="true" --switch_user="true" --systemd_enable_support="true" --systemd_runtime_directory="/run/systemd/system"
--version="false" --work_dir="/tmp/Endpoint_SlaveEndpointTest_UnauthorizedRequest_1_Zj82fY"
--zk_session_timeout="10secs"
I0929 03:11:05.283118  5793 credentials.hpp:86] Loading credential for authentication from
'/tmp/Endpoint_SlaveEndpointTest_UnauthorizedRequest_1_4d51LS/credential'
I0929 03:11:05.283295  5793 slave.cpp:287] Agent using credential for: test-principal
I0929 03:11:05.283321  5793 credentials.hpp:37] Loading credentials for authentication from
'/tmp/Endpoint_SlaveEndpointTest_UnauthorizedRequest_1_4d51LS/http_credentials'
I0929 03:11:05.283576  5793 http.cpp:1045] Creating default 'basic' HTTP authenticator for
realm 'mesos-agent-readonly'
I0929 03:11:05.283746  5793 http.cpp:1045] Creating default 'basic' HTTP authenticator for
realm 'mesos-agent-readwrite'
I0929 03:11:05.285217  5793 slave.cpp:585] Agent resources: [{"name":"cpus","scalar":{"value":2.0},"type":"SCALAR"},{"name":"mem","scalar":{"value":1024.0},"type":"SCALAR"},{"name":"disk","scalar":{"value":1024.0},"type":"SCALAR"},{"name":"ports","ranges":{"range":[{"begin":31000,"end":32000}]},"type":"RANGES"}]
I0929 03:11:05.285475  5793 slave.cpp:593] Agent attributes: [  ]
I0929 03:11:05.285493  5793 slave.cpp:602] Agent hostname: 6074363ed244
I0929 03:11:05.285657  5800 status_update_manager.cpp:177] Pausing sending status updates
I0929 03:11:05.287215  5810 state.cpp:64] Recovering state from '/tmp/Endpoint_SlaveEndpointTest_UnauthorizedRequest_1_Zj82fY/meta'
I0929 03:11:05.287751  5804 status_update_manager.cpp:203] Recovering status update manager
I0929 03:11:05.288017  5796 containerizer.cpp:648] Recovering containerizer
I0929 03:11:05.289683  5790 provisioner.cpp:416] Provisioner recovery complete
I0929 03:11:05.290069  5800 slave.cpp:6322] Finished recovery
I0929 03:11:05.290577  5800 slave.cpp:6504] Querying resource estimator for oversubscribable
resources
I0929 03:11:05.290835  5810 slave.cpp:6518] Received oversubscribable resources {} from the
resource estimator
I0929 03:11:05.293017  5805 process.cpp:3929] Handling HTTP event for process 'slave(813)'
with path: '/slave(813)/monitor/statistics.json'
I0929 03:11:05.294435  5797 http.cpp:1185] HTTP GET for /slave(813)/monitor/statistics.json
from 172.17.0.2:44298
I0929 03:11:05.294524  5797 http.cpp:976] Authorizing principal 'test-principal' to GET the
'/monitor/statistics.json' endpoint
I0929 03:11:05.296634  5771 slave.cpp:869] Agent terminating
[       OK ] Endpoint/SlaveEndpointTest.UnauthorizedRequest/1 (30 ms)
[ RUN      ] Endpoint/SlaveEndpointTest.UnauthorizedRequest/2
I0929 03:11:05.309654  5771 containerizer.cpp:292] Using isolation { environment_secret, posix/cpu,
posix/mem, filesystem/posix, network/cni }
W0929 03:11:05.310160  5771 backend.cpp:76] Failed to create 'aufs' backend: AufsBackend requires
root privileges
W0929 03:11:05.310281  5771 backend.cpp:76] Failed to create 'bind' backend: BindBackend requires
root privileges
I0929 03:11:05.310319  5771 provisioner.cpp:255] Using default backend 'copy'
I0929 03:11:05.314188  5794 slave.cpp:254] Mesos agent started on (814)@172.17.0.2:34996
I0929 03:11:05.314214  5794 slave.cpp:255] Flags at startup: --acls="" --appc_simple_discovery_uri_prefix="http://"
--appc_store_dir="/tmp/Endpoint_SlaveEndpointTest_UnauthorizedRequest_2_AyvG5w/store/appc"
--authenticate_http_readonly="true" --authenticate_http_readwrite="true" --authenticatee="crammd5"
--authentication_backoff_factor="1secs" --authorizer="local" --cgroups_cpu_enable_pids_and_tids_count="false"
--cgroups_enable_cfs="false" --cgroups_hierarchy="/sys/fs/cgroup" --cgroups_limit_swap="false"
--cgroups_root="mesos" --container_disk_watch_interval="15secs" --containerizers="mesos" --credential="/tmp/Endpoint_SlaveEndpointTest_UnauthorizedRequest_2_AyvG5w/credential"
--default_role="*" --disallow_sharing_agent_pid_namespace="false" --disk_watch_interval="1mins"
--docker="docker" --docker_kill_orphans="true" --docker_registry="https://registry-1.docker.io"
--docker_remove_delay="6hrs" --docker_socket="/var/run/docker.sock" --docker_stop_timeout="0ns"
--docker_store_dir="/tmp/Endpoint_SlaveEndpointTest_UnauthorizedRequest_2_AyvG5w/store/docker"
--docker_volume_checkpoint_dir="/var/run/mesos/isolators/docker/volume" --enforce_container_disk_quota="false"
--executor_registration_timeout="1mins" --executor_reregistration_timeout="2secs" --executor_shutdown_grace_period="5secs"
--fetcher_cache_dir="/tmp/Endpoint_SlaveEndpointTest_UnauthorizedRequest_2_AyvG5w/fetch" --fetcher_cache_size="2GB"
--frameworks_home="" --gc_delay="1weeks" --gc_disk_headroom="0.1" --hadoop_home="" --help="false"
--hostname_lookup="true" --http_command_executor="false" --http_credentials="/tmp/Endpoint_SlaveEndpointTest_UnauthorizedRequest_2_AyvG5w/http_credentials"
--http_heartbeat_interval="30secs" --initialize_driver_logging="true" --isolation="posix/cpu,posix/mem"
--launcher="posix" --launcher_dir="/mesos/mesos-1.5.0/_build/src" --logbufsecs="0" --logging_level="INFO"
--max_completed_executors_per_framework="150" --oversubscribed_resources_interval="15secs"
--perf_duration="10secs" --perf_interval="1mins" --port="5051" --qos_correction_interval_min="0ns"
--quiet="false" --recover="reconnect" --recovery_timeout="15mins" --registration_backoff_factor="10ms"
--resources="cpus:2;gpus:0;mem:1024;disk:1024;ports:[31000-32000]" --revocable_cpu_low_priority="true"
--runtime_dir="/tmp/Endpoint_SlaveEndpointTest_UnauthorizedRequest_2_AyvG5w" --sandbox_directory="/mnt/mesos/sandbox"
--strict="true" --switch_user="true" --systemd_enable_support="true" --systemd_runtime_directory="/run/systemd/system"
--version="false" --work_dir="/tmp/Endpoint_SlaveEndpointTest_UnauthorizedRequest_2_1P33uC"
--zk_session_timeout="10secs"
I0929 03:11:05.314642  5794 credentials.hpp:86] Loading credential for authentication from
'/tmp/Endpoint_SlaveEndpointTest_UnauthorizedRequest_2_AyvG5w/credential'
I0929 03:11:05.314813  5794 slave.cpp:287] Agent using credential for: test-principal
I0929 03:11:05.314846  5794 credentials.hpp:37] Loading credentials for authentication from
'/tmp/Endpoint_SlaveEndpointTest_UnauthorizedRequest_2_AyvG5w/http_credentials'
I0929 03:11:05.315114  5794 http.cpp:1045] Creating default 'basic' HTTP authenticator for
realm 'mesos-agent-readonly'
I0929 03:11:05.315310  5794 http.cpp:1045] Creating default 'basic' HTTP authenticator for
realm 'mesos-agent-readwrite'
I0929 03:11:05.316817  5794 slave.cpp:585] Agent resources: [{"name":"cpus","scalar":{"value":2.0},"type":"SCALAR"},{"name":"mem","scalar":{"value":1024.0},"type":"SCALAR"},{"name":"disk","scalar":{"value":1024.0},"type":"SCALAR"},{"name":"ports","ranges":{"range":[{"begin":31000,"end":32000}]},"type":"RANGES"}]
I0929 03:11:05.317064  5794 slave.cpp:593] Agent attributes: [  ]
I0929 03:11:05.317077  5794 slave.cpp:602] Agent hostname: 6074363ed244
I0929 03:11:05.317219  5803 status_update_manager.cpp:177] Pausing sending status updates
I0929 03:11:05.318802  5805 state.cpp:64] Recovering state from '/tmp/Endpoint_SlaveEndpointTest_UnauthorizedRequest_2_1P33uC/meta'
I0929 03:11:05.319109  5805 status_update_manager.cpp:203] Recovering status update manager
I0929 03:11:05.319301  5805 containerizer.cpp:648] Recovering containerizer
I0929 03:11:05.320740  5798 provisioner.cpp:416] Provisioner recovery complete
I0929 03:11:05.321244  5803 slave.cpp:6322] Finished recovery
I0929 03:11:05.321735  5803 slave.cpp:6504] Querying resource estimator for oversubscribable
resources
I0929 03:11:05.321986  5790 slave.cpp:6518] Received oversubscribable resources {} from the
resource estimator
I0929 03:11:05.324563  5800 process.cpp:3929] Handling HTTP event for process 'slave(814)'
with path: '/slave(814)/containers'
I0929 03:11:05.326175  5796 http.cpp:1185] HTTP GET for /slave(814)/containers from 172.17.0.2:44302
I0929 03:11:05.326294  5796 http.cpp:976] Authorizing principal 'test-principal' to GET the
'/containers' endpoint
I0929 03:11:05.329187  5771 slave.cpp:869] Agent terminating
[       OK ] Endpoint/SlaveEndpointTest.UnauthorizedRequest/2 (31 ms)
[ RUN      ] Endpoint/SlaveEndpointTest.NoAuthorizer/0
I0929 03:11:05.341331  5771 containerizer.cpp:292] Using isolation { environment_secret, posix/cpu,
posix/mem, filesystem/posix, network/cni }
W0929 03:11:05.341779  5771 backend.cpp:76] Failed to create 'aufs' backend: AufsBackend requires
root privileges
W0929 03:11:05.341886  5771 backend.cpp:76] Failed to create 'bind' backend: BindBackend requires
root privileges
I0929 03:11:05.341917  5771 provisioner.cpp:255] Using default backend 'copy'
I0929 03:11:05.343636  5771 cluster.cpp:448] Creating default 'local' authorizer
I0929 03:11:05.345790  5790 slave.cpp:254] Mesos agent started on (815)@172.17.0.2:34996
I0929 03:11:05.345814  5790 slave.cpp:255] Flags at startup: --acls="" --appc_simple_discovery_uri_prefix="http://"
--appc_store_dir="/tmp/Endpoint_SlaveEndpointTest_NoAuthorizer_0_AGB7Hb/store/appc" --authenticate_http_readonly="true"
--authenticate_http_readwrite="true" --authenticatee="crammd5" --authentication_backoff_factor="1secs"
--authorizer="local" --cgroups_cpu_enable_pids_and_tids_count="false" --cgroups_enable_cfs="false"
--cgroups_hierarchy="/sys/fs/cgroup" --cgroups_limit_swap="false" --cgroups_root="mesos" --container_disk_watch_interval="15secs"
--containerizers="mesos" --credential="/tmp/Endpoint_SlaveEndpointTest_NoAuthorizer_0_AGB7Hb/credential"
--default_role="*" --disallow_sharing_agent_pid_namespace="false" --disk_watch_interval="1mins"
--docker="docker" --docker_kill_orphans="true" --docker_registry="https://registry-1.docker.io"
--docker_remove_delay="6hrs" --docker_socket="/var/run/docker.sock" --docker_stop_timeout="0ns"
--docker_store_dir="/tmp/Endpoint_SlaveEndpointTest_NoAuthorizer_0_AGB7Hb/store/docker" --docker_volume_checkpoint_dir="/var/run/mesos/isolators/docker/volume"
--enforce_container_disk_quota="false" --executor_registration_timeout="1mins" --executor_reregistration_timeout="2secs"
--executor_shutdown_grace_period="5secs" --fetcher_cache_dir="/tmp/Endpoint_SlaveEndpointTest_NoAuthorizer_0_AGB7Hb/fetch"
--fetcher_cache_size="2GB" --frameworks_home="" --gc_delay="1weeks" --gc_disk_headroom="0.1"
--hadoop_home="" --help="false" --hostname_lookup="true" --http_command_executor="false" --http_credentials="/tmp/Endpoint_SlaveEndpointTest_NoAuthorizer_0_AGB7Hb/http_credentials"
--http_heartbeat_interval="30secs" --initialize_driver_logging="true" --isolation="posix/cpu,posix/mem"
--launcher="posix" --launcher_dir="/mesos/mesos-1.5.0/_build/src" --logbufsecs="0" --logging_level="INFO"
--max_completed_executors_per_framework="150" --oversubscribed_resources_interval="15secs"
--perf_duration="10secs" --perf_interval="1mins" --port="5051" --qos_correction_interval_min="0ns"
--quiet="false" --recover="reconnect" --recovery_timeout="15mins" --registration_backoff_factor="10ms"
--resources="cpus:2;gpus:0;mem:1024;disk:1024;ports:[31000-32000]" --revocable_cpu_low_priority="true"
--runtime_dir="/tmp/Endpoint_SlaveEndpointTest_NoAuthorizer_0_AGB7Hb" --sandbox_directory="/mnt/mesos/sandbox"
--strict="true" --switch_user="true" --systemd_enable_support="true" --systemd_runtime_directory="/run/systemd/system"
--version="false" --work_dir="/tmp/Endpoint_SlaveEndpointTest_NoAuthorizer_0_VrEN2g" --zk_session_timeout="10secs"
I0929 03:11:05.346177  5790 credentials.hpp:86] Loading credential for authentication from
'/tmp/Endpoint_SlaveEndpointTest_NoAuthorizer_0_AGB7Hb/credential'
I0929 03:11:05.346330  5790 slave.cpp:287] Agent using credential for: test-principal
I0929 03:11:05.346354  5790 credentials.hpp:37] Loading credentials for authentication from
'/tmp/Endpoint_SlaveEndpointTest_NoAuthorizer_0_AGB7Hb/http_credentials'
I0929 03:11:05.346598  5790 http.cpp:1045] Creating default 'basic' HTTP authenticator for
realm 'mesos-agent-readonly'
I0929 03:11:05.346788  5790 http.cpp:1045] Creating default 'basic' HTTP authenticator for
realm 'mesos-agent-readwrite'
I0929 03:11:05.348091  5790 slave.cpp:585] Agent resources: [{"name":"cpus","scalar":{"value":2.0},"type":"SCALAR"},{"name":"mem","scalar":{"value":1024.0},"type":"SCALAR"},{"name":"disk","scalar":{"value":1024.0},"type":"SCALAR"},{"name":"ports","ranges":{"range":[{"begin":31000,"end":32000}]},"type":"RANGES"}]
I0929 03:11:05.348317  5790 slave.cpp:593] Agent attributes: [  ]
I0929 03:11:05.348330  5790 slave.cpp:602] Agent hostname: 6074363ed244
I0929 03:11:05.348493  5802 status_update_manager.cpp:177] Pausing sending status updates
I0929 03:11:05.349779  5800 state.cpp:64] Recovering state from '/tmp/Endpoint_SlaveEndpointTest_NoAuthorizer_0_VrEN2g/meta'
I0929 03:11:05.350155  5812 status_update_manager.cpp:203] Recovering status update manager
I0929 03:11:05.350459  5803 containerizer.cpp:648] Recovering containerizer
I0929 03:11:05.351943  5796 provisioner.cpp:416] Provisioner recovery complete
I0929 03:11:05.352363  5795 slave.cpp:6322] Finished recovery
I0929 03:11:05.352864  5795 slave.cpp:6504] Querying resource estimator for oversubscribable
resources
I0929 03:11:05.353068  5812 slave.cpp:6518] Received oversubscribable resources {} from the
resource estimator
I0929 03:11:05.355561  5804 process.cpp:3929] Handling HTTP event for process 'slave(815)'
with path: '/slave(815)/monitor/statistics'
I0929 03:11:05.356822  5810 http.cpp:1185] HTTP GET for /slave(815)/monitor/statistics from
172.17.0.2:44310
I0929 03:11:05.356895  5810 http.cpp:976] Authorizing principal 'test-principal' to GET the
'/monitor/statistics' endpoint
I0929 03:11:05.360786  5771 slave.cpp:869] Agent terminating
[       OK ] Endpoint/SlaveEndpointTest.NoAuthorizer/0 (32 ms)
[ RUN      ] Endpoint/SlaveEndpointTest.NoAuthorizer/1
I0929 03:11:05.377282  5771 containerizer.cpp:292] Using isolation { environment_secret, posix/cpu,
posix/mem, filesystem/posix, network/cni }
W0929 03:11:05.377943  5771 backend.cpp:76] Failed to create 'aufs' backend: AufsBackend requires
root privileges
W0929 03:11:05.378103  5771 backend.cpp:76] Failed to create 'bind' backend: BindBackend requires
root privileges
I0929 03:11:05.378139  5771 provisioner.cpp:255] Using default backend 'copy'
I0929 03:11:05.380937  5771 cluster.cpp:448] Creating default 'local' authorizer
I0929 03:11:05.383824  5804 slave.cpp:254] Mesos agent started on (816)@172.17.0.2:34996
I0929 03:11:05.383854  5804 slave.cpp:255] Flags at startup: --acls="" --appc_simple_discovery_uri_prefix="http://"
--appc_store_dir="/tmp/Endpoint_SlaveEndpointTest_NoAuthorizer_1_FsF9DQ/store/appc" --authenticate_http_readonly="true"
--authenticate_http_readwrite="true" --authenticatee="crammd5" --authentication_backoff_factor="1secs"
--authorizer="local" --cgroups_cpu_enable_pids_and_tids_count="false" --cgroups_enable_cfs="false"
--cgroups_hierarchy="/sys/fs/cgroup" --cgroups_limit_swap="false" --cgroups_root="mesos" --container_disk_watch_interval="15secs"
--containerizers="mesos" --credential="/tmp/Endpoint_SlaveEndpointTest_NoAuthorizer_1_FsF9DQ/credential"
--default_role="*" --disallow_sharing_agent_pid_namespace="false" --disk_watch_interval="1mins"
--docker="docker" --docker_kill_orphans="true" --docker_registry="https://registry-1.docker.io"
--docker_remove_delay="6hrs" --docker_socket="/var/run/docker.sock" --docker_stop_timeout="0ns"
--docker_store_dir="/tmp/Endpoint_SlaveEndpointTest_NoAuthorizer_1_FsF9DQ/store/docker" --docker_volume_checkpoint_dir="/var/run/mesos/isolators/docker/volume"
--enforce_container_disk_quota="false" --executor_registration_timeout="1mins" --executor_reregistration_timeout="2secs"
--executor_shutdown_grace_period="5secs" --fetcher_cache_dir="/tmp/Endpoint_SlaveEndpointTest_NoAuthorizer_1_FsF9DQ/fetch"
--fetcher_cache_size="2GB" --frameworks_home="" --gc_delay="1weeks" --gc_disk_headroom="0.1"
--hadoop_home="" --help="false" --hostname_lookup="true" --http_command_executor="false" --http_credentials="/tmp/Endpoint_SlaveEndpointTest_NoAuthorizer_1_FsF9DQ/http_credentials"
--http_heartbeat_interval="30secs" --initialize_driver_logging="true" --isolation="posix/cpu,posix/mem"
--launcher="posix" --launcher_dir="/mesos/mesos-1.5.0/_build/src" --logbufsecs="0" --logging_level="INFO"
--max_completed_executors_per_framework="150" --oversubscribed_resources_interval="15secs"
--perf_duration="10secs" --perf_interval="1mins" --port="5051" --qos_correction_interval_min="0ns"
--quiet="false" --recover="reconnect" --recovery_timeout="15mins" --registration_backoff_factor="10ms"
--resources="cpus:2;gpus:0;mem:1024;disk:1024;ports:[31000-32000]" --revocable_cpu_low_priority="true"
--runtime_dir="/tmp/Endpoint_SlaveEndpointTest_NoAuthorizer_1_FsF9DQ" --sandbox_directory="/mnt/mesos/sandbox"
--strict="true" --switch_user="true" --systemd_enable_support="true" --systemd_runtime_directory="/run/systemd/system"
--version="false" --work_dir="/tmp/Endpoint_SlaveEndpointTest_NoAuthorizer_1_gC3MTV" --zk_session_timeout="10secs"
I0929 03:11:05.384330  5804 credentials.hpp:86] Loading credential for authentication from
'/tmp/Endpoint_SlaveEndpointTest_NoAuthorizer_1_FsF9DQ/credential'
I0929 03:11:05.384505  5804 slave.cpp:287] Agent using credential for: test-principal
I0929 03:11:05.384526  5804 credentials.hpp:37] Loading credentials for authentication from
'/tmp/Endpoint_SlaveEndpointTest_NoAuthorizer_1_FsF9DQ/http_credentials'
I0929 03:11:05.384778  5804 http.cpp:1045] Creating default 'basic' HTTP authenticator for
realm 'mesos-agent-readonly'
I0929 03:11:05.384927  5804 http.cpp:1045] Creating default 'basic' HTTP authenticator for
realm 'mesos-agent-readwrite'
I0929 03:11:05.386294  5804 slave.cpp:585] Agent resources: [{"name":"cpus","scalar":{"value":2.0},"type":"SCALAR"},{"name":"mem","scalar":{"value":1024.0},"type":"SCALAR"},{"name":"disk","scalar":{"value":1024.0},"type":"SCALAR"},{"name":"ports","ranges":{"range":[{"begin":31000,"end":32000}]},"type":"RANGES"}]
I0929 03:11:05.386549  5804 slave.cpp:593] Agent attributes: [  ]
I0929 03:11:05.386561  5804 slave.cpp:602] Agent hostname: 6074363ed244
I0929 03:11:05.386831  5802 status_update_manager.cpp:177] Pausing sending status updates
I0929 03:11:05.388026  5811 state.cpp:64] Recovering state from '/tmp/Endpoint_SlaveEndpointTest_NoAuthorizer_1_gC3MTV/meta'
I0929 03:11:05.388334  5795 status_update_manager.cpp:203] Recovering status update manager
I0929 03:11:05.388552  5795 containerizer.cpp:648] Recovering containerizer
I0929 03:11:05.390033  5791 provisioner.cpp:416] Provisioner recovery complete
I0929 03:11:05.390419  5796 slave.cpp:6322] Finished recovery
I0929 03:11:05.391079  5796 slave.cpp:6504] Querying resource estimator for oversubscribable
resources
I0929 03:11:05.391301  5807 slave.cpp:6518] Received oversubscribable resources {} from the
resource estimator
I0929 03:11:05.393641  5793 process.cpp:3929] Handling HTTP event for process 'slave(816)'
with path: '/slave(816)/monitor/statistics.json'
I0929 03:11:05.395303  5798 http.cpp:1185] HTTP GET for /slave(816)/monitor/statistics.json
from 172.17.0.2:44320
I0929 03:11:05.395418  5798 http.cpp:976] Authorizing principal 'test-principal' to GET the
'/monitor/statistics.json' endpoint
I0929 03:11:05.399792  5771 slave.cpp:869] Agent terminating
[       OK ] Endpoint/SlaveEndpointTest.NoAuthorizer/1 (38 ms)
[ RUN      ] Endpoint/SlaveEndpointTest.NoAuthorizer/2
I0929 03:11:05.412807  5771 containerizer.cpp:292] Using isolation { environment_secret, posix/cpu,
posix/mem, filesystem/posix, network/cni }
W0929 03:11:05.413406  5771 backend.cpp:76] Failed to create 'aufs' backend: AufsBackend requires
root privileges
W0929 03:11:05.413545  5771 backend.cpp:76] Failed to create 'bind' backend: BindBackend requires
root privileges
I0929 03:11:05.413588  5771 provisioner.cpp:255] Using default backend 'copy'
I0929 03:11:05.415737  5771 cluster.cpp:448] Creating default 'local' authorizer
I0929 03:11:05.418161  5806 slave.cpp:254] Mesos agent started on (817)@172.17.0.2:34996
I0929 03:11:05.418190  5806 slave.cpp:255] Flags at startup: --acls="" --appc_simple_discovery_uri_prefix="http://"
--appc_store_dir="/tmp/Endpoint_SlaveEndpointTest_NoAuthorizer_2_rkDHWv/store/appc" --authenticate_http_readonly="true"
--authenticate_http_readwrite="true" --authenticatee="crammd5" --authentication_backoff_factor="1secs"
--authorizer="local" --cgroups_cpu_enable_pids_and_tids_count="false" --cgroups_enable_cfs="false"
--cgroups_hierarchy="/sys/fs/cgroup" --cgroups_limit_swap="false" --cgroups_root="mesos" --container_disk_watch_interval="15secs"
--containerizers="mesos" --credential="/tmp/Endpoint_SlaveEndpointTest_NoAuthorizer_2_rkDHWv/credential"
--default_role="*" --disallow_sharing_agent_pid_namespace="false" --disk_watch_interval="1mins"
--docker="docker" --docker_kill_orphans="true" --docker_registry="https://registry-1.docker.io"
--docker_remove_delay="6hrs" --docker_socket="/var/run/docker.sock" --docker_stop_timeout="0ns"
--docker_store_dir="/tmp/Endpoint_SlaveEndpointTest_NoAuthorizer_2_rkDHWv/store/docker" --docker_volume_checkpoint_dir="/var/run/mesos/isolators/docker/volume"
--enforce_container_disk_quota="false" --executor_registration_timeout="1mins" --executor_reregistration_timeout="2secs"
--executor_shutdown_grace_period="5secs" --fetcher_cache_dir="/tmp/Endpoint_SlaveEndpointTest_NoAuthorizer_2_rkDHWv/fetch"
--fetcher_cache_size="2GB" --frameworks_home="" --gc_delay="1weeks" --gc_disk_headroom="0.1"
--hadoop_home="" --help="false" --hostname_lookup="true" --http_command_executor="false" --http_credentials="/tmp/Endpoint_SlaveEndpointTest_NoAuthorizer_2_rkDHWv/http_credentials"
--http_heartbeat_interval="30secs" --initialize_driver_logging="true" --isolation="posix/cpu,posix/mem"
--launcher="posix" --launcher_dir="/mesos/mesos-1.5.0/_build/src" --logbufsecs="0" --logging_level="INFO"
--max_completed_executors_per_framework="150" --oversubscribed_resources_interval="15secs"
--perf_duration="10secs" --perf_interval="1mins" --port="5051" --qos_correction_interval_min="0ns"
--quiet="false" --recover="reconnect" --recovery_timeout="15mins" --registration_backoff_factor="10ms"
--resources="cpus:2;gpus:0;mem:1024;disk:1024;ports:[31000-32000]" --revocable_cpu_low_priority="true"
--runtime_dir="/tmp/Endpoint_SlaveEndpointTest_NoAuthorizer_2_rkDHWv" --sandbox_directory="/mnt/mesos/sandbox"
--strict="true" --switch_user="true" --systemd_enable_support="true" --systemd_runtime_directory="/run/systemd/system"
--version="false" --work_dir="/tmp/Endpoint_SlaveEndpointTest_NoAuthorizer_2_mEvM6A" --zk_session_timeout="10secs"
I0929 03:11:05.418748  5806 credentials.hpp:86] Loading credential for authentication from
'/tmp/Endpoint_SlaveEndpointTest_NoAuthorizer_2_rkDHWv/credential'
I0929 03:11:05.418961  5806 slave.cpp:287] Agent using credential for: test-principal
I0929 03:11:05.418993  5806 credentials.hpp:37] Loading credentials for authentication from
'/tmp/Endpoint_SlaveEndpointTest_NoAuthorizer_2_rkDHWv/http_credentials'
I0929 03:11:05.419337  5806 http.cpp:1045] Creating default 'basic' HTTP authenticator for
realm 'mesos-agent-readonly'
I0929 03:11:05.419605  5806 http.cpp:1045] Creating default 'basic' HTTP authenticator for
realm 'mesos-agent-readwrite'
I0929 03:11:05.421922  5806 slave.cpp:585] Agent resources: [{"name":"cpus","scalar":{"value":2.0},"type":"SCALAR"},{"name":"mem","scalar":{"value":1024.0},"type":"SCALAR"},{"name":"disk","scalar":{"value":1024.0},"type":"SCALAR"},{"name":"ports","ranges":{"range":[{"begin":31000,"end":32000}]},"type":"RANGES"}]
I0929 03:11:05.422344  5806 slave.cpp:593] Agent attributes: [  ]
I0929 03:11:05.422391  5806 slave.cpp:602] Agent hostname: 6074363ed244
I0929 03:11:05.422636  5791 status_update_manager.cpp:177] Pausing sending status updates
I0929 03:11:05.424744  5804 state.cpp:64] Recovering state from '/tmp/Endpoint_SlaveEndpointTest_NoAuthorizer_2_mEvM6A/meta'
I0929 03:11:05.425045  5796 status_update_manager.cpp:203] Recovering status update manager
I0929 03:11:05.425271  5800 containerizer.cpp:648] Recovering containerizer
I0929 03:11:05.426960  5809 provisioner.cpp:416] Provisioner recovery complete
I0929 03:11:05.427390  5808 slave.cpp:6322] Finished recovery
I0929 03:11:05.427872  5808 slave.cpp:6504] Querying resource estimator for oversubscribable
resources
I0929 03:11:05.428159  5802 slave.cpp:6518] Received oversubscribable resources {} from the
resource estimator
I0929 03:11:05.430773  5799 process.cpp:3929] Handling HTTP event for process 'slave(817)'
with path: '/slave(817)/containers'
I0929 03:11:05.432369  5794 http.cpp:1185] HTTP GET for /slave(817)/containers from 172.17.0.2:44330
I0929 03:11:05.432502  5794 http.cpp:976] Authorizing principal 'test-principal' to GET the
'/containers' endpoint
I0929 03:11:05.436863  5771 slave.cpp:869] Agent terminating
[       OK ] Endpoint/SlaveEndpointTest.NoAuthorizer/2 (37 ms)
[----------] 9 tests from Endpoint/SlaveEndpointTest (308 ms total)

[----------] 2 tests from ContainerizerType/DefaultContainerDNSFlagTest
[ RUN      ] ContainerizerType/DefaultContainerDNSFlagTest.ValidateFlag/0
[       OK ] ContainerizerType/DefaultContainerDNSFlagTest.ValidateFlag/0 (12 ms)
[ RUN      ] ContainerizerType/DefaultContainerDNSFlagTest.ValidateFlag/1
[       OK ] ContainerizerType/DefaultContainerDNSFlagTest.ValidateFlag/1 (12 ms)
[----------] 2 tests from ContainerizerType/DefaultContainerDNSFlagTest (24 ms total)

[----------] Global test environment tear-down
[==========] 1676 tests from 184 test cases ran. (707416 ms total)
[  PASSED  ] 1675 tests.
[  FAILED  ] 1 test, listed below:
[  FAILED  ] MasterTest.IgnoreOldAgentReregistration

 1 FAILED TEST
  YOU HAVE 20 DISABLED TESTS

I0929 03:11:05.530557  5814 process.cpp:1068] Failed to accept socket: future discarded
make[4]: *** [check-local] Error 1
make[4]: Leaving directory `/mesos/mesos-1.5.0/_build/src'
make[3]: *** [check-am] Error 2
make[3]: Leaving directory `/mesos/mesos-1.5.0/_build/src'
make[2]: *** [check] Error 2
make[2]: Leaving directory `/mesos/mesos-1.5.0/_build/src'
make[1]: *** [check-recursive] Error 1
make[1]: Leaving directory `/mesos/mesos-1.5.0/_build'
make: *** [distcheck] Error 1
+ docker rmi mesos-1506651177-20410
Untagged: mesos-1506651177-20410:latest
Deleted: sha256:325e1c3266c7900cb83647be5b0794a8673f222b9bf204260a6d4431ce2613f4
Deleted: sha256:cac58c2a32172b6665582a6d7a01c78525e09a867eb11946d05800eb08bf925b
Deleted: sha256:5aba02525f7ba04833f4eb5ca927fbeab83bdbef98c524accabe8043841d9e51
Deleted: sha256:9a21d57a0dddb4a49126e42332edbdb90afae016f6386490d8f2a5a7c468d8d2
Deleted: sha256:0ad13949bbc9c86039db1d348b6bee82ea5eab4c3338a380bdd2e4f4ad18718c
Deleted: sha256:9e7676c4a6674caf24da822625d09dcefa0f0cb44fcb48f52963aa0779e17da2
Deleted: sha256:24b459222c3ec7aad9814187157a8f7890a3bfab6e483dc0e070d3998cf090ae
Deleted: sha256:8b395803e1e4178407bfaa6af203aed4539255cb563a782e0415d85b96c9e1a4
Deleted: sha256:14543e8f1cf81605b3bae017119a1b0b1177053e8a0c1b9e7875f047d5249d5e
Deleted: sha256:e190e1fe46690b11f553d0fb98e415ca58fb7a4749f9508790b06611915b7477
Deleted: sha256:8f4ee1e20353be99b95bbef173162c30b241a52cdb5284bc2a6dadb1a1935b59
Deleted: sha256:3e8bb41e4c689a05352adb860414358d0eb6204b3497b8b7ad3c57d51fa5f414
Deleted: sha256:e5f13bdf9e39db708a8971cd78c54566601d0eae511905ed6031f6df96b73f71
Deleted: sha256:0d8cf5915d5955223241cf14a1b29ea8e907ae4310314419771ae74c09a7e5ff
Deleted: sha256:ea414e0e5bf0fa75a043c5333a6ee350e163be8bb4287a23a7d626a54c82d8d0
Deleted: sha256:1d0e04a5b03f219eb098e5a0e6160e9cd658c0070b841dee0a4935e7dc5276f3
Deleted: sha256:6a1674cc95aa2d58e3fd808547c1bb61716b7f97af5aef896ac05b5845f2fb04
Deleted: sha256:e4186ec06e7aa21313ca878e32cabbd9ceaad0a58a898b1ef44238b20e66491b
Deleted: sha256:489ce465cf461946f9782ff9c3699dcf0522626c3c50543ae91ab390021ec29d
Deleted: sha256:117662d94f5d0aeff5334703f8e3078189489db5a44be044c2cd7321ba4181de
Deleted: sha256:ce78393c6cd4b4e3291f66bb5c7f55c70e513028f821703c53126eaf5ceeaddf
Deleted: sha256:e79e031e467df96cfa443701a38bb0c537d4f0223a9d024cf6c3fcd3b3f00f78
Deleted: sha256:1d73c502c0339cc9efe6a23c2073e94aeffb11e0b2e7a39a7236fc0bba880461
Deleted: sha256:3d2b50060ebd4c5537a73f91fe6337045f1521dc6ba4c320b6f6b7b6ccc26537
Deleted: sha256:42cd62c4c86fead3f686fd32a5297106ccdeffaef8fa435f65ac4734e5498bfc
Deleted: sha256:7508d600fc00d034e7074f17b83b7e6c88ebd3e4ab96ffdd2523dcac49432946
Deleted: sha256:76d45403b84b9c933cc9a9d2f8cf96d78e3ece5ddd2221b3c18409f47a7b5d02
Deleted: sha256:a503f7b085e4abf585a75c905faffa3aba7c0f5e8f4c1651fea4dc7170522eb1
Build step 'Execute shell' marked build as failure

Mime
View raw message