mesos-builds mailing list archives

Site index · List index
Message view « Date » · « Thread »
Top « Date » · « Thread »
From Apache Jenkins Server <jenk...@builds.apache.org>
Subject Build failed in Jenkins: Mesos-Reviewbot #19516
Date Fri, 22 Sep 2017 21:27:11 GMT
See <https://builds.apache.org/job/Mesos-Reviewbot/19516/display/redirect>

------------------------------------------
[...truncated 31.77 MB...]
I0922 21:27:03.735231  5815 credentials.hpp:37] Loading credentials for authentication from
'/tmp/Endpoint_SlaveEndpointTest_AuthorizedRequest_2_2WFKEr/http_credentials'
I0922 21:27:03.735625  5815 http.cpp:1045] Creating default 'basic' HTTP authenticator for
realm 'mesos-agent-readonly'
I0922 21:27:03.735882  5815 http.cpp:1045] Creating default 'basic' HTTP authenticator for
realm 'mesos-agent-readwrite'
I0922 21:27:03.738113  5815 slave.cpp:585] Agent resources: [{"name":"cpus","scalar":{"value":2.0},"type":"SCALAR"},{"name":"mem","scalar":{"value":1024.0},"type":"SCALAR"},{"name":"disk","scalar":{"value":1024.0},"type":"SCALAR"},{"name":"ports","ranges":{"range":[{"begin":31000,"end":32000}]},"type":"RANGES"}]
I0922 21:27:03.738543  5815 slave.cpp:593] Agent attributes: [  ]
I0922 21:27:03.738575  5815 slave.cpp:602] Agent hostname: 43c33424d83e
I0922 21:27:03.738795  5812 status_update_manager.cpp:177] Pausing sending status updates
I0922 21:27:03.740311  5804 state.cpp:64] Recovering state from '/tmp/Endpoint_SlaveEndpointTest_AuthorizedRequest_2_w2EpPE/meta'
I0922 21:27:03.740737  5803 status_update_manager.cpp:203] Recovering status update manager
I0922 21:27:03.741078  5808 containerizer.cpp:648] Recovering containerizer
I0922 21:27:03.742849  5817 provisioner.cpp:416] Provisioner recovery complete
I0922 21:27:03.743317  5817 slave.cpp:6322] Finished recovery
I0922 21:27:03.743839  5817 slave.cpp:6504] Querying resource estimator for oversubscribable
resources
I0922 21:27:03.744227  5801 slave.cpp:6518] Received oversubscribable resources {} from the
resource estimator
I0922 21:27:03.747602  5819 process.cpp:3929] Handling HTTP event for process 'slave(811)'
with path: '/slave(811)/containers'
I0922 21:27:03.749410  5805 http.cpp:1185] HTTP GET for /slave(811)/containers from 172.17.0.2:37056
I0922 21:27:03.749487  5805 http.cpp:976] Authorizing principal 'test-principal' to GET the
'/containers' endpoint
I0922 21:27:03.754045  5814 slave.cpp:869] Agent terminating
[       OK ] Endpoint/SlaveEndpointTest.AuthorizedRequest/2 (42 ms)
[ RUN      ] Endpoint/SlaveEndpointTest.UnauthorizedRequest/0
I0922 21:27:03.767846  5780 containerizer.cpp:292] Using isolation { environment_secret, posix/cpu,
posix/mem, filesystem/posix, network/cni }
W0922 21:27:03.768419  5780 backend.cpp:76] Failed to create 'aufs' backend: AufsBackend requires
root privileges
W0922 21:27:03.768525  5780 backend.cpp:76] Failed to create 'bind' backend: BindBackend requires
root privileges
I0922 21:27:03.768556  5780 provisioner.cpp:255] Using default backend 'copy'
I0922 21:27:03.772629  5818 slave.cpp:254] Mesos agent started on (812)@172.17.0.2:39826
I0922 21:27:03.772655  5818 slave.cpp:255] Flags at startup: --acls="" --appc_simple_discovery_uri_prefix="http://"
--appc_store_dir="/tmp/Endpoint_SlaveEndpointTest_UnauthorizedRequest_0_a6wmjB/store/appc"
--authenticate_http_readonly="true" --authenticate_http_readwrite="true" --authenticatee="crammd5"
--authentication_backoff_factor="1secs" --authorizer="local" --cgroups_cpu_enable_pids_and_tids_count="false"
--cgroups_enable_cfs="false" --cgroups_hierarchy="/sys/fs/cgroup" --cgroups_limit_swap="false"
--cgroups_root="mesos" --container_disk_watch_interval="15secs" --containerizers="mesos" --credential="/tmp/Endpoint_SlaveEndpointTest_UnauthorizedRequest_0_a6wmjB/credential"
--default_role="*" --disallow_sharing_agent_pid_namespace="false" --disk_watch_interval="1mins"
--docker="docker" --docker_kill_orphans="true" --docker_registry="https://registry-1.docker.io"
--docker_remove_delay="6hrs" --docker_socket="/var/run/docker.sock" --docker_stop_timeout="0ns"
--docker_store_dir="/tmp/Endpoint_SlaveEndpointTest_UnauthorizedRequest_0_a6wmjB/store/docker"
--docker_volume_checkpoint_dir="/var/run/mesos/isolators/docker/volume" --enforce_container_disk_quota="false"
--executor_registration_timeout="1mins" --executor_reregistration_timeout="2secs" --executor_shutdown_grace_period="5secs"
--fetcher_cache_dir="/tmp/Endpoint_SlaveEndpointTest_UnauthorizedRequest_0_a6wmjB/fetch" --fetcher_cache_size="2GB"
--frameworks_home="" --gc_delay="1weeks" --gc_disk_headroom="0.1" --hadoop_home="" --help="false"
--hostname_lookup="true" --http_command_executor="false" --http_credentials="/tmp/Endpoint_SlaveEndpointTest_UnauthorizedRequest_0_a6wmjB/http_credentials"
--http_heartbeat_interval="30secs" --initialize_driver_logging="true" --isolation="posix/cpu,posix/mem"
--launcher="posix" --launcher_dir="/mesos/mesos-1.5.0/_build/src" --logbufsecs="0" --logging_level="INFO"
--max_completed_executors_per_framework="150" --oversubscribed_resources_interval="15secs"
--perf_duration="10secs" --perf_interval="1mins" --port="5051" --qos_correction_interval_min="0ns"
--quiet="false" --recover="reconnect" --recovery_timeout="15mins" --registration_backoff_factor="10ms"
--resources="cpus:2;gpus:0;mem:1024;disk:1024;ports:[31000-32000]" --revocable_cpu_low_priority="true"
--runtime_dir="/tmp/Endpoint_SlaveEndpointTest_UnauthorizedRequest_0_a6wmjB" --sandbox_directory="/mnt/mesos/sandbox"
--strict="true" --switch_user="true" --systemd_enable_support="true" --systemd_runtime_directory="/run/systemd/system"
--version="false" --work_dir="/tmp/Endpoint_SlaveEndpointTest_UnauthorizedRequest_0_C2BPnO"
--zk_session_timeout="10secs"
I0922 21:27:03.773167  5818 credentials.hpp:86] Loading credential for authentication from
'/tmp/Endpoint_SlaveEndpointTest_UnauthorizedRequest_0_a6wmjB/credential'
I0922 21:27:03.773416  5818 slave.cpp:287] Agent using credential for: test-principal
I0922 21:27:03.773461  5818 credentials.hpp:37] Loading credentials for authentication from
'/tmp/Endpoint_SlaveEndpointTest_UnauthorizedRequest_0_a6wmjB/http_credentials'
I0922 21:27:03.773829  5818 http.cpp:1045] Creating default 'basic' HTTP authenticator for
realm 'mesos-agent-readonly'
I0922 21:27:03.774030  5818 http.cpp:1045] Creating default 'basic' HTTP authenticator for
realm 'mesos-agent-readwrite'
I0922 21:27:03.775612  5818 slave.cpp:585] Agent resources: [{"name":"cpus","scalar":{"value":2.0},"type":"SCALAR"},{"name":"mem","scalar":{"value":1024.0},"type":"SCALAR"},{"name":"disk","scalar":{"value":1024.0},"type":"SCALAR"},{"name":"ports","ranges":{"range":[{"begin":31000,"end":32000}]},"type":"RANGES"}]
I0922 21:27:03.775864  5818 slave.cpp:593] Agent attributes: [  ]
I0922 21:27:03.775878  5818 slave.cpp:602] Agent hostname: 43c33424d83e
I0922 21:27:03.776027  5804 status_update_manager.cpp:177] Pausing sending status updates
I0922 21:27:03.777582  5817 state.cpp:64] Recovering state from '/tmp/Endpoint_SlaveEndpointTest_UnauthorizedRequest_0_C2BPnO/meta'
I0922 21:27:03.777933  5810 status_update_manager.cpp:203] Recovering status update manager
I0922 21:27:03.778159  5819 containerizer.cpp:648] Recovering containerizer
I0922 21:27:03.780001  5806 provisioner.cpp:416] Provisioner recovery complete
I0922 21:27:03.780520  5804 slave.cpp:6322] Finished recovery
I0922 21:27:03.781036  5804 slave.cpp:6504] Querying resource estimator for oversubscribable
resources
I0922 21:27:03.781364  5814 slave.cpp:6518] Received oversubscribable resources {} from the
resource estimator
I0922 21:27:03.784294  5800 process.cpp:3929] Handling HTTP event for process 'slave(812)'
with path: '/slave(812)/monitor/statistics'
I0922 21:27:03.785740  5821 http.cpp:1185] HTTP GET for /slave(812)/monitor/statistics from
172.17.0.2:37062
I0922 21:27:03.785817  5821 http.cpp:976] Authorizing principal 'test-principal' to GET the
'/monitor/statistics' endpoint
I0922 21:27:03.788370  5807 slave.cpp:869] Agent terminating
[       OK ] Endpoint/SlaveEndpointTest.UnauthorizedRequest/0 (32 ms)
[ RUN      ] Endpoint/SlaveEndpointTest.UnauthorizedRequest/1
I0922 21:27:03.800992  5780 containerizer.cpp:292] Using isolation { environment_secret, posix/cpu,
posix/mem, filesystem/posix, network/cni }
W0922 21:27:03.801576  5780 backend.cpp:76] Failed to create 'aufs' backend: AufsBackend requires
root privileges
W0922 21:27:03.801710  5780 backend.cpp:76] Failed to create 'bind' backend: BindBackend requires
root privileges
I0922 21:27:03.801758  5780 provisioner.cpp:255] Using default backend 'copy'
I0922 21:27:03.805941  5820 slave.cpp:254] Mesos agent started on (813)@172.17.0.2:39826
I0922 21:27:03.805969  5820 slave.cpp:255] Flags at startup: --acls="" --appc_simple_discovery_uri_prefix="http://"
--appc_store_dir="/tmp/Endpoint_SlaveEndpointTest_UnauthorizedRequest_1_mXEkiL/store/appc"
--authenticate_http_readonly="true" --authenticate_http_readwrite="true" --authenticatee="crammd5"
--authentication_backoff_factor="1secs" --authorizer="local" --cgroups_cpu_enable_pids_and_tids_count="false"
--cgroups_enable_cfs="false" --cgroups_hierarchy="/sys/fs/cgroup" --cgroups_limit_swap="false"
--cgroups_root="mesos" --container_disk_watch_interval="15secs" --containerizers="mesos" --credential="/tmp/Endpoint_SlaveEndpointTest_UnauthorizedRequest_1_mXEkiL/credential"
--default_role="*" --disallow_sharing_agent_pid_namespace="false" --disk_watch_interval="1mins"
--docker="docker" --docker_kill_orphans="true" --docker_registry="https://registry-1.docker.io"
--docker_remove_delay="6hrs" --docker_socket="/var/run/docker.sock" --docker_stop_timeout="0ns"
--docker_store_dir="/tmp/Endpoint_SlaveEndpointTest_UnauthorizedRequest_1_mXEkiL/store/docker"
--docker_volume_checkpoint_dir="/var/run/mesos/isolators/docker/volume" --enforce_container_disk_quota="false"
--executor_registration_timeout="1mins" --executor_reregistration_timeout="2secs" --executor_shutdown_grace_period="5secs"
--fetcher_cache_dir="/tmp/Endpoint_SlaveEndpointTest_UnauthorizedRequest_1_mXEkiL/fetch" --fetcher_cache_size="2GB"
--frameworks_home="" --gc_delay="1weeks" --gc_disk_headroom="0.1" --hadoop_home="" --help="false"
--hostname_lookup="true" --http_command_executor="false" --http_credentials="/tmp/Endpoint_SlaveEndpointTest_UnauthorizedRequest_1_mXEkiL/http_credentials"
--http_heartbeat_interval="30secs" --initialize_driver_logging="true" --isolation="posix/cpu,posix/mem"
--launcher="posix" --launcher_dir="/mesos/mesos-1.5.0/_build/src" --logbufsecs="0" --logging_level="INFO"
--max_completed_executors_per_framework="150" --oversubscribed_resources_interval="15secs"
--perf_duration="10secs" --perf_interval="1mins" --port="5051" --qos_correction_interval_min="0ns"
--quiet="false" --recover="reconnect" --recovery_timeout="15mins" --registration_backoff_factor="10ms"
--resources="cpus:2;gpus:0;mem:1024;disk:1024;ports:[31000-32000]" --revocable_cpu_low_priority="true"
--runtime_dir="/tmp/Endpoint_SlaveEndpointTest_UnauthorizedRequest_1_mXEkiL" --sandbox_directory="/mnt/mesos/sandbox"
--strict="true" --switch_user="true" --systemd_enable_support="true" --systemd_runtime_directory="/run/systemd/system"
--version="false" --work_dir="/tmp/Endpoint_SlaveEndpointTest_UnauthorizedRequest_1_654RhY"
--zk_session_timeout="10secs"
I0922 21:27:03.806391  5820 credentials.hpp:86] Loading credential for authentication from
'/tmp/Endpoint_SlaveEndpointTest_UnauthorizedRequest_1_mXEkiL/credential'
I0922 21:27:03.806574  5820 slave.cpp:287] Agent using credential for: test-principal
I0922 21:27:03.806597  5820 credentials.hpp:37] Loading credentials for authentication from
'/tmp/Endpoint_SlaveEndpointTest_UnauthorizedRequest_1_mXEkiL/http_credentials'
I0922 21:27:03.806879  5820 http.cpp:1045] Creating default 'basic' HTTP authenticator for
realm 'mesos-agent-readonly'
I0922 21:27:03.807103  5820 http.cpp:1045] Creating default 'basic' HTTP authenticator for
realm 'mesos-agent-readwrite'
I0922 21:27:03.808475  5820 slave.cpp:585] Agent resources: [{"name":"cpus","scalar":{"value":2.0},"type":"SCALAR"},{"name":"mem","scalar":{"value":1024.0},"type":"SCALAR"},{"name":"disk","scalar":{"value":1024.0},"type":"SCALAR"},{"name":"ports","ranges":{"range":[{"begin":31000,"end":32000}]},"type":"RANGES"}]
I0922 21:27:03.808720  5820 slave.cpp:593] Agent attributes: [  ]
I0922 21:27:03.808743  5820 slave.cpp:602] Agent hostname: 43c33424d83e
I0922 21:27:03.808938  5802 status_update_manager.cpp:177] Pausing sending status updates
I0922 21:27:03.810345  5819 state.cpp:64] Recovering state from '/tmp/Endpoint_SlaveEndpointTest_UnauthorizedRequest_1_654RhY/meta'
I0922 21:27:03.810655  5821 status_update_manager.cpp:203] Recovering status update manager
I0922 21:27:03.810870  5822 containerizer.cpp:648] Recovering containerizer
I0922 21:27:03.812417  5814 provisioner.cpp:416] Provisioner recovery complete
I0922 21:27:03.812923  5812 slave.cpp:6322] Finished recovery
I0922 21:27:03.813545  5812 slave.cpp:6504] Querying resource estimator for oversubscribable
resources
I0922 21:27:03.813853  5809 slave.cpp:6518] Received oversubscribable resources {} from the
resource estimator
I0922 21:27:03.816443  5799 process.cpp:3929] Handling HTTP event for process 'slave(813)'
with path: '/slave(813)/monitor/statistics.json'
I0922 21:27:03.818168  5817 http.cpp:1185] HTTP GET for /slave(813)/monitor/statistics.json
from 172.17.0.2:37064
I0922 21:27:03.818285  5817 http.cpp:976] Authorizing principal 'test-principal' to GET the
'/monitor/statistics.json' endpoint
I0922 21:27:03.820477  5819 slave.cpp:869] Agent terminating
[       OK ] Endpoint/SlaveEndpointTest.UnauthorizedRequest/1 (32 ms)
[ RUN      ] Endpoint/SlaveEndpointTest.UnauthorizedRequest/2
I0922 21:27:03.833748  5780 containerizer.cpp:292] Using isolation { environment_secret, posix/cpu,
posix/mem, filesystem/posix, network/cni }
W0922 21:27:03.834302  5780 backend.cpp:76] Failed to create 'aufs' backend: AufsBackend requires
root privileges
W0922 21:27:03.834419  5780 backend.cpp:76] Failed to create 'bind' backend: BindBackend requires
root privileges
I0922 21:27:03.834451  5780 provisioner.cpp:255] Using default backend 'copy'
I0922 21:27:03.838264  5809 slave.cpp:254] Mesos agent started on (814)@172.17.0.2:39826
I0922 21:27:03.838287  5809 slave.cpp:255] Flags at startup: --acls="" --appc_simple_discovery_uri_prefix="http://"
--appc_store_dir="/tmp/Endpoint_SlaveEndpointTest_UnauthorizedRequest_2_kNEQAV/store/appc"
--authenticate_http_readonly="true" --authenticate_http_readwrite="true" --authenticatee="crammd5"
--authentication_backoff_factor="1secs" --authorizer="local" --cgroups_cpu_enable_pids_and_tids_count="false"
--cgroups_enable_cfs="false" --cgroups_hierarchy="/sys/fs/cgroup" --cgroups_limit_swap="false"
--cgroups_root="mesos" --container_disk_watch_interval="15secs" --containerizers="mesos" --credential="/tmp/Endpoint_SlaveEndpointTest_UnauthorizedRequest_2_kNEQAV/credential"
--default_role="*" --disallow_sharing_agent_pid_namespace="false" --disk_watch_interval="1mins"
--docker="docker" --docker_kill_orphans="true" --docker_registry="https://registry-1.docker.io"
--docker_remove_delay="6hrs" --docker_socket="/var/run/docker.sock" --docker_stop_timeout="0ns"
--docker_store_dir="/tmp/Endpoint_SlaveEndpointTest_UnauthorizedRequest_2_kNEQAV/store/docker"
--docker_volume_checkpoint_dir="/var/run/mesos/isolators/docker/volume" --enforce_container_disk_quota="false"
--executor_registration_timeout="1mins" --executor_reregistration_timeout="2secs" --executor_shutdown_grace_period="5secs"
--fetcher_cache_dir="/tmp/Endpoint_SlaveEndpointTest_UnauthorizedRequest_2_kNEQAV/fetch" --fetcher_cache_size="2GB"
--frameworks_home="" --gc_delay="1weeks" --gc_disk_headroom="0.1" --hadoop_home="" --help="false"
--hostname_lookup="true" --http_command_executor="false" --http_credentials="/tmp/Endpoint_SlaveEndpointTest_UnauthorizedRequest_2_kNEQAV/http_credentials"
--http_heartbeat_interval="30secs" --initialize_driver_logging="true" --isolation="posix/cpu,posix/mem"
--launcher="posix" --launcher_dir="/mesos/mesos-1.5.0/_build/src" --logbufsecs="0" --logging_level="INFO"
--max_completed_executors_per_framework="150" --oversubscribed_resources_interval="15secs"
--perf_duration="10secs" --perf_interval="1mins" --port="5051" --qos_correction_interval_min="0ns"
--quiet="false" --recover="reconnect" --recovery_timeout="15mins" --registration_backoff_factor="10ms"
--resources="cpus:2;gpus:0;mem:1024;disk:1024;ports:[31000-32000]" --revocable_cpu_low_priority="true"
--runtime_dir="/tmp/Endpoint_SlaveEndpointTest_UnauthorizedRequest_2_kNEQAV" --sandbox_directory="/mnt/mesos/sandbox"
--strict="true" --switch_user="true" --systemd_enable_support="true" --systemd_runtime_directory="/run/systemd/system"
--version="false" --work_dir="/tmp/Endpoint_SlaveEndpointTest_UnauthorizedRequest_2_4y7sv8"
--zk_session_timeout="10secs"
I0922 21:27:03.838646  5809 credentials.hpp:86] Loading credential for authentication from
'/tmp/Endpoint_SlaveEndpointTest_UnauthorizedRequest_2_kNEQAV/credential'
I0922 21:27:03.838790  5809 slave.cpp:287] Agent using credential for: test-principal
I0922 21:27:03.838814  5809 credentials.hpp:37] Loading credentials for authentication from
'/tmp/Endpoint_SlaveEndpointTest_UnauthorizedRequest_2_kNEQAV/http_credentials'
I0922 21:27:03.839035  5809 http.cpp:1045] Creating default 'basic' HTTP authenticator for
realm 'mesos-agent-readonly'
I0922 21:27:03.839179  5809 http.cpp:1045] Creating default 'basic' HTTP authenticator for
realm 'mesos-agent-readwrite'
I0922 21:27:03.840456  5809 slave.cpp:585] Agent resources: [{"name":"cpus","scalar":{"value":2.0},"type":"SCALAR"},{"name":"mem","scalar":{"value":1024.0},"type":"SCALAR"},{"name":"disk","scalar":{"value":1024.0},"type":"SCALAR"},{"name":"ports","ranges":{"range":[{"begin":31000,"end":32000}]},"type":"RANGES"}]
I0922 21:27:03.840679  5809 slave.cpp:593] Agent attributes: [  ]
I0922 21:27:03.840692  5809 slave.cpp:602] Agent hostname: 43c33424d83e
I0922 21:27:03.840818  5812 status_update_manager.cpp:177] Pausing sending status updates
I0922 21:27:03.842032  5817 state.cpp:64] Recovering state from '/tmp/Endpoint_SlaveEndpointTest_UnauthorizedRequest_2_4y7sv8/meta'
I0922 21:27:03.842293  5814 status_update_manager.cpp:203] Recovering status update manager
I0922 21:27:03.842536  5802 containerizer.cpp:648] Recovering containerizer
I0922 21:27:03.844249  5804 provisioner.cpp:416] Provisioner recovery complete
I0922 21:27:03.844712  5812 slave.cpp:6322] Finished recovery
I0922 21:27:03.845362  5812 slave.cpp:6504] Querying resource estimator for oversubscribable
resources
I0922 21:27:03.845664  5799 slave.cpp:6518] Received oversubscribable resources {} from the
resource estimator
I0922 21:27:03.848170  5807 process.cpp:3929] Handling HTTP event for process 'slave(814)'
with path: '/slave(814)/containers'
I0922 21:27:03.849694  5818 http.cpp:1185] HTTP GET for /slave(814)/containers from 172.17.0.2:37066
I0922 21:27:03.849781  5818 http.cpp:976] Authorizing principal 'test-principal' to GET the
'/containers' endpoint
I0922 21:27:03.852399  5780 slave.cpp:869] Agent terminating
[       OK ] Endpoint/SlaveEndpointTest.UnauthorizedRequest/2 (30 ms)
[ RUN      ] Endpoint/SlaveEndpointTest.NoAuthorizer/0
I0922 21:27:03.865444  5780 containerizer.cpp:292] Using isolation { environment_secret, posix/cpu,
posix/mem, filesystem/posix, network/cni }
W0922 21:27:03.865975  5780 backend.cpp:76] Failed to create 'aufs' backend: AufsBackend requires
root privileges
W0922 21:27:03.866097  5780 backend.cpp:76] Failed to create 'bind' backend: BindBackend requires
root privileges
I0922 21:27:03.866133  5780 provisioner.cpp:255] Using default backend 'copy'
I0922 21:27:03.867904  5780 cluster.cpp:448] Creating default 'local' authorizer
I0922 21:27:03.870229  5816 slave.cpp:254] Mesos agent started on (815)@172.17.0.2:39826
I0922 21:27:03.870272  5816 slave.cpp:255] Flags at startup: --acls="" --appc_simple_discovery_uri_prefix="http://"
--appc_store_dir="/tmp/Endpoint_SlaveEndpointTest_NoAuthorizer_0_qrPUb6/store/appc" --authenticate_http_readonly="true"
--authenticate_http_readwrite="true" --authenticatee="crammd5" --authentication_backoff_factor="1secs"
--authorizer="local" --cgroups_cpu_enable_pids_and_tids_count="false" --cgroups_enable_cfs="false"
--cgroups_hierarchy="/sys/fs/cgroup" --cgroups_limit_swap="false" --cgroups_root="mesos" --container_disk_watch_interval="15secs"
--containerizers="mesos" --credential="/tmp/Endpoint_SlaveEndpointTest_NoAuthorizer_0_qrPUb6/credential"
--default_role="*" --disallow_sharing_agent_pid_namespace="false" --disk_watch_interval="1mins"
--docker="docker" --docker_kill_orphans="true" --docker_registry="https://registry-1.docker.io"
--docker_remove_delay="6hrs" --docker_socket="/var/run/docker.sock" --docker_stop_timeout="0ns"
--docker_store_dir="/tmp/Endpoint_SlaveEndpointTest_NoAuthorizer_0_qrPUb6/store/docker" --docker_volume_checkpoint_dir="/var/run/mesos/isolators/docker/volume"
--enforce_container_disk_quota="false" --executor_registration_timeout="1mins" --executor_reregistration_timeout="2secs"
--executor_shutdown_grace_period="5secs" --fetcher_cache_dir="/tmp/Endpoint_SlaveEndpointTest_NoAuthorizer_0_qrPUb6/fetch"
--fetcher_cache_size="2GB" --frameworks_home="" --gc_delay="1weeks" --gc_disk_headroom="0.1"
--hadoop_home="" --help="false" --hostname_lookup="true" --http_command_executor="false" --http_credentials="/tmp/Endpoint_SlaveEndpointTest_NoAuthorizer_0_qrPUb6/http_credentials"
--http_heartbeat_interval="30secs" --initialize_driver_logging="true" --isolation="posix/cpu,posix/mem"
--launcher="posix" --launcher_dir="/mesos/mesos-1.5.0/_build/src" --logbufsecs="0" --logging_level="INFO"
--max_completed_executors_per_framework="150" --oversubscribed_resources_interval="15secs"
--perf_duration="10secs" --perf_interval="1mins" --port="5051" --qos_correction_interval_min="0ns"
--quiet="false" --recover="reconnect" --recovery_timeout="15mins" --registration_backoff_factor="10ms"
--resources="cpus:2;gpus:0;mem:1024;disk:1024;ports:[31000-32000]" --revocable_cpu_low_priority="true"
--runtime_dir="/tmp/Endpoint_SlaveEndpointTest_NoAuthorizer_0_qrPUb6" --sandbox_directory="/mnt/mesos/sandbox"
--strict="true" --switch_user="true" --systemd_enable_support="true" --systemd_runtime_directory="/run/systemd/system"
--version="false" --work_dir="/tmp/Endpoint_SlaveEndpointTest_NoAuthorizer_0_iWiV1i" --zk_session_timeout="10secs"
I0922 21:27:03.870760  5816 credentials.hpp:86] Loading credential for authentication from
'/tmp/Endpoint_SlaveEndpointTest_NoAuthorizer_0_qrPUb6/credential'
I0922 21:27:03.870993  5816 slave.cpp:287] Agent using credential for: test-principal
I0922 21:27:03.871021  5816 credentials.hpp:37] Loading credentials for authentication from
'/tmp/Endpoint_SlaveEndpointTest_NoAuthorizer_0_qrPUb6/http_credentials'
I0922 21:27:03.871302  5816 http.cpp:1045] Creating default 'basic' HTTP authenticator for
realm 'mesos-agent-readonly'
I0922 21:27:03.871493  5816 http.cpp:1045] Creating default 'basic' HTTP authenticator for
realm 'mesos-agent-readwrite'
I0922 21:27:03.872977  5816 slave.cpp:585] Agent resources: [{"name":"cpus","scalar":{"value":2.0},"type":"SCALAR"},{"name":"mem","scalar":{"value":1024.0},"type":"SCALAR"},{"name":"disk","scalar":{"value":1024.0},"type":"SCALAR"},{"name":"ports","ranges":{"range":[{"begin":31000,"end":32000}]},"type":"RANGES"}]
I0922 21:27:03.873227  5816 slave.cpp:593] Agent attributes: [  ]
I0922 21:27:03.873252  5816 slave.cpp:602] Agent hostname: 43c33424d83e
I0922 21:27:03.873486  5800 status_update_manager.cpp:177] Pausing sending status updates
I0922 21:27:03.875056  5804 state.cpp:64] Recovering state from '/tmp/Endpoint_SlaveEndpointTest_NoAuthorizer_0_iWiV1i/meta'
I0922 21:27:03.875435  5801 status_update_manager.cpp:203] Recovering status update manager
I0922 21:27:03.875625  5811 containerizer.cpp:648] Recovering containerizer
I0922 21:27:03.877198  5821 provisioner.cpp:416] Provisioner recovery complete
I0922 21:27:03.877621  5800 slave.cpp:6322] Finished recovery
I0922 21:27:03.878108  5800 slave.cpp:6504] Querying resource estimator for oversubscribable
resources
I0922 21:27:03.878414  5813 slave.cpp:6518] Received oversubscribable resources {} from the
resource estimator
I0922 21:27:03.881609  5805 process.cpp:3929] Handling HTTP event for process 'slave(815)'
with path: '/slave(815)/monitor/statistics'
I0922 21:27:03.882900  5808 http.cpp:1185] HTTP GET for /slave(815)/monitor/statistics from
172.17.0.2:37072
I0922 21:27:03.882975  5808 http.cpp:976] Authorizing principal 'test-principal' to GET the
'/monitor/statistics' endpoint
I0922 21:27:03.886911  5780 slave.cpp:869] Agent terminating
[       OK ] Endpoint/SlaveEndpointTest.NoAuthorizer/0 (35 ms)
[ RUN      ] Endpoint/SlaveEndpointTest.NoAuthorizer/1
I0922 21:27:03.900622  5780 containerizer.cpp:292] Using isolation { environment_secret, posix/cpu,
posix/mem, filesystem/posix, network/cni }
W0922 21:27:03.901479  5780 backend.cpp:76] Failed to create 'aufs' backend: AufsBackend requires
root privileges
W0922 21:27:03.901641  5780 backend.cpp:76] Failed to create 'bind' backend: BindBackend requires
root privileges
I0922 21:27:03.901685  5780 provisioner.cpp:255] Using default backend 'copy'
I0922 21:27:03.903983  5780 cluster.cpp:448] Creating default 'local' authorizer
I0922 21:27:03.906414  5803 slave.cpp:254] Mesos agent started on (816)@172.17.0.2:39826
I0922 21:27:03.906651  5803 slave.cpp:255] Flags at startup: --acls="" --appc_simple_discovery_uri_prefix="http://"
--appc_store_dir="/tmp/Endpoint_SlaveEndpointTest_NoAuthorizer_1_OsGz7g/store/appc" --authenticate_http_readonly="true"
--authenticate_http_readwrite="true" --authenticatee="crammd5" --authentication_backoff_factor="1secs"
--authorizer="local" --cgroups_cpu_enable_pids_and_tids_count="false" --cgroups_enable_cfs="false"
--cgroups_hierarchy="/sys/fs/cgroup" --cgroups_limit_swap="false" --cgroups_root="mesos" --container_disk_watch_interval="15secs"
--containerizers="mesos" --credential="/tmp/Endpoint_SlaveEndpointTest_NoAuthorizer_1_OsGz7g/credential"
--default_role="*" --disallow_sharing_agent_pid_namespace="false" --disk_watch_interval="1mins"
--docker="docker" --docker_kill_orphans="true" --docker_registry="https://registry-1.docker.io"
--docker_remove_delay="6hrs" --docker_socket="/var/run/docker.sock" --docker_stop_timeout="0ns"
--docker_store_dir="/tmp/Endpoint_SlaveEndpointTest_NoAuthorizer_1_OsGz7g/store/docker" --docker_volume_checkpoint_dir="/var/run/mesos/isolators/docker/volume"
--enforce_container_disk_quota="false" --executor_registration_timeout="1mins" --executor_reregistration_timeout="2secs"
--executor_shutdown_grace_period="5secs" --fetcher_cache_dir="/tmp/Endpoint_SlaveEndpointTest_NoAuthorizer_1_OsGz7g/fetch"
--fetcher_cache_size="2GB" --frameworks_home="" --gc_delay="1weeks" --gc_disk_headroom="0.1"
--hadoop_home="" --help="false" --hostname_lookup="true" --http_command_executor="false" --http_credentials="/tmp/Endpoint_SlaveEndpointTest_NoAuthorizer_1_OsGz7g/http_credentials"
--http_heartbeat_interval="30secs" --initialize_driver_logging="true" --isolation="posix/cpu,posix/mem"
--launcher="posix" --launcher_dir="/mesos/mesos-1.5.0/_build/src" --logbufsecs="0" --logging_level="INFO"
--max_completed_executors_per_framework="150" --oversubscribed_resources_interval="15secs"
--perf_duration="10secs" --perf_interval="1mins" --port="5051" --qos_correction_interval_min="0ns"
--quiet="false" --recover="reconnect" --recovery_timeout="15mins" --registration_backoff_factor="10ms"
--resources="cpus:2;gpus:0;mem:1024;disk:1024;ports:[31000-32000]" --revocable_cpu_low_priority="true"
--runtime_dir="/tmp/Endpoint_SlaveEndpointTest_NoAuthorizer_1_OsGz7g" --sandbox_directory="/mnt/mesos/sandbox"
--strict="true" --switch_user="true" --systemd_enable_support="true" --systemd_runtime_directory="/run/systemd/system"
--version="false" --work_dir="/tmp/Endpoint_SlaveEndpointTest_NoAuthorizer_1_WnUmSt" --zk_session_timeout="10secs"
I0922 21:27:03.907598  5803 credentials.hpp:86] Loading credential for authentication from
'/tmp/Endpoint_SlaveEndpointTest_NoAuthorizer_1_OsGz7g/credential'
I0922 21:27:03.908089  5803 slave.cpp:287] Agent using credential for: test-principal
I0922 21:27:03.908208  5803 credentials.hpp:37] Loading credentials for authentication from
'/tmp/Endpoint_SlaveEndpointTest_NoAuthorizer_1_OsGz7g/http_credentials'
I0922 21:27:03.908730  5803 http.cpp:1045] Creating default 'basic' HTTP authenticator for
realm 'mesos-agent-readonly'
I0922 21:27:03.909195  5803 http.cpp:1045] Creating default 'basic' HTTP authenticator for
realm 'mesos-agent-readwrite'
I0922 21:27:03.911059  5803 slave.cpp:585] Agent resources: [{"name":"cpus","scalar":{"value":2.0},"type":"SCALAR"},{"name":"mem","scalar":{"value":1024.0},"type":"SCALAR"},{"name":"disk","scalar":{"value":1024.0},"type":"SCALAR"},{"name":"ports","ranges":{"range":[{"begin":31000,"end":32000}]},"type":"RANGES"}]
I0922 21:27:03.911365  5803 slave.cpp:593] Agent attributes: [  ]
I0922 21:27:03.911383  5803 slave.cpp:602] Agent hostname: 43c33424d83e
I0922 21:27:03.911603  5814 status_update_manager.cpp:177] Pausing sending status updates
I0922 21:27:03.913439  5815 state.cpp:64] Recovering state from '/tmp/Endpoint_SlaveEndpointTest_NoAuthorizer_1_WnUmSt/meta'
I0922 21:27:03.913905  5815 status_update_manager.cpp:203] Recovering status update manager
I0922 21:27:03.914139  5822 containerizer.cpp:648] Recovering containerizer
I0922 21:27:03.919320  5810 provisioner.cpp:416] Provisioner recovery complete
I0922 21:27:03.920035  5809 slave.cpp:6322] Finished recovery
I0922 21:27:03.920794  5809 slave.cpp:6504] Querying resource estimator for oversubscribable
resources
I0922 21:27:03.921121  5807 slave.cpp:6518] Received oversubscribable resources {} from the
resource estimator
I0922 21:27:03.924917  5800 process.cpp:3929] Handling HTTP event for process 'slave(816)'
with path: '/slave(816)/monitor/statistics.json'
I0922 21:27:03.926537  5801 http.cpp:1185] HTTP GET for /slave(816)/monitor/statistics.json
from 172.17.0.2:37074
I0922 21:27:03.926627  5801 http.cpp:976] Authorizing principal 'test-principal' to GET the
'/monitor/statistics.json' endpoint
I0922 21:27:03.930308  5801 slave.cpp:869] Agent terminating
[       OK ] Endpoint/SlaveEndpointTest.NoAuthorizer/1 (43 ms)
[ RUN      ] Endpoint/SlaveEndpointTest.NoAuthorizer/2
I0922 21:27:03.943065  5780 containerizer.cpp:292] Using isolation { environment_secret, posix/cpu,
posix/mem, filesystem/posix, network/cni }
W0922 21:27:03.943581  5780 backend.cpp:76] Failed to create 'aufs' backend: AufsBackend requires
root privileges
W0922 21:27:03.943701  5780 backend.cpp:76] Failed to create 'bind' backend: BindBackend requires
root privileges
I0922 21:27:03.943735  5780 provisioner.cpp:255] Using default backend 'copy'
I0922 21:27:03.945417  5780 cluster.cpp:448] Creating default 'local' authorizer
I0922 21:27:03.947544  5815 slave.cpp:254] Mesos agent started on (817)@172.17.0.2:39826
I0922 21:27:03.947597  5815 slave.cpp:255] Flags at startup: --acls="" --appc_simple_discovery_uri_prefix="http://"
--appc_store_dir="/tmp/Endpoint_SlaveEndpointTest_NoAuthorizer_2_kgdQss/store/appc" --authenticate_http_readonly="true"
--authenticate_http_readwrite="true" --authenticatee="crammd5" --authentication_backoff_factor="1secs"
--authorizer="local" --cgroups_cpu_enable_pids_and_tids_count="false" --cgroups_enable_cfs="false"
--cgroups_hierarchy="/sys/fs/cgroup" --cgroups_limit_swap="false" --cgroups_root="mesos" --container_disk_watch_interval="15secs"
--containerizers="mesos" --credential="/tmp/Endpoint_SlaveEndpointTest_NoAuthorizer_2_kgdQss/credential"
--default_role="*" --disallow_sharing_agent_pid_namespace="false" --disk_watch_interval="1mins"
--docker="docker" --docker_kill_orphans="true" --docker_registry="https://registry-1.docker.io"
--docker_remove_delay="6hrs" --docker_socket="/var/run/docker.sock" --docker_stop_timeout="0ns"
--docker_store_dir="/tmp/Endpoint_SlaveEndpointTest_NoAuthorizer_2_kgdQss/store/docker" --docker_volume_checkpoint_dir="/var/run/mesos/isolators/docker/volume"
--enforce_container_disk_quota="false" --executor_registration_timeout="1mins" --executor_reregistration_timeout="2secs"
--executor_shutdown_grace_period="5secs" --fetcher_cache_dir="/tmp/Endpoint_SlaveEndpointTest_NoAuthorizer_2_kgdQss/fetch"
--fetcher_cache_size="2GB" --frameworks_home="" --gc_delay="1weeks" --gc_disk_headroom="0.1"
--hadoop_home="" --help="false" --hostname_lookup="true" --http_command_executor="false" --http_credentials="/tmp/Endpoint_SlaveEndpointTest_NoAuthorizer_2_kgdQss/http_credentials"
--http_heartbeat_interval="30secs" --initialize_driver_logging="true" --isolation="posix/cpu,posix/mem"
--launcher="posix" --launcher_dir="/mesos/mesos-1.5.0/_build/src" --logbufsecs="0" --logging_level="INFO"
--max_completed_executors_per_framework="150" --oversubscribed_resources_interval="15secs"
--perf_duration="10secs" --perf_interval="1mins" --port="5051" --qos_correction_interval_min="0ns"
--quiet="false" --recover="reconnect" --recovery_timeout="15mins" --registration_backoff_factor="10ms"
--resources="cpus:2;gpus:0;mem:1024;disk:1024;ports:[31000-32000]" --revocable_cpu_low_priority="true"
--runtime_dir="/tmp/Endpoint_SlaveEndpointTest_NoAuthorizer_2_kgdQss" --sandbox_directory="/mnt/mesos/sandbox"
--strict="true" --switch_user="true" --systemd_enable_support="true" --systemd_runtime_directory="/run/systemd/system"
--version="false" --work_dir="/tmp/Endpoint_SlaveEndpointTest_NoAuthorizer_2_auUc7E" --zk_session_timeout="10secs"
I0922 21:27:03.948381  5815 credentials.hpp:86] Loading credential for authentication from
'/tmp/Endpoint_SlaveEndpointTest_NoAuthorizer_2_kgdQss/credential'
I0922 21:27:03.948699  5815 slave.cpp:287] Agent using credential for: test-principal
I0922 21:27:03.948724  5815 credentials.hpp:37] Loading credentials for authentication from
'/tmp/Endpoint_SlaveEndpointTest_NoAuthorizer_2_kgdQss/http_credentials'
I0922 21:27:03.948992  5815 http.cpp:1045] Creating default 'basic' HTTP authenticator for
realm 'mesos-agent-readonly'
I0922 21:27:03.949275  5815 http.cpp:1045] Creating default 'basic' HTTP authenticator for
realm 'mesos-agent-readwrite'
I0922 21:27:03.950873  5815 slave.cpp:585] Agent resources: [{"name":"cpus","scalar":{"value":2.0},"type":"SCALAR"},{"name":"mem","scalar":{"value":1024.0},"type":"SCALAR"},{"name":"disk","scalar":{"value":1024.0},"type":"SCALAR"},{"name":"ports","ranges":{"range":[{"begin":31000,"end":32000}]},"type":"RANGES"}]
I0922 21:27:03.951124  5815 slave.cpp:593] Agent attributes: [  ]
I0922 21:27:03.951138  5815 slave.cpp:602] Agent hostname: 43c33424d83e
I0922 21:27:03.951308  5810 status_update_manager.cpp:177] Pausing sending status updates
I0922 21:27:03.952971  5819 state.cpp:64] Recovering state from '/tmp/Endpoint_SlaveEndpointTest_NoAuthorizer_2_auUc7E/meta'
I0922 21:27:03.953380  5803 status_update_manager.cpp:203] Recovering status update manager
I0922 21:27:03.953593  5814 containerizer.cpp:648] Recovering containerizer
I0922 21:27:03.955204  5816 provisioner.cpp:416] Provisioner recovery complete
I0922 21:27:03.955621  5810 slave.cpp:6322] Finished recovery
I0922 21:27:03.956262  5810 slave.cpp:6504] Querying resource estimator for oversubscribable
resources
I0922 21:27:03.956578  5801 slave.cpp:6518] Received oversubscribable resources {} from the
resource estimator
I0922 21:27:03.959065  5812 process.cpp:3929] Handling HTTP event for process 'slave(817)'
with path: '/slave(817)/containers'
I0922 21:27:03.960443  5799 http.cpp:1185] HTTP GET for /slave(817)/containers from 172.17.0.2:37076
I0922 21:27:03.960578  5799 http.cpp:976] Authorizing principal 'test-principal' to GET the
'/containers' endpoint
I0922 21:27:03.965068  5780 slave.cpp:869] Agent terminating
[       OK ] Endpoint/SlaveEndpointTest.NoAuthorizer/2 (34 ms)
[----------] 9 tests from Endpoint/SlaveEndpointTest (323 ms total)

[----------] 2 tests from ContainerizerType/DefaultContainerDNSFlagTest
[ RUN      ] ContainerizerType/DefaultContainerDNSFlagTest.ValidateFlag/0
[       OK ] ContainerizerType/DefaultContainerDNSFlagTest.ValidateFlag/0 (10 ms)
[ RUN      ] ContainerizerType/DefaultContainerDNSFlagTest.ValidateFlag/1
[       OK ] ContainerizerType/DefaultContainerDNSFlagTest.ValidateFlag/1 (9 ms)
[----------] 2 tests from ContainerizerType/DefaultContainerDNSFlagTest (19 ms total)

[----------] Global test environment tear-down
[==========] 1676 tests from 184 test cases ran. (580210 ms total)
[  PASSED  ] 1675 tests.
[  FAILED  ] 1 test, listed below:
[  FAILED  ] DefaultExecutorCheckTest.CommandCheckDeliveredAndReconciled

 1 FAILED TEST
  YOU HAVE 20 DISABLED TESTS

I0922 21:27:04.058820  5823 process.cpp:1068] Failed to accept socket: future discarded
make[4]: *** [check-local] Error 1
make[4]: Leaving directory `/mesos/mesos-1.5.0/_build/src'
make[3]: *** [check-am] Error 2
make[3]: Leaving directory `/mesos/mesos-1.5.0/_build/src'
make[2]: *** [check] Error 2
make[2]: Leaving directory `/mesos/mesos-1.5.0/_build/src'
make[1]: *** [check-recursive] Error 1
make[1]: Leaving directory `/mesos/mesos-1.5.0/_build'
make: *** [distcheck] Error 1
+ docker rmi mesos-1506112300-30969
Untagged: mesos-1506112300-30969:latest
Deleted: sha256:9387a28da300baf467684930aae7d9316ce5bb0de1fd8a32a9c61d7134245c69
Deleted: sha256:7a1729558dd193be6845fdb3ba934ede072a2f48825949010592b4e0fff99c2e
Deleted: sha256:c8730af26bfb85da21d17a8cdff057acb9f96bcbe6ef363d56bd625dd2c2b360
Deleted: sha256:fe06c8584d4af1c0a0460872e36bbb91ce43663ae15e11637cd8ed8baa065462
Deleted: sha256:ff5e8dd807607a9bf520c121b732846b2a749078ffaaed101895a2b0c8987338
Deleted: sha256:06605a760257819b44d3e67e7a894dd96a4bdd7f7abc0b5123c553094e55e86b
Deleted: sha256:582d35135cb511fac93864c4cb625ae8c60ec513ce8c15df67ff58dffa2a33bc
Deleted: sha256:55d2ded5adf9e66391254161b4d8ab8472e94028168373e641bbac309d12082a
Deleted: sha256:40b9866b76f4609c0e543d0181a6c54c3d2e83089df16e217bade6f71c276f13
Deleted: sha256:abb1aca35eeb5c7702c1813b133cc22d5ea9fcfb5d3599cf5347fb9fef98e698
Deleted: sha256:3c962de2e9cf3a954d8abb5cb648455a68a0399876593304556bf56e4591e915
Deleted: sha256:a46e1ee2332b9df7cacce9dcf7e2ce8772e8cbe5c7969328222d9d549f9b5461
Deleted: sha256:45dab5497d09140d319be90802e7116d5f387a0b903f5fc9f60a2dba7c80f703
Deleted: sha256:9afd1c7e1323a5aba066acce87699e4e16c8ca62cbcdff9ee6c5bc4d4c69109e
Deleted: sha256:1b916dbdd4dd81dcb762044f64bddfa95797fdb778372f2354514c2eb213114d
Deleted: sha256:c16c38ff86910ed6a912afad84031f8a8667a041dc7e727f7b2950bd2e0e4f3d
Deleted: sha256:5f9f5c91222498356c167df54a6ac1261311067119972abaee9860f9d78c0c0b
Deleted: sha256:4e1d139d9c1622bcf97ce655dff034fd624da694418d93668974ed15baa2d13b
Deleted: sha256:f90124a7793955397caa6b48e29668f924ac279d15be9800aa88635f5a3b0bd2
Deleted: sha256:d9530f49ce05ec9157e5c84b48198a51c00d0f6f0df8bedcc32c79ccecd5176c
Deleted: sha256:d4c78e7810a9acbf6f0000fa84cb338c3469d14c94b375d0a55e9b9edde385f2
Deleted: sha256:aca15b660653cfbfcd2e031e4868b204cc2545aa55e2ae02b053f4be99349445
Deleted: sha256:43b2866c1ad8a393a6486cf943c8e3657aed880dc4c82fcfa9a89a24e22b27e6
Deleted: sha256:3b4f23a670a43642c35906617304c56ed33886c9b81a49e2c7ffc366bf2f2f4c
Deleted: sha256:2f559df42dafc5efedd6130d9f9fec21ca197215239f3c5ea8eb14c8a6c91010
Deleted: sha256:085395d01c20856f59311a7c8b82f52b02c3a28696117b018b590017a4f54fee
Deleted: sha256:f61ec952cd811a7ee757c8e52f77b74c8b73b9bcb51d3cde8428b4444bfc9851
Deleted: sha256:bc3e7aacc787b21befe95b208eda7743f36f2afaf996aa3b5ba8bfaf8ceca821
Build step 'Execute shell' marked build as failure

Mime
View raw message