mesos-builds mailing list archives

Site index · List index
Message view « Date » · « Thread »
Top « Date » · « Thread »
From Apache Jenkins Server <jenk...@builds.apache.org>
Subject Build failed in Jenkins: Mesos-Reviewbot #19242
Date Thu, 07 Sep 2017 06:00:53 GMT
See <https://builds.apache.org/job/Mesos-Reviewbot/19242/display/redirect?page=changes>

Changes:

[benjamin.hindman] Removed garbage collector.

------------------------------------------
[...truncated 31.46 MB...]
I0907 06:00:31.505657  5475 slave.cpp:583] Agent resources: [{"name":"cpus","scalar":{"value":2.0},"type":"SCALAR"},{"name":"mem","scalar":{"value":1024.0},"type":"SCALAR"},{"name":"disk","scalar":{"value":1024.0},"type":"SCALAR"},{"name":"ports","ranges":{"range":[{"begin":31000,"end":32000}]},"type":"RANGES"}]
I0907 06:00:31.506083  5475 slave.cpp:591] Agent attributes: [  ]
I0907 06:00:31.506103  5475 slave.cpp:600] Agent hostname: 839236239a9d
I0907 06:00:31.506358  5477 status_update_manager.cpp:177] Pausing sending status updates
I0907 06:00:31.508332  5470 state.cpp:64] Recovering state from '/tmp/Endpoint_SlaveEndpointTest_AuthorizedRequest_2_wOCflg/meta'
I0907 06:00:31.508816  5477 status_update_manager.cpp:203] Recovering status update manager
I0907 06:00:31.509080  5471 containerizer.cpp:648] Recovering containerizer
I0907 06:00:31.511019  5470 provisioner.cpp:416] Provisioner recovery complete
I0907 06:00:31.511610  5475 slave.cpp:6298] Finished recovery
I0907 06:00:31.512245  5475 slave.cpp:6480] Querying resource estimator for oversubscribable
resources
I0907 06:00:31.512607  5470 slave.cpp:6494] Received oversubscribable resources {} from the
resource estimator
I0907 06:00:31.516424  5475 process.cpp:3929] Handling HTTP event for process 'slave(810)'
with path: '/slave(810)/containers'
I0907 06:00:31.518457  5471 http.cpp:1185] HTTP GET for /slave(810)/containers from 172.17.0.2:56102
I0907 06:00:31.518575  5471 http.cpp:976] Authorizing principal 'test-principal' to GET the
'/containers' endpoint
I0907 06:00:31.524461  5451 slave.cpp:861] Agent terminating
[       OK ] Endpoint/SlaveEndpointTest.AuthorizedRequest/2 (46 ms)
[ RUN      ] Endpoint/SlaveEndpointTest.UnauthorizedRequest/0
I0907 06:00:31.541509  5451 containerizer.cpp:292] Using isolation { environment_secret, posix/cpu,
posix/mem, filesystem/posix, network/cni }
W0907 06:00:31.542228  5451 backend.cpp:76] Failed to create 'overlay' backend: OverlayBackend
requires root privileges
W0907 06:00:31.542414  5451 backend.cpp:76] Failed to create 'bind' backend: BindBackend requires
root privileges
I0907 06:00:31.542454  5451 provisioner.cpp:255] Using default backend 'copy'
I0907 06:00:31.548032  5476 slave.cpp:252] Mesos agent started on (811)@172.17.0.2:40973
I0907 06:00:31.548076  5476 slave.cpp:253] Flags at startup: --acls="" --appc_simple_discovery_uri_prefix="http://"
--appc_store_dir="/tmp/Endpoint_SlaveEndpointTest_UnauthorizedRequest_0_Du0Hvu/store/appc"
--authenticate_http_readonly="true" --authenticate_http_readwrite="true" --authenticatee="crammd5"
--authentication_backoff_factor="1secs" --authorizer="local" --cgroups_cpu_enable_pids_and_tids_count="false"
--cgroups_enable_cfs="false" --cgroups_hierarchy="/sys/fs/cgroup" --cgroups_limit_swap="false"
--cgroups_root="mesos" --container_disk_watch_interval="15secs" --containerizers="mesos" --credential="/tmp/Endpoint_SlaveEndpointTest_UnauthorizedRequest_0_Du0Hvu/credential"
--default_role="*" --disallow_sharing_agent_pid_namespace="false" --disk_watch_interval="1mins"
--docker="docker" --docker_kill_orphans="true" --docker_registry="https://registry-1.docker.io"
--docker_remove_delay="6hrs" --docker_socket="/var/run/docker.sock" --docker_stop_timeout="0ns"
--docker_store_dir="/tmp/Endpoint_SlaveEndpointTest_UnauthorizedRequest_0_Du0Hvu/store/docker"
--docker_volume_checkpoint_dir="/var/run/mesos/isolators/docker/volume" --enforce_container_disk_quota="false"
--executor_registration_timeout="1mins" --executor_reregistration_timeout="2secs" --executor_shutdown_grace_period="5secs"
--fetcher_cache_dir="/tmp/Endpoint_SlaveEndpointTest_UnauthorizedRequest_0_Du0Hvu/fetch" --fetcher_cache_size="2GB"
--frameworks_home="" --gc_delay="1weeks" --gc_disk_headroom="0.1" --hadoop_home="" --help="false"
--hostname_lookup="true" --http_command_executor="false" --http_credentials="/tmp/Endpoint_SlaveEndpointTest_UnauthorizedRequest_0_Du0Hvu/http_credentials"
--http_heartbeat_interval="30secs" --initialize_driver_logging="true" --isolation="posix/cpu,posix/mem"
--launcher="posix" --launcher_dir="/mesos/mesos-1.5.0/_build/src" --logbufsecs="0" --logging_level="INFO"
--max_completed_executors_per_framework="150" --oversubscribed_resources_interval="15secs"
--perf_duration="10secs" --perf_interval="1mins" --port="5051" --qos_correction_interval_min="0ns"
--quiet="false" --recover="reconnect" --recovery_timeout="15mins" --registration_backoff_factor="10ms"
--resources="cpus:2;gpus:0;mem:1024;disk:1024;ports:[31000-32000]" --revocable_cpu_low_priority="true"
--runtime_dir="/tmp/Endpoint_SlaveEndpointTest_UnauthorizedRequest_0_Du0Hvu" --sandbox_directory="/mnt/mesos/sandbox"
--strict="true" --switch_user="true" --systemd_enable_support="true" --systemd_runtime_directory="/run/systemd/system"
--version="false" --work_dir="/tmp/Endpoint_SlaveEndpointTest_UnauthorizedRequest_0_IUrNef"
--zk_session_timeout="10secs"
I0907 06:00:31.548830  5476 credentials.hpp:86] Loading credential for authentication from
'/tmp/Endpoint_SlaveEndpointTest_UnauthorizedRequest_0_Du0Hvu/credential'
I0907 06:00:31.549115  5476 slave.cpp:285] Agent using credential for: test-principal
I0907 06:00:31.549149  5476 credentials.hpp:37] Loading credentials for authentication from
'/tmp/Endpoint_SlaveEndpointTest_UnauthorizedRequest_0_Du0Hvu/http_credentials'
I0907 06:00:31.549554  5476 http.cpp:1045] Creating default 'basic' HTTP authenticator for
realm 'mesos-agent-readonly'
I0907 06:00:31.549865  5476 http.cpp:1045] Creating default 'basic' HTTP authenticator for
realm 'mesos-agent-readwrite'
I0907 06:00:31.552208  5476 slave.cpp:583] Agent resources: [{"name":"cpus","scalar":{"value":2.0},"type":"SCALAR"},{"name":"mem","scalar":{"value":1024.0},"type":"SCALAR"},{"name":"disk","scalar":{"value":1024.0},"type":"SCALAR"},{"name":"ports","ranges":{"range":[{"begin":31000,"end":32000}]},"type":"RANGES"}]
I0907 06:00:31.552634  5476 slave.cpp:591] Agent attributes: [  ]
I0907 06:00:31.552654  5476 slave.cpp:600] Agent hostname: 839236239a9d
I0907 06:00:31.552870  5474 status_update_manager.cpp:177] Pausing sending status updates
I0907 06:00:31.554941  5470 state.cpp:64] Recovering state from '/tmp/Endpoint_SlaveEndpointTest_UnauthorizedRequest_0_IUrNef/meta'
I0907 06:00:31.555346  5474 status_update_manager.cpp:203] Recovering status update manager
I0907 06:00:31.555599  5475 containerizer.cpp:648] Recovering containerizer
I0907 06:00:31.557531  5470 provisioner.cpp:416] Provisioner recovery complete
I0907 06:00:31.558126  5476 slave.cpp:6298] Finished recovery
I0907 06:00:31.558773  5476 slave.cpp:6480] Querying resource estimator for oversubscribable
resources
I0907 06:00:31.559161  5470 slave.cpp:6494] Received oversubscribable resources {} from the
resource estimator
I0907 06:00:31.563130  5473 process.cpp:3929] Handling HTTP event for process 'slave(811)'
with path: '/slave(811)/monitor/statistics'
I0907 06:00:31.565389  5475 http.cpp:1185] HTTP GET for /slave(811)/monitor/statistics from
172.17.0.2:56104
I0907 06:00:31.565508  5475 http.cpp:976] Authorizing principal 'test-principal' to GET the
'/monitor/statistics' endpoint
I0907 06:00:31.568847  5451 slave.cpp:861] Agent terminating
[       OK ] Endpoint/SlaveEndpointTest.UnauthorizedRequest/0 (44 ms)
[ RUN      ] Endpoint/SlaveEndpointTest.UnauthorizedRequest/1
I0907 06:00:31.586086  5451 containerizer.cpp:292] Using isolation { environment_secret, posix/cpu,
posix/mem, filesystem/posix, network/cni }
W0907 06:00:31.586799  5451 backend.cpp:76] Failed to create 'overlay' backend: OverlayBackend
requires root privileges
W0907 06:00:31.586987  5451 backend.cpp:76] Failed to create 'bind' backend: BindBackend requires
root privileges
I0907 06:00:31.587026  5451 provisioner.cpp:255] Using default backend 'copy'
I0907 06:00:31.592658  5477 slave.cpp:252] Mesos agent started on (812)@172.17.0.2:40973
I0907 06:00:31.592701  5477 slave.cpp:253] Flags at startup: --acls="" --appc_simple_discovery_uri_prefix="http://"
--appc_store_dir="/tmp/Endpoint_SlaveEndpointTest_UnauthorizedRequest_1_v2e0Zt/store/appc"
--authenticate_http_readonly="true" --authenticate_http_readwrite="true" --authenticatee="crammd5"
--authentication_backoff_factor="1secs" --authorizer="local" --cgroups_cpu_enable_pids_and_tids_count="false"
--cgroups_enable_cfs="false" --cgroups_hierarchy="/sys/fs/cgroup" --cgroups_limit_swap="false"
--cgroups_root="mesos" --container_disk_watch_interval="15secs" --containerizers="mesos" --credential="/tmp/Endpoint_SlaveEndpointTest_UnauthorizedRequest_1_v2e0Zt/credential"
--default_role="*" --disallow_sharing_agent_pid_namespace="false" --disk_watch_interval="1mins"
--docker="docker" --docker_kill_orphans="true" --docker_registry="https://registry-1.docker.io"
--docker_remove_delay="6hrs" --docker_socket="/var/run/docker.sock" --docker_stop_timeout="0ns"
--docker_store_dir="/tmp/Endpoint_SlaveEndpointTest_UnauthorizedRequest_1_v2e0Zt/store/docker"
--docker_volume_checkpoint_dir="/var/run/mesos/isolators/docker/volume" --enforce_container_disk_quota="false"
--executor_registration_timeout="1mins" --executor_reregistration_timeout="2secs" --executor_shutdown_grace_period="5secs"
--fetcher_cache_dir="/tmp/Endpoint_SlaveEndpointTest_UnauthorizedRequest_1_v2e0Zt/fetch" --fetcher_cache_size="2GB"
--frameworks_home="" --gc_delay="1weeks" --gc_disk_headroom="0.1" --hadoop_home="" --help="false"
--hostname_lookup="true" --http_command_executor="false" --http_credentials="/tmp/Endpoint_SlaveEndpointTest_UnauthorizedRequest_1_v2e0Zt/http_credentials"
--http_heartbeat_interval="30secs" --initialize_driver_logging="true" --isolation="posix/cpu,posix/mem"
--launcher="posix" --launcher_dir="/mesos/mesos-1.5.0/_build/src" --logbufsecs="0" --logging_level="INFO"
--max_completed_executors_per_framework="150" --oversubscribed_resources_interval="15secs"
--perf_duration="10secs" --perf_interval="1mins" --port="5051" --qos_correction_interval_min="0ns"
--quiet="false" --recover="reconnect" --recovery_timeout="15mins" --registration_backoff_factor="10ms"
--resources="cpus:2;gpus:0;mem:1024;disk:1024;ports:[31000-32000]" --revocable_cpu_low_priority="true"
--runtime_dir="/tmp/Endpoint_SlaveEndpointTest_UnauthorizedRequest_1_v2e0Zt" --sandbox_directory="/mnt/mesos/sandbox"
--strict="true" --switch_user="true" --systemd_enable_support="true" --systemd_runtime_directory="/run/systemd/system"
--version="false" --work_dir="/tmp/Endpoint_SlaveEndpointTest_UnauthorizedRequest_1_o4wRBe"
--zk_session_timeout="10secs"
I0907 06:00:31.593442  5477 credentials.hpp:86] Loading credential for authentication from
'/tmp/Endpoint_SlaveEndpointTest_UnauthorizedRequest_1_v2e0Zt/credential'
I0907 06:00:31.593698  5477 slave.cpp:285] Agent using credential for: test-principal
I0907 06:00:31.593721  5477 credentials.hpp:37] Loading credentials for authentication from
'/tmp/Endpoint_SlaveEndpointTest_UnauthorizedRequest_1_v2e0Zt/http_credentials'
I0907 06:00:31.594066  5477 http.cpp:1045] Creating default 'basic' HTTP authenticator for
realm 'mesos-agent-readonly'
I0907 06:00:31.594316  5477 http.cpp:1045] Creating default 'basic' HTTP authenticator for
realm 'mesos-agent-readwrite'
I0907 06:00:31.596508  5477 slave.cpp:583] Agent resources: [{"name":"cpus","scalar":{"value":2.0},"type":"SCALAR"},{"name":"mem","scalar":{"value":1024.0},"type":"SCALAR"},{"name":"disk","scalar":{"value":1024.0},"type":"SCALAR"},{"name":"ports","ranges":{"range":[{"begin":31000,"end":32000}]},"type":"RANGES"}]
I0907 06:00:31.596926  5477 slave.cpp:591] Agent attributes: [  ]
I0907 06:00:31.596948  5477 slave.cpp:600] Agent hostname: 839236239a9d
I0907 06:00:31.597162  5475 status_update_manager.cpp:177] Pausing sending status updates
I0907 06:00:31.599159  5472 state.cpp:64] Recovering state from '/tmp/Endpoint_SlaveEndpointTest_UnauthorizedRequest_1_o4wRBe/meta'
I0907 06:00:31.599578  5475 status_update_manager.cpp:203] Recovering status update manager
I0907 06:00:31.599860  5473 containerizer.cpp:648] Recovering containerizer
I0907 06:00:31.601765  5470 provisioner.cpp:416] Provisioner recovery complete
I0907 06:00:31.602227  5473 slave.cpp:6298] Finished recovery
I0907 06:00:31.602834  5473 slave.cpp:6480] Querying resource estimator for oversubscribable
resources
I0907 06:00:31.603257  5473 slave.cpp:6494] Received oversubscribable resources {} from the
resource estimator
I0907 06:00:31.607049  5472 process.cpp:3929] Handling HTTP event for process 'slave(812)'
with path: '/slave(812)/monitor/statistics.json'
I0907 06:00:31.608893  5470 http.cpp:1185] HTTP GET for /slave(812)/monitor/statistics.json
from 172.17.0.2:56106
I0907 06:00:31.609053  5470 http.cpp:976] Authorizing principal 'test-principal' to GET the
'/monitor/statistics.json' endpoint
I0907 06:00:31.612856  5451 slave.cpp:861] Agent terminating
[       OK ] Endpoint/SlaveEndpointTest.UnauthorizedRequest/1 (43 ms)
[ RUN      ] Endpoint/SlaveEndpointTest.UnauthorizedRequest/2
I0907 06:00:31.630085  5451 containerizer.cpp:292] Using isolation { environment_secret, posix/cpu,
posix/mem, filesystem/posix, network/cni }
W0907 06:00:31.630825  5451 backend.cpp:76] Failed to create 'overlay' backend: OverlayBackend
requires root privileges
W0907 06:00:31.631031  5451 backend.cpp:76] Failed to create 'bind' backend: BindBackend requires
root privileges
I0907 06:00:31.631078  5451 provisioner.cpp:255] Using default backend 'copy'
I0907 06:00:31.636624  5472 slave.cpp:252] Mesos agent started on (813)@172.17.0.2:40973
I0907 06:00:31.636664  5472 slave.cpp:253] Flags at startup: --acls="" --appc_simple_discovery_uri_prefix="http://"
--appc_store_dir="/tmp/Endpoint_SlaveEndpointTest_UnauthorizedRequest_2_DwPLWt/store/appc"
--authenticate_http_readonly="true" --authenticate_http_readwrite="true" --authenticatee="crammd5"
--authentication_backoff_factor="1secs" --authorizer="local" --cgroups_cpu_enable_pids_and_tids_count="false"
--cgroups_enable_cfs="false" --cgroups_hierarchy="/sys/fs/cgroup" --cgroups_limit_swap="false"
--cgroups_root="mesos" --container_disk_watch_interval="15secs" --containerizers="mesos" --credential="/tmp/Endpoint_SlaveEndpointTest_UnauthorizedRequest_2_DwPLWt/credential"
--default_role="*" --disallow_sharing_agent_pid_namespace="false" --disk_watch_interval="1mins"
--docker="docker" --docker_kill_orphans="true" --docker_registry="https://registry-1.docker.io"
--docker_remove_delay="6hrs" --docker_socket="/var/run/docker.sock" --docker_stop_timeout="0ns"
--docker_store_dir="/tmp/Endpoint_SlaveEndpointTest_UnauthorizedRequest_2_DwPLWt/store/docker"
--docker_volume_checkpoint_dir="/var/run/mesos/isolators/docker/volume" --enforce_container_disk_quota="false"
--executor_registration_timeout="1mins" --executor_reregistration_timeout="2secs" --executor_shutdown_grace_period="5secs"
--fetcher_cache_dir="/tmp/Endpoint_SlaveEndpointTest_UnauthorizedRequest_2_DwPLWt/fetch" --fetcher_cache_size="2GB"
--frameworks_home="" --gc_delay="1weeks" --gc_disk_headroom="0.1" --hadoop_home="" --help="false"
--hostname_lookup="true" --http_command_executor="false" --http_credentials="/tmp/Endpoint_SlaveEndpointTest_UnauthorizedRequest_2_DwPLWt/http_credentials"
--http_heartbeat_interval="30secs" --initialize_driver_logging="true" --isolation="posix/cpu,posix/mem"
--launcher="posix" --launcher_dir="/mesos/mesos-1.5.0/_build/src" --logbufsecs="0" --logging_level="INFO"
--max_completed_executors_per_framework="150" --oversubscribed_resources_interval="15secs"
--perf_duration="10secs" --perf_interval="1mins" --port="5051" --qos_correction_interval_min="0ns"
--quiet="false" --recover="reconnect" --recovery_timeout="15mins" --registration_backoff_factor="10ms"
--resources="cpus:2;gpus:0;mem:1024;disk:1024;ports:[31000-32000]" --revocable_cpu_low_priority="true"
--runtime_dir="/tmp/Endpoint_SlaveEndpointTest_UnauthorizedRequest_2_DwPLWt" --sandbox_directory="/mnt/mesos/sandbox"
--strict="true" --switch_user="true" --systemd_enable_support="true" --systemd_runtime_directory="/run/systemd/system"
--version="false" --work_dir="/tmp/Endpoint_SlaveEndpointTest_UnauthorizedRequest_2_cYfwre"
--zk_session_timeout="10secs"
I0907 06:00:31.637398  5472 credentials.hpp:86] Loading credential for authentication from
'/tmp/Endpoint_SlaveEndpointTest_UnauthorizedRequest_2_DwPLWt/credential'
I0907 06:00:31.637651  5472 slave.cpp:285] Agent using credential for: test-principal
I0907 06:00:31.637689  5472 credentials.hpp:37] Loading credentials for authentication from
'/tmp/Endpoint_SlaveEndpointTest_UnauthorizedRequest_2_DwPLWt/http_credentials'
I0907 06:00:31.638041  5472 http.cpp:1045] Creating default 'basic' HTTP authenticator for
realm 'mesos-agent-readonly'
I0907 06:00:31.638311  5472 http.cpp:1045] Creating default 'basic' HTTP authenticator for
realm 'mesos-agent-readwrite'
I0907 06:00:31.640610  5472 slave.cpp:583] Agent resources: [{"name":"cpus","scalar":{"value":2.0},"type":"SCALAR"},{"name":"mem","scalar":{"value":1024.0},"type":"SCALAR"},{"name":"disk","scalar":{"value":1024.0},"type":"SCALAR"},{"name":"ports","ranges":{"range":[{"begin":31000,"end":32000}]},"type":"RANGES"}]
I0907 06:00:31.641032  5472 slave.cpp:591] Agent attributes: [  ]
I0907 06:00:31.641057  5472 slave.cpp:600] Agent hostname: 839236239a9d
I0907 06:00:31.641261  5474 status_update_manager.cpp:177] Pausing sending status updates
I0907 06:00:31.643272  5470 state.cpp:64] Recovering state from '/tmp/Endpoint_SlaveEndpointTest_UnauthorizedRequest_2_cYfwre/meta'
I0907 06:00:31.643787  5471 status_update_manager.cpp:203] Recovering status update manager
I0907 06:00:31.644114  5476 containerizer.cpp:648] Recovering containerizer
I0907 06:00:31.646064  5473 provisioner.cpp:416] Provisioner recovery complete
I0907 06:00:31.646564  5474 slave.cpp:6298] Finished recovery
I0907 06:00:31.647377  5474 slave.cpp:6480] Querying resource estimator for oversubscribable
resources
I0907 06:00:31.647827  5476 slave.cpp:6494] Received oversubscribable resources {} from the
resource estimator
I0907 06:00:31.651667  5474 process.cpp:3929] Handling HTTP event for process 'slave(813)'
with path: '/slave(813)/containers'
I0907 06:00:31.653676  5473 http.cpp:1185] HTTP GET for /slave(813)/containers from 172.17.0.2:56108
I0907 06:00:31.653795  5473 http.cpp:976] Authorizing principal 'test-principal' to GET the
'/containers' endpoint
I0907 06:00:31.656999  5451 slave.cpp:861] Agent terminating
[       OK ] Endpoint/SlaveEndpointTest.UnauthorizedRequest/2 (44 ms)
[ RUN      ] Endpoint/SlaveEndpointTest.NoAuthorizer/0
I0907 06:00:31.674968  5451 containerizer.cpp:292] Using isolation { environment_secret, posix/cpu,
posix/mem, filesystem/posix, network/cni }
W0907 06:00:31.675709  5451 backend.cpp:76] Failed to create 'overlay' backend: OverlayBackend
requires root privileges
W0907 06:00:31.675916  5451 backend.cpp:76] Failed to create 'bind' backend: BindBackend requires
root privileges
I0907 06:00:31.675963  5451 provisioner.cpp:255] Using default backend 'copy'
I0907 06:00:31.678525  5451 cluster.cpp:448] Creating default 'local' authorizer
I0907 06:00:31.681746  5472 slave.cpp:252] Mesos agent started on (814)@172.17.0.2:40973
I0907 06:00:31.681789  5472 slave.cpp:253] Flags at startup: --acls="" --appc_simple_discovery_uri_prefix="http://"
--appc_store_dir="/tmp/Endpoint_SlaveEndpointTest_NoAuthorizer_0_HCWmmu/store/appc" --authenticate_http_readonly="true"
--authenticate_http_readwrite="true" --authenticatee="crammd5" --authentication_backoff_factor="1secs"
--authorizer="local" --cgroups_cpu_enable_pids_and_tids_count="false" --cgroups_enable_cfs="false"
--cgroups_hierarchy="/sys/fs/cgroup" --cgroups_limit_swap="false" --cgroups_root="mesos" --container_disk_watch_interval="15secs"
--containerizers="mesos" --credential="/tmp/Endpoint_SlaveEndpointTest_NoAuthorizer_0_HCWmmu/credential"
--default_role="*" --disallow_sharing_agent_pid_namespace="false" --disk_watch_interval="1mins"
--docker="docker" --docker_kill_orphans="true" --docker_registry="https://registry-1.docker.io"
--docker_remove_delay="6hrs" --docker_socket="/var/run/docker.sock" --docker_stop_timeout="0ns"
--docker_store_dir="/tmp/Endpoint_SlaveEndpointTest_NoAuthorizer_0_HCWmmu/store/docker" --docker_volume_checkpoint_dir="/var/run/mesos/isolators/docker/volume"
--enforce_container_disk_quota="false" --executor_registration_timeout="1mins" --executor_reregistration_timeout="2secs"
--executor_shutdown_grace_period="5secs" --fetcher_cache_dir="/tmp/Endpoint_SlaveEndpointTest_NoAuthorizer_0_HCWmmu/fetch"
--fetcher_cache_size="2GB" --frameworks_home="" --gc_delay="1weeks" --gc_disk_headroom="0.1"
--hadoop_home="" --help="false" --hostname_lookup="true" --http_command_executor="false" --http_credentials="/tmp/Endpoint_SlaveEndpointTest_NoAuthorizer_0_HCWmmu/http_credentials"
--http_heartbeat_interval="30secs" --initialize_driver_logging="true" --isolation="posix/cpu,posix/mem"
--launcher="posix" --launcher_dir="/mesos/mesos-1.5.0/_build/src" --logbufsecs="0" --logging_level="INFO"
--max_completed_executors_per_framework="150" --oversubscribed_resources_interval="15secs"
--perf_duration="10secs" --perf_interval="1mins" --port="5051" --qos_correction_interval_min="0ns"
--quiet="false" --recover="reconnect" --recovery_timeout="15mins" --registration_backoff_factor="10ms"
--resources="cpus:2;gpus:0;mem:1024;disk:1024;ports:[31000-32000]" --revocable_cpu_low_priority="true"
--runtime_dir="/tmp/Endpoint_SlaveEndpointTest_NoAuthorizer_0_HCWmmu" --sandbox_directory="/mnt/mesos/sandbox"
--strict="true" --switch_user="true" --systemd_enable_support="true" --systemd_runtime_directory="/run/systemd/system"
--version="false" --work_dir="/tmp/Endpoint_SlaveEndpointTest_NoAuthorizer_0_mTJUJe" --zk_session_timeout="10secs"
I0907 06:00:31.682543  5472 credentials.hpp:86] Loading credential for authentication from
'/tmp/Endpoint_SlaveEndpointTest_NoAuthorizer_0_HCWmmu/credential'
I0907 06:00:31.682796  5472 slave.cpp:285] Agent using credential for: test-principal
I0907 06:00:31.682824  5472 credentials.hpp:37] Loading credentials for authentication from
'/tmp/Endpoint_SlaveEndpointTest_NoAuthorizer_0_HCWmmu/http_credentials'
I0907 06:00:31.683197  5472 http.cpp:1045] Creating default 'basic' HTTP authenticator for
realm 'mesos-agent-readonly'
I0907 06:00:31.683456  5472 http.cpp:1045] Creating default 'basic' HTTP authenticator for
realm 'mesos-agent-readwrite'
I0907 06:00:31.685698  5472 slave.cpp:583] Agent resources: [{"name":"cpus","scalar":{"value":2.0},"type":"SCALAR"},{"name":"mem","scalar":{"value":1024.0},"type":"SCALAR"},{"name":"disk","scalar":{"value":1024.0},"type":"SCALAR"},{"name":"ports","ranges":{"range":[{"begin":31000,"end":32000}]},"type":"RANGES"}]
I0907 06:00:31.686158  5472 slave.cpp:591] Agent attributes: [  ]
I0907 06:00:31.686180  5472 slave.cpp:600] Agent hostname: 839236239a9d
I0907 06:00:31.686395  5470 status_update_manager.cpp:177] Pausing sending status updates
I0907 06:00:31.688410  5477 state.cpp:64] Recovering state from '/tmp/Endpoint_SlaveEndpointTest_NoAuthorizer_0_mTJUJe/meta'
I0907 06:00:31.688855  5477 status_update_manager.cpp:203] Recovering status update manager
I0907 06:00:31.689126  5471 containerizer.cpp:648] Recovering containerizer
I0907 06:00:31.691119  5473 provisioner.cpp:416] Provisioner recovery complete
I0907 06:00:31.692523  5472 slave.cpp:6298] Finished recovery
I0907 06:00:31.693130  5472 slave.cpp:6480] Querying resource estimator for oversubscribable
resources
I0907 06:00:31.693491  5473 slave.cpp:6494] Received oversubscribable resources {} from the
resource estimator
I0907 06:00:31.697235  5471 process.cpp:3929] Handling HTTP event for process 'slave(814)'
with path: '/slave(814)/monitor/statistics'
I0907 06:00:31.699203  5472 http.cpp:1185] HTTP GET for /slave(814)/monitor/statistics from
172.17.0.2:56110
I0907 06:00:31.699324  5472 http.cpp:976] Authorizing principal 'test-principal' to GET the
'/monitor/statistics' endpoint
I0907 06:00:31.703616  5451 slave.cpp:861] Agent terminating
[       OK ] Endpoint/SlaveEndpointTest.NoAuthorizer/0 (46 ms)
[ RUN      ] Endpoint/SlaveEndpointTest.NoAuthorizer/1
I0907 06:00:31.721146  5451 containerizer.cpp:292] Using isolation { environment_secret, posix/cpu,
posix/mem, filesystem/posix, network/cni }
W0907 06:00:31.721887  5451 backend.cpp:76] Failed to create 'overlay' backend: OverlayBackend
requires root privileges
W0907 06:00:31.722088  5451 backend.cpp:76] Failed to create 'bind' backend: BindBackend requires
root privileges
I0907 06:00:31.722131  5451 provisioner.cpp:255] Using default backend 'copy'
I0907 06:00:31.724651  5451 cluster.cpp:448] Creating default 'local' authorizer
I0907 06:00:31.727838  5473 slave.cpp:252] Mesos agent started on (815)@172.17.0.2:40973
I0907 06:00:31.727883  5473 slave.cpp:253] Flags at startup: --acls="" --appc_simple_discovery_uri_prefix="http://"
--appc_store_dir="/tmp/Endpoint_SlaveEndpointTest_NoAuthorizer_1_jIUOfv/store/appc" --authenticate_http_readonly="true"
--authenticate_http_readwrite="true" --authenticatee="crammd5" --authentication_backoff_factor="1secs"
--authorizer="local" --cgroups_cpu_enable_pids_and_tids_count="false" --cgroups_enable_cfs="false"
--cgroups_hierarchy="/sys/fs/cgroup" --cgroups_limit_swap="false" --cgroups_root="mesos" --container_disk_watch_interval="15secs"
--containerizers="mesos" --credential="/tmp/Endpoint_SlaveEndpointTest_NoAuthorizer_1_jIUOfv/credential"
--default_role="*" --disallow_sharing_agent_pid_namespace="false" --disk_watch_interval="1mins"
--docker="docker" --docker_kill_orphans="true" --docker_registry="https://registry-1.docker.io"
--docker_remove_delay="6hrs" --docker_socket="/var/run/docker.sock" --docker_stop_timeout="0ns"
--docker_store_dir="/tmp/Endpoint_SlaveEndpointTest_NoAuthorizer_1_jIUOfv/store/docker" --docker_volume_checkpoint_dir="/var/run/mesos/isolators/docker/volume"
--enforce_container_disk_quota="false" --executor_registration_timeout="1mins" --executor_reregistration_timeout="2secs"
--executor_shutdown_grace_period="5secs" --fetcher_cache_dir="/tmp/Endpoint_SlaveEndpointTest_NoAuthorizer_1_jIUOfv/fetch"
--fetcher_cache_size="2GB" --frameworks_home="" --gc_delay="1weeks" --gc_disk_headroom="0.1"
--hadoop_home="" --help="false" --hostname_lookup="true" --http_command_executor="false" --http_credentials="/tmp/Endpoint_SlaveEndpointTest_NoAuthorizer_1_jIUOfv/http_credentials"
--http_heartbeat_interval="30secs" --initialize_driver_logging="true" --isolation="posix/cpu,posix/mem"
--launcher="posix" --launcher_dir="/mesos/mesos-1.5.0/_build/src" --logbufsecs="0" --logging_level="INFO"
--max_completed_executors_per_framework="150" --oversubscribed_resources_interval="15secs"
--perf_duration="10secs" --perf_interval="1mins" --port="5051" --qos_correction_interval_min="0ns"
--quiet="false" --recover="reconnect" --recovery_timeout="15mins" --registration_backoff_factor="10ms"
--resources="cpus:2;gpus:0;mem:1024;disk:1024;ports:[31000-32000]" --revocable_cpu_low_priority="true"
--runtime_dir="/tmp/Endpoint_SlaveEndpointTest_NoAuthorizer_1_jIUOfv" --sandbox_directory="/mnt/mesos/sandbox"
--strict="true" --switch_user="true" --systemd_enable_support="true" --systemd_runtime_directory="/run/systemd/system"
--version="false" --work_dir="/tmp/Endpoint_SlaveEndpointTest_NoAuthorizer_1_YsfTvf" --zk_session_timeout="10secs"
I0907 06:00:31.728619  5473 credentials.hpp:86] Loading credential for authentication from
'/tmp/Endpoint_SlaveEndpointTest_NoAuthorizer_1_jIUOfv/credential'
I0907 06:00:31.728869  5473 slave.cpp:285] Agent using credential for: test-principal
I0907 06:00:31.728894  5473 credentials.hpp:37] Loading credentials for authentication from
'/tmp/Endpoint_SlaveEndpointTest_NoAuthorizer_1_jIUOfv/http_credentials'
I0907 06:00:31.729240  5473 http.cpp:1045] Creating default 'basic' HTTP authenticator for
realm 'mesos-agent-readonly'
I0907 06:00:31.729506  5473 http.cpp:1045] Creating default 'basic' HTTP authenticator for
realm 'mesos-agent-readwrite'
I0907 06:00:31.731744  5473 slave.cpp:583] Agent resources: [{"name":"cpus","scalar":{"value":2.0},"type":"SCALAR"},{"name":"mem","scalar":{"value":1024.0},"type":"SCALAR"},{"name":"disk","scalar":{"value":1024.0},"type":"SCALAR"},{"name":"ports","ranges":{"range":[{"begin":31000,"end":32000}]},"type":"RANGES"}]
I0907 06:00:31.732165  5473 slave.cpp:591] Agent attributes: [  ]
I0907 06:00:31.732187  5473 slave.cpp:600] Agent hostname: 839236239a9d
I0907 06:00:31.732389  5475 status_update_manager.cpp:177] Pausing sending status updates
I0907 06:00:31.734405  5474 state.cpp:64] Recovering state from '/tmp/Endpoint_SlaveEndpointTest_NoAuthorizer_1_YsfTvf/meta'
I0907 06:00:31.734905  5471 status_update_manager.cpp:203] Recovering status update manager
I0907 06:00:31.735188  5476 containerizer.cpp:648] Recovering containerizer
I0907 06:00:31.737210  5473 provisioner.cpp:416] Provisioner recovery complete
I0907 06:00:31.737704  5476 slave.cpp:6298] Finished recovery
I0907 06:00:31.738355  5476 slave.cpp:6480] Querying resource estimator for oversubscribable
resources
I0907 06:00:31.738767  5470 slave.cpp:6494] Received oversubscribable resources {} from the
resource estimator
I0907 06:00:31.742588  5475 process.cpp:3929] Handling HTTP event for process 'slave(815)'
with path: '/slave(815)/monitor/statistics.json'
I0907 06:00:31.744576  5473 http.cpp:1185] HTTP GET for /slave(815)/monitor/statistics.json
from 172.17.0.2:56112
I0907 06:00:31.744735  5473 http.cpp:976] Authorizing principal 'test-principal' to GET the
'/monitor/statistics.json' endpoint
I0907 06:00:31.749588  5451 slave.cpp:861] Agent terminating
[       OK ] Endpoint/SlaveEndpointTest.NoAuthorizer/1 (46 ms)
[ RUN      ] Endpoint/SlaveEndpointTest.NoAuthorizer/2
I0907 06:00:31.767204  5451 containerizer.cpp:292] Using isolation { environment_secret, posix/cpu,
posix/mem, filesystem/posix, network/cni }
W0907 06:00:31.767956  5451 backend.cpp:76] Failed to create 'overlay' backend: OverlayBackend
requires root privileges
W0907 06:00:31.768159  5451 backend.cpp:76] Failed to create 'bind' backend: BindBackend requires
root privileges
I0907 06:00:31.768208  5451 provisioner.cpp:255] Using default backend 'copy'
I0907 06:00:31.770740  5451 cluster.cpp:448] Creating default 'local' authorizer
I0907 06:00:31.773924  5475 slave.cpp:252] Mesos agent started on (816)@172.17.0.2:40973
I0907 06:00:31.773967  5475 slave.cpp:253] Flags at startup: --acls="" --appc_simple_discovery_uri_prefix="http://"
--appc_store_dir="/tmp/Endpoint_SlaveEndpointTest_NoAuthorizer_2_fw01Cw/store/appc" --authenticate_http_readonly="true"
--authenticate_http_readwrite="true" --authenticatee="crammd5" --authentication_backoff_factor="1secs"
--authorizer="local" --cgroups_cpu_enable_pids_and_tids_count="false" --cgroups_enable_cfs="false"
--cgroups_hierarchy="/sys/fs/cgroup" --cgroups_limit_swap="false" --cgroups_root="mesos" --container_disk_watch_interval="15secs"
--containerizers="mesos" --credential="/tmp/Endpoint_SlaveEndpointTest_NoAuthorizer_2_fw01Cw/credential"
--default_role="*" --disallow_sharing_agent_pid_namespace="false" --disk_watch_interval="1mins"
--docker="docker" --docker_kill_orphans="true" --docker_registry="https://registry-1.docker.io"
--docker_remove_delay="6hrs" --docker_socket="/var/run/docker.sock" --docker_stop_timeout="0ns"
--docker_store_dir="/tmp/Endpoint_SlaveEndpointTest_NoAuthorizer_2_fw01Cw/store/docker" --docker_volume_checkpoint_dir="/var/run/mesos/isolators/docker/volume"
--enforce_container_disk_quota="false" --executor_registration_timeout="1mins" --executor_reregistration_timeout="2secs"
--executor_shutdown_grace_period="5secs" --fetcher_cache_dir="/tmp/Endpoint_SlaveEndpointTest_NoAuthorizer_2_fw01Cw/fetch"
--fetcher_cache_size="2GB" --frameworks_home="" --gc_delay="1weeks" --gc_disk_headroom="0.1"
--hadoop_home="" --help="false" --hostname_lookup="true" --http_command_executor="false" --http_credentials="/tmp/Endpoint_SlaveEndpointTest_NoAuthorizer_2_fw01Cw/http_credentials"
--http_heartbeat_interval="30secs" --initialize_driver_logging="true" --isolation="posix/cpu,posix/mem"
--launcher="posix" --launcher_dir="/mesos/mesos-1.5.0/_build/src" --logbufsecs="0" --logging_level="INFO"
--max_completed_executors_per_framework="150" --oversubscribed_resources_interval="15secs"
--perf_duration="10secs" --perf_interval="1mins" --port="5051" --qos_correction_interval_min="0ns"
--quiet="false" --recover="reconnect" --recovery_timeout="15mins" --registration_backoff_factor="10ms"
--resources="cpus:2;gpus:0;mem:1024;disk:1024;ports:[31000-32000]" --revocable_cpu_low_priority="true"
--runtime_dir="/tmp/Endpoint_SlaveEndpointTest_NoAuthorizer_2_fw01Cw" --sandbox_directory="/mnt/mesos/sandbox"
--strict="true" --switch_user="true" --systemd_enable_support="true" --systemd_runtime_directory="/run/systemd/system"
--version="false" --work_dir="/tmp/Endpoint_SlaveEndpointTest_NoAuthorizer_2_OxDCLg" --zk_session_timeout="10secs"
I0907 06:00:31.774721  5475 credentials.hpp:86] Loading credential for authentication from
'/tmp/Endpoint_SlaveEndpointTest_NoAuthorizer_2_fw01Cw/credential'
I0907 06:00:31.774982  5475 slave.cpp:285] Agent using credential for: test-principal
I0907 06:00:31.775009  5475 credentials.hpp:37] Loading credentials for authentication from
'/tmp/Endpoint_SlaveEndpointTest_NoAuthorizer_2_fw01Cw/http_credentials'
I0907 06:00:31.775373  5475 http.cpp:1045] Creating default 'basic' HTTP authenticator for
realm 'mesos-agent-readonly'
I0907 06:00:31.775662  5475 http.cpp:1045] Creating default 'basic' HTTP authenticator for
realm 'mesos-agent-readwrite'
I0907 06:00:31.777928  5475 slave.cpp:583] Agent resources: [{"name":"cpus","scalar":{"value":2.0},"type":"SCALAR"},{"name":"mem","scalar":{"value":1024.0},"type":"SCALAR"},{"name":"disk","scalar":{"value":1024.0},"type":"SCALAR"},{"name":"ports","ranges":{"range":[{"begin":31000,"end":32000}]},"type":"RANGES"}]
I0907 06:00:31.778357  5475 slave.cpp:591] Agent attributes: [  ]
I0907 06:00:31.778378  5475 slave.cpp:600] Agent hostname: 839236239a9d
I0907 06:00:31.778592  5471 status_update_manager.cpp:177] Pausing sending status updates
I0907 06:00:31.780622  5477 state.cpp:64] Recovering state from '/tmp/Endpoint_SlaveEndpointTest_NoAuthorizer_2_OxDCLg/meta'
I0907 06:00:31.781127  5476 status_update_manager.cpp:203] Recovering status update manager
I0907 06:00:31.781435  5472 containerizer.cpp:648] Recovering containerizer
I0907 06:00:31.783349  5475 provisioner.cpp:416] Provisioner recovery complete
I0907 06:00:31.783759  5471 slave.cpp:6298] Finished recovery
I0907 06:00:31.784379  5471 slave.cpp:6480] Querying resource estimator for oversubscribable
resources
I0907 06:00:31.784759  5472 slave.cpp:6494] Received oversubscribable resources {} from the
resource estimator
I0907 06:00:31.788764  5471 process.cpp:3929] Handling HTTP event for process 'slave(816)'
with path: '/slave(816)/containers'
I0907 06:00:31.790892  5476 http.cpp:1185] HTTP GET for /slave(816)/containers from 172.17.0.2:56114
I0907 06:00:31.791020  5476 http.cpp:976] Authorizing principal 'test-principal' to GET the
'/containers' endpoint
I0907 06:00:31.796435  5475 slave.cpp:861] Agent terminating
[       OK ] Endpoint/SlaveEndpointTest.NoAuthorizer/2 (47 ms)
[----------] 9 tests from Endpoint/SlaveEndpointTest (411 ms total)

[----------] 2 tests from ContainerizerType/DefaultContainerDNSFlagTest
[ RUN      ] ContainerizerType/DefaultContainerDNSFlagTest.ValidateFlag/0
[       OK ] ContainerizerType/DefaultContainerDNSFlagTest.ValidateFlag/0 (18 ms)
[ RUN      ] ContainerizerType/DefaultContainerDNSFlagTest.ValidateFlag/1
[       OK ] ContainerizerType/DefaultContainerDNSFlagTest.ValidateFlag/1 (20 ms)
[----------] 2 tests from ContainerizerType/DefaultContainerDNSFlagTest (38 ms total)

[----------] Global test environment tear-down
[==========] 1667 tests from 183 test cases ran. (748154 ms total)
[  PASSED  ] 1663 tests.
[  FAILED  ] 4 tests, listed below:
[  FAILED  ] DefaultExecutorCheckTest.CommandCheckDeliveredAndReconciled
[  FAILED  ] DefaultExecutorCheckTest.CommandCheckStatusChange
[  FAILED  ] DefaultExecutorCheckTest.CommandCheckSeesParentsEnv
[  FAILED  ] DefaultExecutorCheckTest.CommandCheckSharesWorkDirWithTask

 4 FAILED TESTS
  YOU HAVE 20 DISABLED TESTS

I0907 06:00:31.981935  5478 process.cpp:1068] Failed to accept socket: future discarded
make[4]: *** [check-local] Error 1
make[4]: Leaving directory `/mesos/mesos-1.5.0/_build/src'
make[3]: *** [check-am] Error 2
make[3]: Leaving directory `/mesos/mesos-1.5.0/_build/src'
make[2]: *** [check] Error 2
make[2]: Leaving directory `/mesos/mesos-1.5.0/_build/src'
make[1]: *** [check-recursive] Error 1
make[1]: Leaving directory `/mesos/mesos-1.5.0/_build'
make: *** [distcheck] Error 1
+ docker rmi mesos-1504757550-23683
Untagged: mesos-1504757550-23683:latest
Deleted: sha256:8678c9c46dfdb1510a49d5eac9a345283087a7069593cc6c21aed0b74366d42e
Deleted: sha256:4c6ba5fa2545315a67136c3e79d1b6a34fedd858d105e333aa26be53dd061eca
Deleted: sha256:c21563fd7358f2048d3ce450f18c4189de4ac6b8b1ebb94f23743cb8acc2f686
Deleted: sha256:e0fc3edbcf5cdd5d15e1c27cf3ad5028a7d7d83e3cafd060905efb31ad1f9014
Deleted: sha256:a4a7931c73b48b3acb7e5cc304088027ac32e0e167b6f46b44f9925378b61175
Deleted: sha256:2ace9c6b1d43b8f0cd81816f8bc3d0ca6609b10771f3d0f9595dea5853992e6d
Deleted: sha256:e8c0872618ce18996839d0cfb4ebf3d90573e441c829d41ce60e449b6eb6f7ab
Deleted: sha256:1a8d2ba035158090324bda6ee99136f30c4ccbcdb0af1756b062cee72af43ed5
Deleted: sha256:a75d4af4597e4d86c0f25be9460f2ceee370483913a87f773df0427bbd6a4152
Deleted: sha256:b7f9e15ab50f337de9a4a56a5ca6313ad4cdc5e41e774426d68151620f039d58
Deleted: sha256:c09aab523127fa2cf9c73b8cebc663ff522c985febb317bc40363a6cc9a40330
Deleted: sha256:9591d17d569348d2a10954876d40117e17ad4423918cae1a86d9457062f33d64
Deleted: sha256:e733f5b8b9632a3a53ed55185623ea5406884adfb4e76646b0db8297ec80af7e
Deleted: sha256:80cb0a37376397529193d563d1b95ad75a8d19e2fcfdf7eb7ab744744ce0179b
Deleted: sha256:d8facde837ee187c51a93916ae4c1b526e76e5dac8916cd1aca22aaedf503d0f
Deleted: sha256:be4e692e0db76beebf6209a4de5d86b00add519f44cfc64f3239d1fe0f12e150
Deleted: sha256:151ea4cbff6c5a6c0f9886300e86c774c879228857029e358a43bbcd62063e2c
Deleted: sha256:89c3df889ef0d44caac4adab8071f58425a9204dfda4419f52d203cebb8ec3da
Deleted: sha256:2a61950f1bee6d0ba3d4e526a633cefe0bee346fd0f15652db880d00720d58b9
Deleted: sha256:31a7b58643575b0058fecb830ecf002acf9b36c47f75b248cbd26abc4e4609f1
Deleted: sha256:62806ca261aa2a7a15213cf09436defbb377ecfcf392dd09c32f1c13f985098e
Deleted: sha256:669a28217938078a01bd8bb97cba8001b0fda2087c251c414973725fc7a34b70
Deleted: sha256:80720ae2b6df63a3e2dba55a8b4855a66c9948b20e2e5f493c0f97fc819fde4e
Deleted: sha256:e3b9b38197cbd9560de03f2bbcc3f0a6f4a99c6d5c37ec18b20d6a59d7849247
Deleted: sha256:862c32ce31e514160485daae79f869eb77b3c29a87b89fe0cc272fb33885a297
Deleted: sha256:53fc72e904918d6601f04eb632b1742e56dab525a7111ff1141d03152f20bceb
Deleted: sha256:b5571865e8b4d00f30a15aaa05657e88064e63135987df3d176a43d3ed789eb1
Deleted: sha256:e4b29f2378194d89d791193556c7531ac8f78ce5bf9f1f157079026b8789c57f
Build step 'Execute shell' marked build as failure

Mime
View raw message