mesos-builds mailing list archives

Site index · List index
Message view « Date » · « Thread »
Top « Date » · « Thread »
From Apache Jenkins Server <jenk...@builds.apache.org>
Subject Build failed in Jenkins: Mesos-Buildbot » autotools,gcc,--verbose --enable-libevent --enable-ssl,GLOG_v=1 MESOS_VERBOSE=1,centos:7,(ubuntu)&&(!ubuntu-us1)&&(!ubuntu-eu2) #4186
Date Fri, 01 Sep 2017 23:08:57 GMT
See <https://builds.apache.org/job/Mesos-Buildbot/BUILDTOOL=autotools,COMPILER=gcc,CONFIGURATION=--verbose%20--enable-libevent%20--enable-ssl,ENVIRONMENT=GLOG_v=1%20MESOS_VERBOSE=1,OS=centos%3A7,label_exp=(ubuntu)&&(!ubuntu-us1)&&(!ubuntu-eu2)/4186/display/redirect>

------------------------------------------
[...truncated 32.61 MB...]
I0901 23:08:46.310672 30882 credentials.hpp:86] Loading credential for authentication from
'/tmp/Endpoint_SlaveEndpointTest_UnauthorizedRequest_0_tast2W/credential'
I0901 23:08:46.310864 30882 slave.cpp:285] Agent using credential for: test-principal
I0901 23:08:46.310889 30882 credentials.hpp:37] Loading credentials for authentication from
'/tmp/Endpoint_SlaveEndpointTest_UnauthorizedRequest_0_tast2W/http_credentials'
I0901 23:08:46.311177 30882 http.cpp:1045] Creating default 'basic' HTTP authenticator for
realm 'mesos-agent-executor'
I0901 23:08:46.311309 30882 http.cpp:1066] Creating default 'jwt' HTTP authenticator for realm
'mesos-agent-executor'
I0901 23:08:46.311511 30882 http.cpp:1045] Creating default 'basic' HTTP authenticator for
realm 'mesos-agent-readonly'
I0901 23:08:46.311616 30882 http.cpp:1066] Creating default 'jwt' HTTP authenticator for realm
'mesos-agent-readonly'
I0901 23:08:46.311792 30882 http.cpp:1045] Creating default 'basic' HTTP authenticator for
realm 'mesos-agent-readwrite'
I0901 23:08:46.311890 30882 http.cpp:1066] Creating default 'jwt' HTTP authenticator for realm
'mesos-agent-readwrite'
I0901 23:08:46.313272 30882 slave.cpp:581] Agent resources: [{"name":"cpus","scalar":{"value":2.0},"type":"SCALAR"},{"name":"mem","scalar":{"value":1024.0},"type":"SCALAR"},{"name":"disk","scalar":{"value":1024.0},"type":"SCALAR"},{"name":"ports","ranges":{"range":[{"begin":31000,"end":32000}]},"type":"RANGES"}]
I0901 23:08:46.313496 30882 slave.cpp:589] Agent attributes: [  ]
I0901 23:08:46.313522 30882 slave.cpp:598] Agent hostname: b8bdaa18511b
I0901 23:08:46.313724 30878 status_update_manager.cpp:177] Pausing sending status updates
I0901 23:08:46.315249 30891 state.cpp:64] Recovering state from '/tmp/Endpoint_SlaveEndpointTest_UnauthorizedRequest_0_35d8bj/meta'
I0901 23:08:46.315542 30880 status_update_manager.cpp:203] Recovering status update manager
I0901 23:08:46.315727 30895 containerizer.cpp:646] Recovering containerizer
I0901 23:08:46.317013 30899 provisioner.cpp:416] Provisioner recovery complete
I0901 23:08:46.317330 30877 slave.cpp:6296] Finished recovery
I0901 23:08:46.317770 30877 slave.cpp:6478] Querying resource estimator for oversubscribable
resources
I0901 23:08:46.318017 30884 slave.cpp:6492] Received oversubscribable resources {} from the
resource estimator
I0901 23:08:46.320336 30894 process.cpp:3956] Handling HTTP event for process 'slave(814)'
with path: '/slave(814)/monitor/statistics'
I0901 23:08:46.322010 30893 http.cpp:1185] HTTP GET for /slave(814)/monitor/statistics from
172.17.0.7:42292
I0901 23:08:46.322085 30893 http.cpp:976] Authorizing principal 'test-principal' to GET the
'/monitor/statistics' endpoint
I0901 23:08:46.323884  9662 slave.cpp:859] Agent terminating
[       OK ] Endpoint/SlaveEndpointTest.UnauthorizedRequest/0 (28 ms)
[ RUN      ] Endpoint/SlaveEndpointTest.UnauthorizedRequest/1
I0901 23:08:46.334782  9662 containerizer.cpp:290] Using isolation { environment_secret, posix/cpu,
posix/mem, filesystem/posix, network/cni }
W0901 23:08:46.335270  9662 backend.cpp:76] Failed to create 'aufs' backend: AufsBackend requires
root privileges
W0901 23:08:46.335386  9662 backend.cpp:76] Failed to create 'bind' backend: BindBackend requires
root privileges
I0901 23:08:46.335417  9662 provisioner.cpp:255] Using default backend 'copy'
I0901 23:08:46.338764 30898 slave.cpp:252] Mesos agent started on (815)@172.17.0.7:35080
I0901 23:08:46.338790 30898 slave.cpp:253] Flags at startup: --acls="" --appc_simple_discovery_uri_prefix="http://"
--appc_store_dir="/tmp/Endpoint_SlaveEndpointTest_UnauthorizedRequest_1_jtghEw/store/appc"
--authenticate_http_executors="true" --authenticate_http_readonly="true" --authenticate_http_readwrite="true"
--authenticatee="crammd5" --authentication_backoff_factor="1secs" --authorizer="local" --cgroups_cpu_enable_pids_and_tids_count="false"
--cgroups_enable_cfs="false" --cgroups_hierarchy="/sys/fs/cgroup" --cgroups_limit_swap="false"
--cgroups_root="mesos" --container_disk_watch_interval="15secs" --containerizers="mesos" --credential="/tmp/Endpoint_SlaveEndpointTest_UnauthorizedRequest_1_jtghEw/credential"
--default_role="*" --disallow_sharing_agent_pid_namespace="false" --disk_watch_interval="1mins"
--docker="docker" --docker_kill_orphans="true" --docker_registry="https://registry-1.docker.io"
--docker_remove_delay="6hrs" --docker_socket="/var/run/docker.sock" --docker_stop_timeout="0ns"
--docker_store_dir="/tmp/Endpoint_SlaveEndpointTest_UnauthorizedRequest_1_jtghEw/store/docker"
--docker_volume_checkpoint_dir="/var/run/mesos/isolators/docker/volume" --enforce_container_disk_quota="false"
--executor_registration_timeout="1mins" --executor_reregistration_timeout="2secs" --executor_secret_key="/tmp/Endpoint_SlaveEndpointTest_UnauthorizedRequest_1_jtghEw/executor_secret_key"
--executor_shutdown_grace_period="5secs" --fetcher_cache_dir="/tmp/Endpoint_SlaveEndpointTest_UnauthorizedRequest_1_jtghEw/fetch"
--fetcher_cache_size="2GB" --frameworks_home="" --gc_delay="1weeks" --gc_disk_headroom="0.1"
--hadoop_home="" --help="false" --hostname_lookup="true" --http_command_executor="false" --http_credentials="/tmp/Endpoint_SlaveEndpointTest_UnauthorizedRequest_1_jtghEw/http_credentials"
--http_heartbeat_interval="30secs" --initialize_driver_logging="true" --isolation="posix/cpu,posix/mem"
--launcher="posix" --launcher_dir="/mesos/mesos-1.5.0/_build/src" --logbufsecs="0" --logging_level="INFO"
--max_completed_executors_per_framework="150" --oversubscribed_resources_interval="15secs"
--perf_duration="10secs" --perf_interval="1mins" --port="5051" --qos_correction_interval_min="0ns"
--quiet="false" --recover="reconnect" --recovery_timeout="15mins" --registration_backoff_factor="10ms"
--resources="cpus:2;gpus:0;mem:1024;disk:1024;ports:[31000-32000]" --revocable_cpu_low_priority="true"
--runtime_dir="/tmp/Endpoint_SlaveEndpointTest_UnauthorizedRequest_1_jtghEw" --sandbox_directory="/mnt/mesos/sandbox"
--strict="true" --switch_user="true" --systemd_enable_support="true" --systemd_runtime_directory="/run/systemd/system"
--version="false" --work_dir="/tmp/Endpoint_SlaveEndpointTest_UnauthorizedRequest_1_AenHJS"
--zk_session_timeout="10secs"
I0901 23:08:46.339228 30898 credentials.hpp:86] Loading credential for authentication from
'/tmp/Endpoint_SlaveEndpointTest_UnauthorizedRequest_1_jtghEw/credential'
I0901 23:08:46.339408 30898 slave.cpp:285] Agent using credential for: test-principal
I0901 23:08:46.339429 30898 credentials.hpp:37] Loading credentials for authentication from
'/tmp/Endpoint_SlaveEndpointTest_UnauthorizedRequest_1_jtghEw/http_credentials'
I0901 23:08:46.339695 30898 http.cpp:1045] Creating default 'basic' HTTP authenticator for
realm 'mesos-agent-executor'
I0901 23:08:46.339814 30898 http.cpp:1066] Creating default 'jwt' HTTP authenticator for realm
'mesos-agent-executor'
I0901 23:08:46.340005 30898 http.cpp:1045] Creating default 'basic' HTTP authenticator for
realm 'mesos-agent-readonly'
I0901 23:08:46.340097 30898 http.cpp:1066] Creating default 'jwt' HTTP authenticator for realm
'mesos-agent-readonly'
I0901 23:08:46.340262 30898 http.cpp:1045] Creating default 'basic' HTTP authenticator for
realm 'mesos-agent-readwrite'
I0901 23:08:46.340353 30898 http.cpp:1066] Creating default 'jwt' HTTP authenticator for realm
'mesos-agent-readwrite'
I0901 23:08:46.341660 30898 slave.cpp:581] Agent resources: [{"name":"cpus","scalar":{"value":2.0},"type":"SCALAR"},{"name":"mem","scalar":{"value":1024.0},"type":"SCALAR"},{"name":"disk","scalar":{"value":1024.0},"type":"SCALAR"},{"name":"ports","ranges":{"range":[{"begin":31000,"end":32000}]},"type":"RANGES"}]
I0901 23:08:46.341879 30898 slave.cpp:589] Agent attributes: [  ]
I0901 23:08:46.341894 30898 slave.cpp:598] Agent hostname: b8bdaa18511b
I0901 23:08:46.342020 30887 status_update_manager.cpp:177] Pausing sending status updates
I0901 23:08:46.343482 30890 state.cpp:64] Recovering state from '/tmp/Endpoint_SlaveEndpointTest_UnauthorizedRequest_1_AenHJS/meta'
I0901 23:08:46.343785 30897 status_update_manager.cpp:203] Recovering status update manager
I0901 23:08:46.343969 30881 containerizer.cpp:646] Recovering containerizer
I0901 23:08:46.345187 30895 provisioner.cpp:416] Provisioner recovery complete
I0901 23:08:46.345484 30898 slave.cpp:6296] Finished recovery
I0901 23:08:46.345871 30898 slave.cpp:6478] Querying resource estimator for oversubscribable
resources
I0901 23:08:46.346114 30900 slave.cpp:6492] Received oversubscribable resources {} from the
resource estimator
I0901 23:08:46.348026 30877 process.cpp:3956] Handling HTTP event for process 'slave(815)'
with path: '/slave(815)/monitor/statistics.json'
I0901 23:08:46.349671 30894 http.cpp:1185] HTTP GET for /slave(815)/monitor/statistics.json
from 172.17.0.7:42296
I0901 23:08:46.349740 30894 http.cpp:976] Authorizing principal 'test-principal' to GET the
'/monitor/statistics.json' endpoint
I0901 23:08:46.351402  9662 slave.cpp:859] Agent terminating
[       OK ] Endpoint/SlaveEndpointTest.UnauthorizedRequest/1 (26 ms)
[ RUN      ] Endpoint/SlaveEndpointTest.UnauthorizedRequest/2
I0901 23:08:46.361590  9662 containerizer.cpp:290] Using isolation { environment_secret, posix/cpu,
posix/mem, filesystem/posix, network/cni }
W0901 23:08:46.362025  9662 backend.cpp:76] Failed to create 'aufs' backend: AufsBackend requires
root privileges
W0901 23:08:46.362119  9662 backend.cpp:76] Failed to create 'bind' backend: BindBackend requires
root privileges
I0901 23:08:46.362149  9662 provisioner.cpp:255] Using default backend 'copy'
I0901 23:08:46.365254 30898 slave.cpp:252] Mesos agent started on (816)@172.17.0.7:35080
I0901 23:08:46.365278 30898 slave.cpp:253] Flags at startup: --acls="" --appc_simple_discovery_uri_prefix="http://"
--appc_store_dir="/tmp/Endpoint_SlaveEndpointTest_UnauthorizedRequest_2_3Gdiw6/store/appc"
--authenticate_http_executors="true" --authenticate_http_readonly="true" --authenticate_http_readwrite="true"
--authenticatee="crammd5" --authentication_backoff_factor="1secs" --authorizer="local" --cgroups_cpu_enable_pids_and_tids_count="false"
--cgroups_enable_cfs="false" --cgroups_hierarchy="/sys/fs/cgroup" --cgroups_limit_swap="false"
--cgroups_root="mesos" --container_disk_watch_interval="15secs" --containerizers="mesos" --credential="/tmp/Endpoint_SlaveEndpointTest_UnauthorizedRequest_2_3Gdiw6/credential"
--default_role="*" --disallow_sharing_agent_pid_namespace="false" --disk_watch_interval="1mins"
--docker="docker" --docker_kill_orphans="true" --docker_registry="https://registry-1.docker.io"
--docker_remove_delay="6hrs" --docker_socket="/var/run/docker.sock" --docker_stop_timeout="0ns"
--docker_store_dir="/tmp/Endpoint_SlaveEndpointTest_UnauthorizedRequest_2_3Gdiw6/store/docker"
--docker_volume_checkpoint_dir="/var/run/mesos/isolators/docker/volume" --enforce_container_disk_quota="false"
--executor_registration_timeout="1mins" --executor_reregistration_timeout="2secs" --executor_secret_key="/tmp/Endpoint_SlaveEndpointTest_UnauthorizedRequest_2_3Gdiw6/executor_secret_key"
--executor_shutdown_grace_period="5secs" --fetcher_cache_dir="/tmp/Endpoint_SlaveEndpointTest_UnauthorizedRequest_2_3Gdiw6/fetch"
--fetcher_cache_size="2GB" --frameworks_home="" --gc_delay="1weeks" --gc_disk_headroom="0.1"
--hadoop_home="" --help="false" --hostname_lookup="true" --http_command_executor="false" --http_credentials="/tmp/Endpoint_SlaveEndpointTest_UnauthorizedRequest_2_3Gdiw6/http_credentials"
--http_heartbeat_interval="30secs" --initialize_driver_logging="true" --isolation="posix/cpu,posix/mem"
--launcher="posix" --launcher_dir="/mesos/mesos-1.5.0/_build/src" --logbufsecs="0" --logging_level="INFO"
--max_completed_executors_per_framework="150" --oversubscribed_resources_interval="15secs"
--perf_duration="10secs" --perf_interval="1mins" --port="5051" --qos_correction_interval_min="0ns"
--quiet="false" --recover="reconnect" --recovery_timeout="15mins" --registration_backoff_factor="10ms"
--resources="cpus:2;gpus:0;mem:1024;disk:1024;ports:[31000-32000]" --revocable_cpu_low_priority="true"
--runtime_dir="/tmp/Endpoint_SlaveEndpointTest_UnauthorizedRequest_2_3Gdiw6" --sandbox_directory="/mnt/mesos/sandbox"
--strict="true" --switch_user="true" --systemd_enable_support="true" --systemd_runtime_directory="/run/systemd/system"
--version="false" --work_dir="/tmp/Endpoint_SlaveEndpointTest_UnauthorizedRequest_2_rKrIxs"
--zk_session_timeout="10secs"
I0901 23:08:46.365648 30898 credentials.hpp:86] Loading credential for authentication from
'/tmp/Endpoint_SlaveEndpointTest_UnauthorizedRequest_2_3Gdiw6/credential'
I0901 23:08:46.365779 30898 slave.cpp:285] Agent using credential for: test-principal
I0901 23:08:46.365799 30898 credentials.hpp:37] Loading credentials for authentication from
'/tmp/Endpoint_SlaveEndpointTest_UnauthorizedRequest_2_3Gdiw6/http_credentials'
I0901 23:08:46.366062 30898 http.cpp:1045] Creating default 'basic' HTTP authenticator for
realm 'mesos-agent-executor'
I0901 23:08:46.366166 30898 http.cpp:1066] Creating default 'jwt' HTTP authenticator for realm
'mesos-agent-executor'
I0901 23:08:46.366367 30898 http.cpp:1045] Creating default 'basic' HTTP authenticator for
realm 'mesos-agent-readonly'
I0901 23:08:46.366462 30898 http.cpp:1066] Creating default 'jwt' HTTP authenticator for realm
'mesos-agent-readonly'
I0901 23:08:46.366644 30898 http.cpp:1045] Creating default 'basic' HTTP authenticator for
realm 'mesos-agent-readwrite'
I0901 23:08:46.366737 30898 http.cpp:1066] Creating default 'jwt' HTTP authenticator for realm
'mesos-agent-readwrite'
I0901 23:08:46.367924 30898 slave.cpp:581] Agent resources: [{"name":"cpus","scalar":{"value":2.0},"type":"SCALAR"},{"name":"mem","scalar":{"value":1024.0},"type":"SCALAR"},{"name":"disk","scalar":{"value":1024.0},"type":"SCALAR"},{"name":"ports","ranges":{"range":[{"begin":31000,"end":32000}]},"type":"RANGES"}]
I0901 23:08:46.368125 30898 slave.cpp:589] Agent attributes: [  ]
I0901 23:08:46.368139 30898 slave.cpp:598] Agent hostname: b8bdaa18511b
I0901 23:08:46.368252 30895 status_update_manager.cpp:177] Pausing sending status updates
I0901 23:08:46.369459 30892 state.cpp:64] Recovering state from '/tmp/Endpoint_SlaveEndpointTest_UnauthorizedRequest_2_rKrIxs/meta'
I0901 23:08:46.369724 30893 status_update_manager.cpp:203] Recovering status update manager
I0901 23:08:46.369907 30896 containerizer.cpp:646] Recovering containerizer
I0901 23:08:46.371170 30888 provisioner.cpp:416] Provisioner recovery complete
I0901 23:08:46.371476 30898 slave.cpp:6296] Finished recovery
I0901 23:08:46.371831 30898 slave.cpp:6478] Querying resource estimator for oversubscribable
resources
I0901 23:08:46.372021 30886 slave.cpp:6492] Received oversubscribable resources {} from the
resource estimator
I0901 23:08:46.374050 30881 process.cpp:3956] Handling HTTP event for process 'slave(816)'
with path: '/slave(816)/containers'
I0901 23:08:46.375679 30900 http.cpp:1185] HTTP GET for /slave(816)/containers from 172.17.0.7:42300
I0901 23:08:46.375753 30900 http.cpp:976] Authorizing principal 'test-principal' to GET the
'/containers' endpoint
I0901 23:08:46.378078  9662 slave.cpp:859] Agent terminating
[       OK ] Endpoint/SlaveEndpointTest.UnauthorizedRequest/2 (26 ms)
[ RUN      ] Endpoint/SlaveEndpointTest.NoAuthorizer/0
I0901 23:08:46.389366  9662 containerizer.cpp:290] Using isolation { environment_secret, posix/cpu,
posix/mem, filesystem/posix, network/cni }
W0901 23:08:46.389868  9662 backend.cpp:76] Failed to create 'aufs' backend: AufsBackend requires
root privileges
W0901 23:08:46.389986  9662 backend.cpp:76] Failed to create 'bind' backend: BindBackend requires
root privileges
I0901 23:08:46.390025  9662 provisioner.cpp:255] Using default backend 'copy'
I0901 23:08:46.391662  9662 cluster.cpp:448] Creating default 'local' authorizer
I0901 23:08:46.393687 30886 slave.cpp:252] Mesos agent started on (817)@172.17.0.7:35080
I0901 23:08:46.393708 30886 slave.cpp:253] Flags at startup: --acls="" --appc_simple_discovery_uri_prefix="http://"
--appc_store_dir="/tmp/Endpoint_SlaveEndpointTest_NoAuthorizer_0_AZ4cEG/store/appc" --authenticate_http_executors="true"
--authenticate_http_readonly="true" --authenticate_http_readwrite="true" --authenticatee="crammd5"
--authentication_backoff_factor="1secs" --authorizer="local" --cgroups_cpu_enable_pids_and_tids_count="false"
--cgroups_enable_cfs="false" --cgroups_hierarchy="/sys/fs/cgroup" --cgroups_limit_swap="false"
--cgroups_root="mesos" --container_disk_watch_interval="15secs" --containerizers="mesos" --credential="/tmp/Endpoint_SlaveEndpointTest_NoAuthorizer_0_AZ4cEG/credential"
--default_role="*" --disallow_sharing_agent_pid_namespace="false" --disk_watch_interval="1mins"
--docker="docker" --docker_kill_orphans="true" --docker_registry="https://registry-1.docker.io"
--docker_remove_delay="6hrs" --docker_socket="/var/run/docker.sock" --docker_stop_timeout="0ns"
--docker_store_dir="/tmp/Endpoint_SlaveEndpointTest_NoAuthorizer_0_AZ4cEG/store/docker" --docker_volume_checkpoint_dir="/var/run/mesos/isolators/docker/volume"
--enforce_container_disk_quota="false" --executor_registration_timeout="1mins" --executor_reregistration_timeout="2secs"
--executor_secret_key="/tmp/Endpoint_SlaveEndpointTest_NoAuthorizer_0_AZ4cEG/executor_secret_key"
--executor_shutdown_grace_period="5secs" --fetcher_cache_dir="/tmp/Endpoint_SlaveEndpointTest_NoAuthorizer_0_AZ4cEG/fetch"
--fetcher_cache_size="2GB" --frameworks_home="" --gc_delay="1weeks" --gc_disk_headroom="0.1"
--hadoop_home="" --help="false" --hostname_lookup="true" --http_command_executor="false" --http_credentials="/tmp/Endpoint_SlaveEndpointTest_NoAuthorizer_0_AZ4cEG/http_credentials"
--http_heartbeat_interval="30secs" --initialize_driver_logging="true" --isolation="posix/cpu,posix/mem"
--launcher="posix" --launcher_dir="/mesos/mesos-1.5.0/_build/src" --logbufsecs="0" --logging_level="INFO"
--max_completed_executors_per_framework="150" --oversubscribed_resources_interval="15secs"
--perf_duration="10secs" --perf_interval="1mins" --port="5051" --qos_correction_interval_min="0ns"
--quiet="false" --recover="reconnect" --recovery_timeout="15mins" --registration_backoff_factor="10ms"
--resources="cpus:2;gpus:0;mem:1024;disk:1024;ports:[31000-32000]" --revocable_cpu_low_priority="true"
--runtime_dir="/tmp/Endpoint_SlaveEndpointTest_NoAuthorizer_0_AZ4cEG" --sandbox_directory="/mnt/mesos/sandbox"
--strict="true" --switch_user="true" --systemd_enable_support="true" --systemd_runtime_directory="/run/systemd/system"
--version="false" --work_dir="/tmp/Endpoint_SlaveEndpointTest_NoAuthorizer_0_8IUBB2" --zk_session_timeout="10secs"
I0901 23:08:46.394227 30886 credentials.hpp:86] Loading credential for authentication from
'/tmp/Endpoint_SlaveEndpointTest_NoAuthorizer_0_AZ4cEG/credential'
I0901 23:08:46.394466 30886 slave.cpp:285] Agent using credential for: test-principal
I0901 23:08:46.394490 30886 credentials.hpp:37] Loading credentials for authentication from
'/tmp/Endpoint_SlaveEndpointTest_NoAuthorizer_0_AZ4cEG/http_credentials'
I0901 23:08:46.394825 30886 http.cpp:1045] Creating default 'basic' HTTP authenticator for
realm 'mesos-agent-executor'
I0901 23:08:46.394979 30886 http.cpp:1066] Creating default 'jwt' HTTP authenticator for realm
'mesos-agent-executor'
I0901 23:08:46.395213 30886 http.cpp:1045] Creating default 'basic' HTTP authenticator for
realm 'mesos-agent-readonly'
I0901 23:08:46.395321 30886 http.cpp:1066] Creating default 'jwt' HTTP authenticator for realm
'mesos-agent-readonly'
I0901 23:08:46.395512 30886 http.cpp:1045] Creating default 'basic' HTTP authenticator for
realm 'mesos-agent-readwrite'
I0901 23:08:46.395622 30886 http.cpp:1066] Creating default 'jwt' HTTP authenticator for realm
'mesos-agent-readwrite'
I0901 23:08:46.397053 30886 slave.cpp:581] Agent resources: [{"name":"cpus","scalar":{"value":2.0},"type":"SCALAR"},{"name":"mem","scalar":{"value":1024.0},"type":"SCALAR"},{"name":"disk","scalar":{"value":1024.0},"type":"SCALAR"},{"name":"ports","ranges":{"range":[{"begin":31000,"end":32000}]},"type":"RANGES"}]
I0901 23:08:46.397279 30886 slave.cpp:589] Agent attributes: [  ]
I0901 23:08:46.397303 30886 slave.cpp:598] Agent hostname: b8bdaa18511b
I0901 23:08:46.397477 30878 status_update_manager.cpp:177] Pausing sending status updates
I0901 23:08:46.399044 30890 state.cpp:64] Recovering state from '/tmp/Endpoint_SlaveEndpointTest_NoAuthorizer_0_8IUBB2/meta'
I0901 23:08:46.399379 30900 status_update_manager.cpp:203] Recovering status update manager
I0901 23:08:46.399543 30891 containerizer.cpp:646] Recovering containerizer
I0901 23:08:46.400805 30889 provisioner.cpp:416] Provisioner recovery complete
I0901 23:08:46.401118 30881 slave.cpp:6296] Finished recovery
I0901 23:08:46.401577 30881 slave.cpp:6478] Querying resource estimator for oversubscribable
resources
I0901 23:08:46.401873 30877 slave.cpp:6492] Received oversubscribable resources {} from the
resource estimator
I0901 23:08:46.403807 30885 process.cpp:3956] Handling HTTP event for process 'slave(817)'
with path: '/slave(817)/monitor/statistics'
I0901 23:08:46.405272 30890 http.cpp:1185] HTTP GET for /slave(817)/monitor/statistics from
172.17.0.7:42308
I0901 23:08:46.405336 30890 http.cpp:976] Authorizing principal 'test-principal' to GET the
'/monitor/statistics' endpoint
I0901 23:08:46.408000 30894 slave.cpp:859] Agent terminating
[       OK ] Endpoint/SlaveEndpointTest.NoAuthorizer/0 (30 ms)
[ RUN      ] Endpoint/SlaveEndpointTest.NoAuthorizer/1
I0901 23:08:46.418109  9662 containerizer.cpp:290] Using isolation { environment_secret, posix/cpu,
posix/mem, filesystem/posix, network/cni }
W0901 23:08:46.418566  9662 backend.cpp:76] Failed to create 'aufs' backend: AufsBackend requires
root privileges
W0901 23:08:46.418669  9662 backend.cpp:76] Failed to create 'bind' backend: BindBackend requires
root privileges
I0901 23:08:46.418699  9662 provisioner.cpp:255] Using default backend 'copy'
I0901 23:08:46.420156  9662 cluster.cpp:448] Creating default 'local' authorizer
I0901 23:08:46.421819 30881 slave.cpp:252] Mesos agent started on (818)@172.17.0.7:35080
I0901 23:08:46.421839 30881 slave.cpp:253] Flags at startup: --acls="" --appc_simple_discovery_uri_prefix="http://"
--appc_store_dir="/tmp/Endpoint_SlaveEndpointTest_NoAuthorizer_1_MuHG3g/store/appc" --authenticate_http_executors="true"
--authenticate_http_readonly="true" --authenticate_http_readwrite="true" --authenticatee="crammd5"
--authentication_backoff_factor="1secs" --authorizer="local" --cgroups_cpu_enable_pids_and_tids_count="false"
--cgroups_enable_cfs="false" --cgroups_hierarchy="/sys/fs/cgroup" --cgroups_limit_swap="false"
--cgroups_root="mesos" --container_disk_watch_interval="15secs" --containerizers="mesos" --credential="/tmp/Endpoint_SlaveEndpointTest_NoAuthorizer_1_MuHG3g/credential"
--default_role="*" --disallow_sharing_agent_pid_namespace="false" --disk_watch_interval="1mins"
--docker="docker" --docker_kill_orphans="true" --docker_registry="https://registry-1.docker.io"
--docker_remove_delay="6hrs" --docker_socket="/var/run/docker.sock" --docker_stop_timeout="0ns"
--docker_store_dir="/tmp/Endpoint_SlaveEndpointTest_NoAuthorizer_1_MuHG3g/store/docker" --docker_volume_checkpoint_dir="/var/run/mesos/isolators/docker/volume"
--enforce_container_disk_quota="false" --executor_registration_timeout="1mins" --executor_reregistration_timeout="2secs"
--executor_secret_key="/tmp/Endpoint_SlaveEndpointTest_NoAuthorizer_1_MuHG3g/executor_secret_key"
--executor_shutdown_grace_period="5secs" --fetcher_cache_dir="/tmp/Endpoint_SlaveEndpointTest_NoAuthorizer_1_MuHG3g/fetch"
--fetcher_cache_size="2GB" --frameworks_home="" --gc_delay="1weeks" --gc_disk_headroom="0.1"
--hadoop_home="" --help="false" --hostname_lookup="true" --http_command_executor="false" --http_credentials="/tmp/Endpoint_SlaveEndpointTest_NoAuthorizer_1_MuHG3g/http_credentials"
--http_heartbeat_interval="30secs" --initialize_driver_logging="true" --isolation="posix/cpu,posix/mem"
--launcher="posix" --launcher_dir="/mesos/mesos-1.5.0/_build/src" --logbufsecs="0" --logging_level="INFO"
--max_completed_executors_per_framework="150" --oversubscribed_resources_interval="15secs"
--perf_duration="10secs" --perf_interval="1mins" --port="5051" --qos_correction_interval_min="0ns"
--quiet="false" --recover="reconnect" --recovery_timeout="15mins" --registration_backoff_factor="10ms"
--resources="cpus:2;gpus:0;mem:1024;disk:1024;ports:[31000-32000]" --revocable_cpu_low_priority="true"
--runtime_dir="/tmp/Endpoint_SlaveEndpointTest_NoAuthorizer_1_MuHG3g" --sandbox_directory="/mnt/mesos/sandbox"
--strict="true" --switch_user="true" --systemd_enable_support="true" --systemd_runtime_directory="/run/systemd/system"
--version="false" --work_dir="/tmp/Endpoint_SlaveEndpointTest_NoAuthorizer_1_z2PIWC" --zk_session_timeout="10secs"
I0901 23:08:46.422237 30881 credentials.hpp:86] Loading credential for authentication from
'/tmp/Endpoint_SlaveEndpointTest_NoAuthorizer_1_MuHG3g/credential'
I0901 23:08:46.422381 30881 slave.cpp:285] Agent using credential for: test-principal
I0901 23:08:46.422405 30881 credentials.hpp:37] Loading credentials for authentication from
'/tmp/Endpoint_SlaveEndpointTest_NoAuthorizer_1_MuHG3g/http_credentials'
I0901 23:08:46.422665 30881 http.cpp:1045] Creating default 'basic' HTTP authenticator for
realm 'mesos-agent-executor'
I0901 23:08:46.422780 30881 http.cpp:1066] Creating default 'jwt' HTTP authenticator for realm
'mesos-agent-executor'
I0901 23:08:46.423008 30881 http.cpp:1045] Creating default 'basic' HTTP authenticator for
realm 'mesos-agent-readonly'
I0901 23:08:46.423113 30881 http.cpp:1066] Creating default 'jwt' HTTP authenticator for realm
'mesos-agent-readonly'
I0901 23:08:46.423290 30881 http.cpp:1045] Creating default 'basic' HTTP authenticator for
realm 'mesos-agent-readwrite'
I0901 23:08:46.423405 30881 http.cpp:1066] Creating default 'jwt' HTTP authenticator for realm
'mesos-agent-readwrite'
I0901 23:08:46.425019 30881 slave.cpp:581] Agent resources: [{"name":"cpus","scalar":{"value":2.0},"type":"SCALAR"},{"name":"mem","scalar":{"value":1024.0},"type":"SCALAR"},{"name":"disk","scalar":{"value":1024.0},"type":"SCALAR"},{"name":"ports","ranges":{"range":[{"begin":31000,"end":32000}]},"type":"RANGES"}]
I0901 23:08:46.425240 30881 slave.cpp:589] Agent attributes: [  ]
I0901 23:08:46.425258 30881 slave.cpp:598] Agent hostname: b8bdaa18511b
I0901 23:08:46.425382 30890 status_update_manager.cpp:177] Pausing sending status updates
I0901 23:08:46.426899 30899 state.cpp:64] Recovering state from '/tmp/Endpoint_SlaveEndpointTest_NoAuthorizer_1_z2PIWC/meta'
I0901 23:08:46.427152 30879 status_update_manager.cpp:203] Recovering status update manager
I0901 23:08:46.427325 30884 containerizer.cpp:646] Recovering containerizer
I0901 23:08:46.428668 30880 provisioner.cpp:416] Provisioner recovery complete
I0901 23:08:46.428954 30881 slave.cpp:6296] Finished recovery
I0901 23:08:46.429419 30881 slave.cpp:6478] Querying resource estimator for oversubscribable
resources
I0901 23:08:46.429678 30877 slave.cpp:6492] Received oversubscribable resources {} from the
resource estimator
I0901 23:08:46.431988 30886 process.cpp:3956] Handling HTTP event for process 'slave(818)'
with path: '/slave(818)/monitor/statistics.json'
I0901 23:08:46.433583 30879 http.cpp:1185] HTTP GET for /slave(818)/monitor/statistics.json
from 172.17.0.7:42310
I0901 23:08:46.433675 30879 http.cpp:976] Authorizing principal 'test-principal' to GET the
'/monitor/statistics.json' endpoint
I0901 23:08:46.436218 30895 slave.cpp:859] Agent terminating
[       OK ] Endpoint/SlaveEndpointTest.NoAuthorizer/1 (29 ms)
[ RUN      ] Endpoint/SlaveEndpointTest.NoAuthorizer/2
I0901 23:08:46.448638  9662 containerizer.cpp:290] Using isolation { environment_secret, posix/cpu,
posix/mem, filesystem/posix, network/cni }
W0901 23:08:46.449120  9662 backend.cpp:76] Failed to create 'aufs' backend: AufsBackend requires
root privileges
W0901 23:08:46.449223  9662 backend.cpp:76] Failed to create 'bind' backend: BindBackend requires
root privileges
I0901 23:08:46.449255  9662 provisioner.cpp:255] Using default backend 'copy'
I0901 23:08:46.450944  9662 cluster.cpp:448] Creating default 'local' authorizer
I0901 23:08:46.452846 30893 slave.cpp:252] Mesos agent started on (819)@172.17.0.7:35080
I0901 23:08:46.452865 30893 slave.cpp:253] Flags at startup: --acls="" --appc_simple_discovery_uri_prefix="http://"
--appc_store_dir="/tmp/Endpoint_SlaveEndpointTest_NoAuthorizer_2_dqjMKR/store/appc" --authenticate_http_executors="true"
--authenticate_http_readonly="true" --authenticate_http_readwrite="true" --authenticatee="crammd5"
--authentication_backoff_factor="1secs" --authorizer="local" --cgroups_cpu_enable_pids_and_tids_count="false"
--cgroups_enable_cfs="false" --cgroups_hierarchy="/sys/fs/cgroup" --cgroups_limit_swap="false"
--cgroups_root="mesos" --container_disk_watch_interval="15secs" --containerizers="mesos" --credential="/tmp/Endpoint_SlaveEndpointTest_NoAuthorizer_2_dqjMKR/credential"
--default_role="*" --disallow_sharing_agent_pid_namespace="false" --disk_watch_interval="1mins"
--docker="docker" --docker_kill_orphans="true" --docker_registry="https://registry-1.docker.io"
--docker_remove_delay="6hrs" --docker_socket="/var/run/docker.sock" --docker_stop_timeout="0ns"
--docker_store_dir="/tmp/Endpoint_SlaveEndpointTest_NoAuthorizer_2_dqjMKR/store/docker" --docker_volume_checkpoint_dir="/var/run/mesos/isolators/docker/volume"
--enforce_container_disk_quota="false" --executor_registration_timeout="1mins" --executor_reregistration_timeout="2secs"
--executor_secret_key="/tmp/Endpoint_SlaveEndpointTest_NoAuthorizer_2_dqjMKR/executor_secret_key"
--executor_shutdown_grace_period="5secs" --fetcher_cache_dir="/tmp/Endpoint_SlaveEndpointTest_NoAuthorizer_2_dqjMKR/fetch"
--fetcher_cache_size="2GB" --frameworks_home="" --gc_delay="1weeks" --gc_disk_headroom="0.1"
--hadoop_home="" --help="false" --hostname_lookup="true" --http_command_executor="false" --http_credentials="/tmp/Endpoint_SlaveEndpointTest_NoAuthorizer_2_dqjMKR/http_credentials"
--http_heartbeat_interval="30secs" --initialize_driver_logging="true" --isolation="posix/cpu,posix/mem"
--launcher="posix" --launcher_dir="/mesos/mesos-1.5.0/_build/src" --logbufsecs="0" --logging_level="INFO"
--max_completed_executors_per_framework="150" --oversubscribed_resources_interval="15secs"
--perf_duration="10secs" --perf_interval="1mins" --port="5051" --qos_correction_interval_min="0ns"
--quiet="false" --recover="reconnect" --recovery_timeout="15mins" --registration_backoff_factor="10ms"
--resources="cpus:2;gpus:0;mem:1024;disk:1024;ports:[31000-32000]" --revocable_cpu_low_priority="true"
--runtime_dir="/tmp/Endpoint_SlaveEndpointTest_NoAuthorizer_2_dqjMKR" --sandbox_directory="/mnt/mesos/sandbox"
--strict="true" --switch_user="true" --systemd_enable_support="true" --systemd_runtime_directory="/run/systemd/system"
--version="false" --work_dir="/tmp/Endpoint_SlaveEndpointTest_NoAuthorizer_2_qMfjzd" --zk_session_timeout="10secs"
I0901 23:08:46.453236 30893 credentials.hpp:86] Loading credential for authentication from
'/tmp/Endpoint_SlaveEndpointTest_NoAuthorizer_2_dqjMKR/credential'
I0901 23:08:46.453380 30893 slave.cpp:285] Agent using credential for: test-principal
I0901 23:08:46.453400 30893 credentials.hpp:37] Loading credentials for authentication from
'/tmp/Endpoint_SlaveEndpointTest_NoAuthorizer_2_dqjMKR/http_credentials'
I0901 23:08:46.453654 30893 http.cpp:1045] Creating default 'basic' HTTP authenticator for
realm 'mesos-agent-executor'
I0901 23:08:46.453773 30893 http.cpp:1066] Creating default 'jwt' HTTP authenticator for realm
'mesos-agent-executor'
I0901 23:08:46.453964 30893 http.cpp:1045] Creating default 'basic' HTTP authenticator for
realm 'mesos-agent-readonly'
I0901 23:08:46.454063 30893 http.cpp:1066] Creating default 'jwt' HTTP authenticator for realm
'mesos-agent-readonly'
I0901 23:08:46.454262 30893 http.cpp:1045] Creating default 'basic' HTTP authenticator for
realm 'mesos-agent-readwrite'
I0901 23:08:46.454356 30893 http.cpp:1066] Creating default 'jwt' HTTP authenticator for realm
'mesos-agent-readwrite'
I0901 23:08:46.455646 30893 slave.cpp:581] Agent resources: [{"name":"cpus","scalar":{"value":2.0},"type":"SCALAR"},{"name":"mem","scalar":{"value":1024.0},"type":"SCALAR"},{"name":"disk","scalar":{"value":1024.0},"type":"SCALAR"},{"name":"ports","ranges":{"range":[{"begin":31000,"end":32000}]},"type":"RANGES"}]
I0901 23:08:46.455860 30893 slave.cpp:589] Agent attributes: [  ]
I0901 23:08:46.455874 30893 slave.cpp:598] Agent hostname: b8bdaa18511b
I0901 23:08:46.455993 30878 status_update_manager.cpp:177] Pausing sending status updates
I0901 23:08:46.457504 30894 state.cpp:64] Recovering state from '/tmp/Endpoint_SlaveEndpointTest_NoAuthorizer_2_qMfjzd/meta'
I0901 23:08:46.457815 30880 status_update_manager.cpp:203] Recovering status update manager
I0901 23:08:46.457998 30890 containerizer.cpp:646] Recovering containerizer
I0901 23:08:46.459321 30888 provisioner.cpp:416] Provisioner recovery complete
I0901 23:08:46.459651 30887 slave.cpp:6296] Finished recovery
I0901 23:08:46.460062 30887 slave.cpp:6478] Querying resource estimator for oversubscribable
resources
I0901 23:08:46.460305 30898 slave.cpp:6492] Received oversubscribable resources {} from the
resource estimator
I0901 23:08:46.462586 30896 process.cpp:3956] Handling HTTP event for process 'slave(819)'
with path: '/slave(819)/containers'
I0901 23:08:46.464516 30899 http.cpp:1185] HTTP GET for /slave(819)/containers from 172.17.0.7:42312
I0901 23:08:46.464586 30899 http.cpp:976] Authorizing principal 'test-principal' to GET the
'/containers' endpoint
I0901 23:08:46.467707  9662 slave.cpp:859] Agent terminating
[       OK ] Endpoint/SlaveEndpointTest.NoAuthorizer/2 (30 ms)
[----------] 9 tests from Endpoint/SlaveEndpointTest (260 ms total)

[----------] 2 tests from ContainerizerType/DefaultContainerDNSFlagTest
[ RUN      ] ContainerizerType/DefaultContainerDNSFlagTest.ValidateFlag/0
[       OK ] ContainerizerType/DefaultContainerDNSFlagTest.ValidateFlag/0 (9 ms)
[ RUN      ] ContainerizerType/DefaultContainerDNSFlagTest.ValidateFlag/1
[       OK ] ContainerizerType/DefaultContainerDNSFlagTest.ValidateFlag/1 (9 ms)
[----------] 2 tests from ContainerizerType/DefaultContainerDNSFlagTest (18 ms total)

[----------] Global test environment tear-down
[==========] 1672 tests from 185 test cases ran. (659288 ms total)
[  PASSED  ] 1667 tests.
[  FAILED  ] 5 tests, listed below:
[  FAILED  ] CommandExecutorCheckTest.CommandCheckDeliveredAndReconciled
[  FAILED  ] DefaultExecutorCheckTest.CommandCheckDeliveredAndReconciled
[  FAILED  ] DefaultExecutorCheckTest.CommandCheckStatusChange
[  FAILED  ] DefaultExecutorCheckTest.CommandCheckSeesParentsEnv
[  FAILED  ] DefaultExecutorCheckTest.CommandCheckSharesWorkDirWithTask

 5 FAILED TESTS
  YOU HAVE 20 DISABLED TESTS

I0901 23:08:46.553433 30901 process.cpp:1072] Failed to accept socket: future discarded
make[4]: *** [check-local] Error 1
make[4]: Leaving directory `/mesos/mesos-1.5.0/_build/src'
make[3]: *** [check-am] Error 2
make[3]: Leaving directory `/mesos/mesos-1.5.0/_build/src'
make[2]: *** [check] Error 2
make[2]: Leaving directory `/mesos/mesos-1.5.0/_build/src'
make[1]: *** [check-recursive] Error 1
make[1]: Leaving directory `/mesos/mesos-1.5.0/_build'
make: *** [distcheck] Error 1
+ docker rmi mesos-1504304403-27937
Untagged: mesos-1504304403-27937:latest
Deleted: sha256:eb1d1358fd90193564b623e41b953f8c7e7c71e4c2fc044867bae01ea11b8098
Deleted: sha256:06a2a83170e8cd96c3fcef7da9400ea92da6e789c089ad16affbd093127a338b
Deleted: sha256:9d9d3c5ddc680f9ebd91e8ace01524d4f7d9ffdfd8ed6a38875b72a2892937a9
Deleted: sha256:78f54ebbda914c452341c84e646cb11819acaa7cfbeb7d5235c1ccc2cc61f1ba
Deleted: sha256:dd0fa90311316f0bba7ca1c331211b8294ce81e8be01fe93b956bf114b06cb11
Deleted: sha256:ea9c837b763cb58254f2214f4c6315a106e90810e05b748ed01cf448168394c0
Deleted: sha256:8fa06e3265a95abf3407fcee015939b0e0a0b18a43af543b27835d30b454327e
Deleted: sha256:7f9c752145635bec7ad989d0b1cde55d243bbdd4cedd9649637714e12bd8d972
Deleted: sha256:77c3fa324da4556b60ae98983abdcfa172fe3c454d0925d317b2d5f145eed3f8
Deleted: sha256:e466eff2982ec26e41661af19f430df1ec702e53e5e1b1f4343b52f483c2d657
Deleted: sha256:c38d868f1984cac4b66b72aeef3f385ec31255f4b8cbf0bca4a6d65d63eacb04
Deleted: sha256:7b9238c034c2234a633d63feb359fcc1b2ee5b056ce36edbda8d6218352d125d
Deleted: sha256:65b75a8e0b491827717b1afe5f18993b4183909165e992559aa40cf0ea1520b7
Deleted: sha256:dd3c7cf2295067e19fb022cefe6fdd928964d03d75b5b0fd3b736ec96f116cde
Deleted: sha256:aee9e728499291f546ae65b1ce6282007307f8fba470360e8bcfe345b390f19d
Deleted: sha256:8eb1b21946957f2ec2dec0222a7440ed4c5781d87b4268be9d172e8ee7a518fd
Deleted: sha256:072bb7b35ac131bef0e4b8fb5cb09b5d87531305acea7f3fa45f99aa08c77804
Deleted: sha256:b4bde6951f992cfa577568ad37c3b46483f9237c0b6b8a7c63a712c17b2f76d4
Deleted: sha256:03011240d2819e3e454626446d95cb82329f8c2c6909035645239714e3504f5a
Deleted: sha256:f6e52db6b81d6d4c113c0e58e04be54bcb79f7ce9e62890c8d354c5ee200c744
Deleted: sha256:44fe796121dbd24ad254b38fcfa284b74f0486277950e75cb1938c60c38184d8
Deleted: sha256:d06b7acd478c709fd1cbdea19b5c0c896cbbe0932a7ced548e07171057b42b1e
Deleted: sha256:36d280c76c799000e5817c03f8388001444d389051e806d87b9928bc0417236f
Deleted: sha256:923ffac78624efeb4353870d95b76b8f3e6671d9207893ac0f1b559adc82aa4f
Deleted: sha256:4645a4dac28200041384512b3211a808fd78f3e341b5a6f7b6a9289f4c028500
Build step 'Execute shell' marked build as failure
Not sending mail to unregistered user songzihao1990@gmail.com

Mime
View raw message