mesos-builds mailing list archives

Site index · List index
Message view « Date » · « Thread »
Top « Date » · « Thread »
From Apache Jenkins Server <jenk...@builds.apache.org>
Subject Build failed in Jenkins: Mesos-Reviewbot #19199
Date Mon, 04 Sep 2017 20:04:16 GMT
See <https://builds.apache.org/job/Mesos-Reviewbot/19199/display/redirect>

------------------------------------------
[...truncated 31.22 MB...]
I0904 20:04:11.064502  5799 slave.cpp:252] Mesos agent started on (810)@172.17.0.7:38794
I0904 20:04:11.064556  5799 slave.cpp:253] Flags at startup: --acls="" --appc_simple_discovery_uri_prefix="http://"
--appc_store_dir="/tmp/Endpoint_SlaveEndpointTest_AuthorizedRequest_2_081F3P/store/appc" --authenticate_http_readonly="true"
--authenticate_http_readwrite="true" --authenticatee="crammd5" --authentication_backoff_factor="1secs"
--authorizer="local" --cgroups_cpu_enable_pids_and_tids_count="false" --cgroups_enable_cfs="false"
--cgroups_hierarchy="/sys/fs/cgroup" --cgroups_limit_swap="false" --cgroups_root="mesos" --container_disk_watch_interval="15secs"
--containerizers="mesos" --credential="/tmp/Endpoint_SlaveEndpointTest_AuthorizedRequest_2_081F3P/credential"
--default_role="*" --disallow_sharing_agent_pid_namespace="false" --disk_watch_interval="1mins"
--docker="docker" --docker_kill_orphans="true" --docker_registry="https://registry-1.docker.io"
--docker_remove_delay="6hrs" --docker_socket="/var/run/docker.sock" --docker_stop_timeout="0ns"
--docker_store_dir="/tmp/Endpoint_SlaveEndpointTest_AuthorizedRequest_2_081F3P/store/docker"
--docker_volume_checkpoint_dir="/var/run/mesos/isolators/docker/volume" --enforce_container_disk_quota="false"
--executor_registration_timeout="1mins" --executor_reregistration_timeout="2secs" --executor_shutdown_grace_period="5secs"
--fetcher_cache_dir="/tmp/Endpoint_SlaveEndpointTest_AuthorizedRequest_2_081F3P/fetch" --fetcher_cache_size="2GB"
--frameworks_home="" --gc_delay="1weeks" --gc_disk_headroom="0.1" --hadoop_home="" --help="false"
--hostname_lookup="true" --http_command_executor="false" --http_credentials="/tmp/Endpoint_SlaveEndpointTest_AuthorizedRequest_2_081F3P/http_credentials"
--http_heartbeat_interval="30secs" --initialize_driver_logging="true" --isolation="posix/cpu,posix/mem"
--launcher="posix" --launcher_dir="/mesos/mesos-1.5.0/_build/src" --logbufsecs="0" --logging_level="INFO"
--max_completed_executors_per_framework="150" --oversubscribed_resources_interval="15secs"
--perf_duration="10secs" --perf_interval="1mins" --port="5051" --qos_correction_interval_min="0ns"
--quiet="false" --recover="reconnect" --recovery_timeout="15mins" --registration_backoff_factor="10ms"
--resources="cpus:2;gpus:0;mem:1024;disk:1024;ports:[31000-32000]" --revocable_cpu_low_priority="true"
--runtime_dir="/tmp/Endpoint_SlaveEndpointTest_AuthorizedRequest_2_081F3P" --sandbox_directory="/mnt/mesos/sandbox"
--strict="true" --switch_user="true" --systemd_enable_support="true" --systemd_runtime_directory="/run/systemd/system"
--version="false" --work_dir="/tmp/Endpoint_SlaveEndpointTest_AuthorizedRequest_2_pomhiE"
--zk_session_timeout="10secs"
I0904 20:04:11.065258  5799 credentials.hpp:86] Loading credential for authentication from
'/tmp/Endpoint_SlaveEndpointTest_AuthorizedRequest_2_081F3P/credential'
I0904 20:04:11.065515  5799 slave.cpp:285] Agent using credential for: test-principal
I0904 20:04:11.065564  5799 credentials.hpp:37] Loading credentials for authentication from
'/tmp/Endpoint_SlaveEndpointTest_AuthorizedRequest_2_081F3P/http_credentials'
I0904 20:04:11.065906  5799 http.cpp:1045] Creating default 'basic' HTTP authenticator for
realm 'mesos-agent-readonly'
I0904 20:04:11.066123  5799 http.cpp:1045] Creating default 'basic' HTTP authenticator for
realm 'mesos-agent-readwrite'
I0904 20:04:11.067883  5799 slave.cpp:581] Agent resources: [{"name":"cpus","scalar":{"value":2.0},"type":"SCALAR"},{"name":"mem","scalar":{"value":1024.0},"type":"SCALAR"},{"name":"disk","scalar":{"value":1024.0},"type":"SCALAR"},{"name":"ports","ranges":{"range":[{"begin":31000,"end":32000}]},"type":"RANGES"}]
I0904 20:04:11.068128  5799 slave.cpp:589] Agent attributes: [  ]
I0904 20:04:11.068142  5799 slave.cpp:598] Agent hostname: d321ae4f73e1
I0904 20:04:11.068326  5809 status_update_manager.cpp:177] Pausing sending status updates
I0904 20:04:11.070143  5793 state.cpp:64] Recovering state from '/tmp/Endpoint_SlaveEndpointTest_AuthorizedRequest_2_pomhiE/meta'
I0904 20:04:11.070487  5808 status_update_manager.cpp:203] Recovering status update manager
I0904 20:04:11.070699  5812 containerizer.cpp:646] Recovering containerizer
I0904 20:04:11.072341  5810 provisioner.cpp:416] Provisioner recovery complete
I0904 20:04:11.072731  5813 slave.cpp:6296] Finished recovery
I0904 20:04:11.073274  5813 slave.cpp:6478] Querying resource estimator for oversubscribable
resources
I0904 20:04:11.073544  5803 slave.cpp:6492] Received oversubscribable resources {} from the
resource estimator
I0904 20:04:11.076907  5795 process.cpp:3954] Handling HTTP event for process 'slave(810)'
with path: '/slave(810)/containers'
I0904 20:04:11.078589  5802 http.cpp:1185] HTTP GET for /slave(810)/containers from 172.17.0.7:35338
I0904 20:04:11.078689  5802 http.cpp:976] Authorizing principal 'test-principal' to GET the
'/containers' endpoint
I0904 20:04:11.084008  5773 slave.cpp:859] Agent terminating
[       OK ] Endpoint/SlaveEndpointTest.AuthorizedRequest/2 (40 ms)
[ RUN      ] Endpoint/SlaveEndpointTest.UnauthorizedRequest/0
I0904 20:04:11.102640  5773 containerizer.cpp:290] Using isolation { environment_secret, posix/cpu,
posix/mem, filesystem/posix, network/cni }
W0904 20:04:11.103621  5773 backend.cpp:76] Failed to create 'aufs' backend: AufsBackend requires
root privileges
W0904 20:04:11.103780  5773 backend.cpp:76] Failed to create 'bind' backend: BindBackend requires
root privileges
I0904 20:04:11.103839  5773 provisioner.cpp:255] Using default backend 'copy'
I0904 20:04:11.108575  5794 slave.cpp:252] Mesos agent started on (811)@172.17.0.7:38794
I0904 20:04:11.108757  5794 slave.cpp:253] Flags at startup: --acls="" --appc_simple_discovery_uri_prefix="http://"
--appc_store_dir="/tmp/Endpoint_SlaveEndpointTest_UnauthorizedRequest_0_0S1qrB/store/appc"
--authenticate_http_readonly="true" --authenticate_http_readwrite="true" --authenticatee="crammd5"
--authentication_backoff_factor="1secs" --authorizer="local" --cgroups_cpu_enable_pids_and_tids_count="false"
--cgroups_enable_cfs="false" --cgroups_hierarchy="/sys/fs/cgroup" --cgroups_limit_swap="false"
--cgroups_root="mesos" --container_disk_watch_interval="15secs" --containerizers="mesos" --credential="/tmp/Endpoint_SlaveEndpointTest_UnauthorizedRequest_0_0S1qrB/credential"
--default_role="*" --disallow_sharing_agent_pid_namespace="false" --disk_watch_interval="1mins"
--docker="docker" --docker_kill_orphans="true" --docker_registry="https://registry-1.docker.io"
--docker_remove_delay="6hrs" --docker_socket="/var/run/docker.sock" --docker_stop_timeout="0ns"
--docker_store_dir="/tmp/Endpoint_SlaveEndpointTest_UnauthorizedRequest_0_0S1qrB/store/docker"
--docker_volume_checkpoint_dir="/var/run/mesos/isolators/docker/volume" --enforce_container_disk_quota="false"
--executor_registration_timeout="1mins" --executor_reregistration_timeout="2secs" --executor_shutdown_grace_period="5secs"
--fetcher_cache_dir="/tmp/Endpoint_SlaveEndpointTest_UnauthorizedRequest_0_0S1qrB/fetch" --fetcher_cache_size="2GB"
--frameworks_home="" --gc_delay="1weeks" --gc_disk_headroom="0.1" --hadoop_home="" --help="false"
--hostname_lookup="true" --http_command_executor="false" --http_credentials="/tmp/Endpoint_SlaveEndpointTest_UnauthorizedRequest_0_0S1qrB/http_credentials"
--http_heartbeat_interval="30secs" --initialize_driver_logging="true" --isolation="posix/cpu,posix/mem"
--launcher="posix" --launcher_dir="/mesos/mesos-1.5.0/_build/src" --logbufsecs="0" --logging_level="INFO"
--max_completed_executors_per_framework="150" --oversubscribed_resources_interval="15secs"
--perf_duration="10secs" --perf_interval="1mins" --port="5051" --qos_correction_interval_min="0ns"
--quiet="false" --recover="reconnect" --recovery_timeout="15mins" --registration_backoff_factor="10ms"
--resources="cpus:2;gpus:0;mem:1024;disk:1024;ports:[31000-32000]" --revocable_cpu_low_priority="true"
--runtime_dir="/tmp/Endpoint_SlaveEndpointTest_UnauthorizedRequest_0_0S1qrB" --sandbox_directory="/mnt/mesos/sandbox"
--strict="true" --switch_user="true" --systemd_enable_support="true" --systemd_runtime_directory="/run/systemd/system"
--version="false" --work_dir="/tmp/Endpoint_SlaveEndpointTest_UnauthorizedRequest_0_RKtWzp"
--zk_session_timeout="10secs"
I0904 20:04:11.109473  5794 credentials.hpp:86] Loading credential for authentication from
'/tmp/Endpoint_SlaveEndpointTest_UnauthorizedRequest_0_0S1qrB/credential'
I0904 20:04:11.109679  5794 slave.cpp:285] Agent using credential for: test-principal
I0904 20:04:11.109702  5794 credentials.hpp:37] Loading credentials for authentication from
'/tmp/Endpoint_SlaveEndpointTest_UnauthorizedRequest_0_0S1qrB/http_credentials'
I0904 20:04:11.109977  5794 http.cpp:1045] Creating default 'basic' HTTP authenticator for
realm 'mesos-agent-readonly'
I0904 20:04:11.110165  5794 http.cpp:1045] Creating default 'basic' HTTP authenticator for
realm 'mesos-agent-readwrite'
I0904 20:04:11.111608  5794 slave.cpp:581] Agent resources: [{"name":"cpus","scalar":{"value":2.0},"type":"SCALAR"},{"name":"mem","scalar":{"value":1024.0},"type":"SCALAR"},{"name":"disk","scalar":{"value":1024.0},"type":"SCALAR"},{"name":"ports","ranges":{"range":[{"begin":31000,"end":32000}]},"type":"RANGES"}]
I0904 20:04:11.111845  5794 slave.cpp:589] Agent attributes: [  ]
I0904 20:04:11.111860  5794 slave.cpp:598] Agent hostname: d321ae4f73e1
I0904 20:04:11.112064  5796 status_update_manager.cpp:177] Pausing sending status updates
I0904 20:04:11.113610  5792 state.cpp:64] Recovering state from '/tmp/Endpoint_SlaveEndpointTest_UnauthorizedRequest_0_RKtWzp/meta'
I0904 20:04:11.114055  5806 status_update_manager.cpp:203] Recovering status update manager
I0904 20:04:11.114271  5815 containerizer.cpp:646] Recovering containerizer
I0904 20:04:11.116194  5795 provisioner.cpp:416] Provisioner recovery complete
I0904 20:04:11.116595  5794 slave.cpp:6296] Finished recovery
I0904 20:04:11.117161  5794 slave.cpp:6478] Querying resource estimator for oversubscribable
resources
I0904 20:04:11.117600  5793 slave.cpp:6492] Received oversubscribable resources {} from the
resource estimator
I0904 20:04:11.120471  5801 process.cpp:3954] Handling HTTP event for process 'slave(811)'
with path: '/slave(811)/monitor/statistics'
I0904 20:04:11.122084  5792 http.cpp:1185] HTTP GET for /slave(811)/monitor/statistics from
172.17.0.7:35340
I0904 20:04:11.122197  5792 http.cpp:976] Authorizing principal 'test-principal' to GET the
'/monitor/statistics' endpoint
I0904 20:04:11.124891  5773 slave.cpp:859] Agent terminating
[       OK ] Endpoint/SlaveEndpointTest.UnauthorizedRequest/0 (36 ms)
[ RUN      ] Endpoint/SlaveEndpointTest.UnauthorizedRequest/1
I0904 20:04:11.137995  5773 containerizer.cpp:290] Using isolation { environment_secret, posix/cpu,
posix/mem, filesystem/posix, network/cni }
W0904 20:04:11.138568  5773 backend.cpp:76] Failed to create 'aufs' backend: AufsBackend requires
root privileges
W0904 20:04:11.138703  5773 backend.cpp:76] Failed to create 'bind' backend: BindBackend requires
root privileges
I0904 20:04:11.138739  5773 provisioner.cpp:255] Using default backend 'copy'
I0904 20:04:11.143048  5796 slave.cpp:252] Mesos agent started on (812)@172.17.0.7:38794
I0904 20:04:11.143069  5796 slave.cpp:253] Flags at startup: --acls="" --appc_simple_discovery_uri_prefix="http://"
--appc_store_dir="/tmp/Endpoint_SlaveEndpointTest_UnauthorizedRequest_1_GpHdcn/store/appc"
--authenticate_http_readonly="true" --authenticate_http_readwrite="true" --authenticatee="crammd5"
--authentication_backoff_factor="1secs" --authorizer="local" --cgroups_cpu_enable_pids_and_tids_count="false"
--cgroups_enable_cfs="false" --cgroups_hierarchy="/sys/fs/cgroup" --cgroups_limit_swap="false"
--cgroups_root="mesos" --container_disk_watch_interval="15secs" --containerizers="mesos" --credential="/tmp/Endpoint_SlaveEndpointTest_UnauthorizedRequest_1_GpHdcn/credential"
--default_role="*" --disallow_sharing_agent_pid_namespace="false" --disk_watch_interval="1mins"
--docker="docker" --docker_kill_orphans="true" --docker_registry="https://registry-1.docker.io"
--docker_remove_delay="6hrs" --docker_socket="/var/run/docker.sock" --docker_stop_timeout="0ns"
--docker_store_dir="/tmp/Endpoint_SlaveEndpointTest_UnauthorizedRequest_1_GpHdcn/store/docker"
--docker_volume_checkpoint_dir="/var/run/mesos/isolators/docker/volume" --enforce_container_disk_quota="false"
--executor_registration_timeout="1mins" --executor_reregistration_timeout="2secs" --executor_shutdown_grace_period="5secs"
--fetcher_cache_dir="/tmp/Endpoint_SlaveEndpointTest_UnauthorizedRequest_1_GpHdcn/fetch" --fetcher_cache_size="2GB"
--frameworks_home="" --gc_delay="1weeks" --gc_disk_headroom="0.1" --hadoop_home="" --help="false"
--hostname_lookup="true" --http_command_executor="false" --http_credentials="/tmp/Endpoint_SlaveEndpointTest_UnauthorizedRequest_1_GpHdcn/http_credentials"
--http_heartbeat_interval="30secs" --initialize_driver_logging="true" --isolation="posix/cpu,posix/mem"
--launcher="posix" --launcher_dir="/mesos/mesos-1.5.0/_build/src" --logbufsecs="0" --logging_level="INFO"
--max_completed_executors_per_framework="150" --oversubscribed_resources_interval="15secs"
--perf_duration="10secs" --perf_interval="1mins" --port="5051" --qos_correction_interval_min="0ns"
--quiet="false" --recover="reconnect" --recovery_timeout="15mins" --registration_backoff_factor="10ms"
--resources="cpus:2;gpus:0;mem:1024;disk:1024;ports:[31000-32000]" --revocable_cpu_low_priority="true"
--runtime_dir="/tmp/Endpoint_SlaveEndpointTest_UnauthorizedRequest_1_GpHdcn" --sandbox_directory="/mnt/mesos/sandbox"
--strict="true" --switch_user="true" --systemd_enable_support="true" --systemd_runtime_directory="/run/systemd/system"
--version="false" --work_dir="/tmp/Endpoint_SlaveEndpointTest_UnauthorizedRequest_1_TcOffb"
--zk_session_timeout="10secs"
I0904 20:04:11.143482  5796 credentials.hpp:86] Loading credential for authentication from
'/tmp/Endpoint_SlaveEndpointTest_UnauthorizedRequest_1_GpHdcn/credential'
I0904 20:04:11.143635  5796 slave.cpp:285] Agent using credential for: test-principal
I0904 20:04:11.143657  5796 credentials.hpp:37] Loading credentials for authentication from
'/tmp/Endpoint_SlaveEndpointTest_UnauthorizedRequest_1_GpHdcn/http_credentials'
I0904 20:04:11.143880  5796 http.cpp:1045] Creating default 'basic' HTTP authenticator for
realm 'mesos-agent-readonly'
I0904 20:04:11.144026  5796 http.cpp:1045] Creating default 'basic' HTTP authenticator for
realm 'mesos-agent-readwrite'
I0904 20:04:11.145345  5796 slave.cpp:581] Agent resources: [{"name":"cpus","scalar":{"value":2.0},"type":"SCALAR"},{"name":"mem","scalar":{"value":1024.0},"type":"SCALAR"},{"name":"disk","scalar":{"value":1024.0},"type":"SCALAR"},{"name":"ports","ranges":{"range":[{"begin":31000,"end":32000}]},"type":"RANGES"}]
I0904 20:04:11.145568  5796 slave.cpp:589] Agent attributes: [  ]
I0904 20:04:11.145582  5796 slave.cpp:598] Agent hostname: d321ae4f73e1
I0904 20:04:11.145701  5815 status_update_manager.cpp:177] Pausing sending status updates
I0904 20:04:11.146955  5798 state.cpp:64] Recovering state from '/tmp/Endpoint_SlaveEndpointTest_UnauthorizedRequest_1_TcOffb/meta'
I0904 20:04:11.147416  5793 status_update_manager.cpp:203] Recovering status update manager
I0904 20:04:11.147611  5794 containerizer.cpp:646] Recovering containerizer
I0904 20:04:11.149237  5795 provisioner.cpp:416] Provisioner recovery complete
I0904 20:04:11.149580  5800 slave.cpp:6296] Finished recovery
I0904 20:04:11.149996  5800 slave.cpp:6478] Querying resource estimator for oversubscribable
resources
I0904 20:04:11.150255  5804 slave.cpp:6492] Received oversubscribable resources {} from the
resource estimator
I0904 20:04:11.153379  5813 process.cpp:3954] Handling HTTP event for process 'slave(812)'
with path: '/slave(812)/monitor/statistics.json'
I0904 20:04:11.154837  5810 http.cpp:1185] HTTP GET for /slave(812)/monitor/statistics.json
from 172.17.0.7:35342
I0904 20:04:11.154911  5810 http.cpp:976] Authorizing principal 'test-principal' to GET the
'/monitor/statistics.json' endpoint
I0904 20:04:11.157183  5773 slave.cpp:859] Agent terminating
[       OK ] Endpoint/SlaveEndpointTest.UnauthorizedRequest/1 (31 ms)
[ RUN      ] Endpoint/SlaveEndpointTest.UnauthorizedRequest/2
I0904 20:04:11.170155  5773 containerizer.cpp:290] Using isolation { environment_secret, posix/cpu,
posix/mem, filesystem/posix, network/cni }
W0904 20:04:11.170759  5773 backend.cpp:76] Failed to create 'aufs' backend: AufsBackend requires
root privileges
W0904 20:04:11.170902  5773 backend.cpp:76] Failed to create 'bind' backend: BindBackend requires
root privileges
I0904 20:04:11.170943  5773 provisioner.cpp:255] Using default backend 'copy'
I0904 20:04:11.175434  5801 slave.cpp:252] Mesos agent started on (813)@172.17.0.7:38794
I0904 20:04:11.175459  5801 slave.cpp:253] Flags at startup: --acls="" --appc_simple_discovery_uri_prefix="http://"
--appc_store_dir="/tmp/Endpoint_SlaveEndpointTest_UnauthorizedRequest_2_y6Xeg9/store/appc"
--authenticate_http_readonly="true" --authenticate_http_readwrite="true" --authenticatee="crammd5"
--authentication_backoff_factor="1secs" --authorizer="local" --cgroups_cpu_enable_pids_and_tids_count="false"
--cgroups_enable_cfs="false" --cgroups_hierarchy="/sys/fs/cgroup" --cgroups_limit_swap="false"
--cgroups_root="mesos" --container_disk_watch_interval="15secs" --containerizers="mesos" --credential="/tmp/Endpoint_SlaveEndpointTest_UnauthorizedRequest_2_y6Xeg9/credential"
--default_role="*" --disallow_sharing_agent_pid_namespace="false" --disk_watch_interval="1mins"
--docker="docker" --docker_kill_orphans="true" --docker_registry="https://registry-1.docker.io"
--docker_remove_delay="6hrs" --docker_socket="/var/run/docker.sock" --docker_stop_timeout="0ns"
--docker_store_dir="/tmp/Endpoint_SlaveEndpointTest_UnauthorizedRequest_2_y6Xeg9/store/docker"
--docker_volume_checkpoint_dir="/var/run/mesos/isolators/docker/volume" --enforce_container_disk_quota="false"
--executor_registration_timeout="1mins" --executor_reregistration_timeout="2secs" --executor_shutdown_grace_period="5secs"
--fetcher_cache_dir="/tmp/Endpoint_SlaveEndpointTest_UnauthorizedRequest_2_y6Xeg9/fetch" --fetcher_cache_size="2GB"
--frameworks_home="" --gc_delay="1weeks" --gc_disk_headroom="0.1" --hadoop_home="" --help="false"
--hostname_lookup="true" --http_command_executor="false" --http_credentials="/tmp/Endpoint_SlaveEndpointTest_UnauthorizedRequest_2_y6Xeg9/http_credentials"
--http_heartbeat_interval="30secs" --initialize_driver_logging="true" --isolation="posix/cpu,posix/mem"
--launcher="posix" --launcher_dir="/mesos/mesos-1.5.0/_build/src" --logbufsecs="0" --logging_level="INFO"
--max_completed_executors_per_framework="150" --oversubscribed_resources_interval="15secs"
--perf_duration="10secs" --perf_interval="1mins" --port="5051" --qos_correction_interval_min="0ns"
--quiet="false" --recover="reconnect" --recovery_timeout="15mins" --registration_backoff_factor="10ms"
--resources="cpus:2;gpus:0;mem:1024;disk:1024;ports:[31000-32000]" --revocable_cpu_low_priority="true"
--runtime_dir="/tmp/Endpoint_SlaveEndpointTest_UnauthorizedRequest_2_y6Xeg9" --sandbox_directory="/mnt/mesos/sandbox"
--strict="true" --switch_user="true" --systemd_enable_support="true" --systemd_runtime_directory="/run/systemd/system"
--version="false" --work_dir="/tmp/Endpoint_SlaveEndpointTest_UnauthorizedRequest_2_zfDueX"
--zk_session_timeout="10secs"
I0904 20:04:11.176029  5801 credentials.hpp:86] Loading credential for authentication from
'/tmp/Endpoint_SlaveEndpointTest_UnauthorizedRequest_2_y6Xeg9/credential'
I0904 20:04:11.176218  5801 slave.cpp:285] Agent using credential for: test-principal
I0904 20:04:11.176239  5801 credentials.hpp:37] Loading credentials for authentication from
'/tmp/Endpoint_SlaveEndpointTest_UnauthorizedRequest_2_y6Xeg9/http_credentials'
I0904 20:04:11.176535  5801 http.cpp:1045] Creating default 'basic' HTTP authenticator for
realm 'mesos-agent-readonly'
I0904 20:04:11.176693  5801 http.cpp:1045] Creating default 'basic' HTTP authenticator for
realm 'mesos-agent-readwrite'
I0904 20:04:11.178056  5801 slave.cpp:581] Agent resources: [{"name":"cpus","scalar":{"value":2.0},"type":"SCALAR"},{"name":"mem","scalar":{"value":1024.0},"type":"SCALAR"},{"name":"disk","scalar":{"value":1024.0},"type":"SCALAR"},{"name":"ports","ranges":{"range":[{"begin":31000,"end":32000}]},"type":"RANGES"}]
I0904 20:04:11.178421  5801 slave.cpp:589] Agent attributes: [  ]
I0904 20:04:11.178434  5801 slave.cpp:598] Agent hostname: d321ae4f73e1
I0904 20:04:11.178578  5804 status_update_manager.cpp:177] Pausing sending status updates
I0904 20:04:11.179945  5793 state.cpp:64] Recovering state from '/tmp/Endpoint_SlaveEndpointTest_UnauthorizedRequest_2_zfDueX/meta'
I0904 20:04:11.180254  5796 status_update_manager.cpp:203] Recovering status update manager
I0904 20:04:11.180436  5814 containerizer.cpp:646] Recovering containerizer
I0904 20:04:11.181948  5795 provisioner.cpp:416] Provisioner recovery complete
I0904 20:04:11.182270  5799 slave.cpp:6296] Finished recovery
I0904 20:04:11.182700  5799 slave.cpp:6478] Querying resource estimator for oversubscribable
resources
I0904 20:04:11.182919  5792 slave.cpp:6492] Received oversubscribable resources {} from the
resource estimator
I0904 20:04:11.186848  5804 process.cpp:3954] Handling HTTP event for process 'slave(813)'
with path: '/slave(813)/containers'
I0904 20:04:11.188799  5801 http.cpp:1185] HTTP GET for /slave(813)/containers from 172.17.0.7:35344
I0904 20:04:11.188902  5801 http.cpp:976] Authorizing principal 'test-principal' to GET the
'/containers' endpoint
I0904 20:04:11.191823  5802 slave.cpp:859] Agent terminating
[       OK ] Endpoint/SlaveEndpointTest.UnauthorizedRequest/2 (35 ms)
[ RUN      ] Endpoint/SlaveEndpointTest.NoAuthorizer/0
I0904 20:04:11.207901  5773 containerizer.cpp:290] Using isolation { environment_secret, posix/cpu,
posix/mem, filesystem/posix, network/cni }
W0904 20:04:11.208698  5773 backend.cpp:76] Failed to create 'aufs' backend: AufsBackend requires
root privileges
W0904 20:04:11.208847  5773 backend.cpp:76] Failed to create 'bind' backend: BindBackend requires
root privileges
I0904 20:04:11.208891  5773 provisioner.cpp:255] Using default backend 'copy'
I0904 20:04:11.211050  5773 cluster.cpp:448] Creating default 'local' authorizer
I0904 20:04:11.213755  5809 slave.cpp:252] Mesos agent started on (814)@172.17.0.7:38794
I0904 20:04:11.213793  5809 slave.cpp:253] Flags at startup: --acls="" --appc_simple_discovery_uri_prefix="http://"
--appc_store_dir="/tmp/Endpoint_SlaveEndpointTest_NoAuthorizer_0_QrArFV/store/appc" --authenticate_http_readonly="true"
--authenticate_http_readwrite="true" --authenticatee="crammd5" --authentication_backoff_factor="1secs"
--authorizer="local" --cgroups_cpu_enable_pids_and_tids_count="false" --cgroups_enable_cfs="false"
--cgroups_hierarchy="/sys/fs/cgroup" --cgroups_limit_swap="false" --cgroups_root="mesos" --container_disk_watch_interval="15secs"
--containerizers="mesos" --credential="/tmp/Endpoint_SlaveEndpointTest_NoAuthorizer_0_QrArFV/credential"
--default_role="*" --disallow_sharing_agent_pid_namespace="false" --disk_watch_interval="1mins"
--docker="docker" --docker_kill_orphans="true" --docker_registry="https://registry-1.docker.io"
--docker_remove_delay="6hrs" --docker_socket="/var/run/docker.sock" --docker_stop_timeout="0ns"
--docker_store_dir="/tmp/Endpoint_SlaveEndpointTest_NoAuthorizer_0_QrArFV/store/docker" --docker_volume_checkpoint_dir="/var/run/mesos/isolators/docker/volume"
--enforce_container_disk_quota="false" --executor_registration_timeout="1mins" --executor_reregistration_timeout="2secs"
--executor_shutdown_grace_period="5secs" --fetcher_cache_dir="/tmp/Endpoint_SlaveEndpointTest_NoAuthorizer_0_QrArFV/fetch"
--fetcher_cache_size="2GB" --frameworks_home="" --gc_delay="1weeks" --gc_disk_headroom="0.1"
--hadoop_home="" --help="false" --hostname_lookup="true" --http_command_executor="false" --http_credentials="/tmp/Endpoint_SlaveEndpointTest_NoAuthorizer_0_QrArFV/http_credentials"
--http_heartbeat_interval="30secs" --initialize_driver_logging="true" --isolation="posix/cpu,posix/mem"
--launcher="posix" --launcher_dir="/mesos/mesos-1.5.0/_build/src" --logbufsecs="0" --logging_level="INFO"
--max_completed_executors_per_framework="150" --oversubscribed_resources_interval="15secs"
--perf_duration="10secs" --perf_interval="1mins" --port="5051" --qos_correction_interval_min="0ns"
--quiet="false" --recover="reconnect" --recovery_timeout="15mins" --registration_backoff_factor="10ms"
--resources="cpus:2;gpus:0;mem:1024;disk:1024;ports:[31000-32000]" --revocable_cpu_low_priority="true"
--runtime_dir="/tmp/Endpoint_SlaveEndpointTest_NoAuthorizer_0_QrArFV" --sandbox_directory="/mnt/mesos/sandbox"
--strict="true" --switch_user="true" --systemd_enable_support="true" --systemd_runtime_directory="/run/systemd/system"
--version="false" --work_dir="/tmp/Endpoint_SlaveEndpointTest_NoAuthorizer_0_ztOeyJ" --zk_session_timeout="10secs"
I0904 20:04:11.214457  5809 credentials.hpp:86] Loading credential for authentication from
'/tmp/Endpoint_SlaveEndpointTest_NoAuthorizer_0_QrArFV/credential'
I0904 20:04:11.214690  5809 slave.cpp:285] Agent using credential for: test-principal
I0904 20:04:11.214716  5809 credentials.hpp:37] Loading credentials for authentication from
'/tmp/Endpoint_SlaveEndpointTest_NoAuthorizer_0_QrArFV/http_credentials'
I0904 20:04:11.215047  5809 http.cpp:1045] Creating default 'basic' HTTP authenticator for
realm 'mesos-agent-readonly'
I0904 20:04:11.215255  5809 http.cpp:1045] Creating default 'basic' HTTP authenticator for
realm 'mesos-agent-readwrite'
I0904 20:04:11.217424  5809 slave.cpp:581] Agent resources: [{"name":"cpus","scalar":{"value":2.0},"type":"SCALAR"},{"name":"mem","scalar":{"value":1024.0},"type":"SCALAR"},{"name":"disk","scalar":{"value":1024.0},"type":"SCALAR"},{"name":"ports","ranges":{"range":[{"begin":31000,"end":32000}]},"type":"RANGES"}]
I0904 20:04:11.217809  5809 slave.cpp:589] Agent attributes: [  ]
I0904 20:04:11.217850  5809 slave.cpp:598] Agent hostname: d321ae4f73e1
I0904 20:04:11.218019  5797 status_update_manager.cpp:177] Pausing sending status updates
I0904 20:04:11.220017  5801 state.cpp:64] Recovering state from '/tmp/Endpoint_SlaveEndpointTest_NoAuthorizer_0_ztOeyJ/meta'
I0904 20:04:11.220381  5796 status_update_manager.cpp:203] Recovering status update manager
I0904 20:04:11.220604  5803 containerizer.cpp:646] Recovering containerizer
I0904 20:04:11.222781  5805 provisioner.cpp:416] Provisioner recovery complete
I0904 20:04:11.223161  5813 slave.cpp:6296] Finished recovery
I0904 20:04:11.223708  5813 slave.cpp:6478] Querying resource estimator for oversubscribable
resources
I0904 20:04:11.224056  5811 slave.cpp:6492] Received oversubscribable resources {} from the
resource estimator
I0904 20:04:11.228070  5794 process.cpp:3954] Handling HTTP event for process 'slave(814)'
with path: '/slave(814)/monitor/statistics'
I0904 20:04:11.229517  5813 http.cpp:1185] HTTP GET for /slave(814)/monitor/statistics from
172.17.0.7:35346
I0904 20:04:11.229599  5813 http.cpp:976] Authorizing principal 'test-principal' to GET the
'/monitor/statistics' endpoint
I0904 20:04:11.233680  5808 slave.cpp:859] Agent terminating
[       OK ] Endpoint/SlaveEndpointTest.NoAuthorizer/0 (40 ms)
[ RUN      ] Endpoint/SlaveEndpointTest.NoAuthorizer/1
I0904 20:04:11.246985  5773 containerizer.cpp:290] Using isolation { environment_secret, posix/cpu,
posix/mem, filesystem/posix, network/cni }
W0904 20:04:11.247532  5773 backend.cpp:76] Failed to create 'aufs' backend: AufsBackend requires
root privileges
W0904 20:04:11.247673  5773 backend.cpp:76] Failed to create 'bind' backend: BindBackend requires
root privileges
I0904 20:04:11.247707  5773 provisioner.cpp:255] Using default backend 'copy'
I0904 20:04:11.249449  5773 cluster.cpp:448] Creating default 'local' authorizer
I0904 20:04:11.251446  5794 slave.cpp:252] Mesos agent started on (815)@172.17.0.7:38794
I0904 20:04:11.251471  5794 slave.cpp:253] Flags at startup: --acls="" --appc_simple_discovery_uri_prefix="http://"
--appc_store_dir="/tmp/Endpoint_SlaveEndpointTest_NoAuthorizer_1_aidIsI/store/appc" --authenticate_http_readonly="true"
--authenticate_http_readwrite="true" --authenticatee="crammd5" --authentication_backoff_factor="1secs"
--authorizer="local" --cgroups_cpu_enable_pids_and_tids_count="false" --cgroups_enable_cfs="false"
--cgroups_hierarchy="/sys/fs/cgroup" --cgroups_limit_swap="false" --cgroups_root="mesos" --container_disk_watch_interval="15secs"
--containerizers="mesos" --credential="/tmp/Endpoint_SlaveEndpointTest_NoAuthorizer_1_aidIsI/credential"
--default_role="*" --disallow_sharing_agent_pid_namespace="false" --disk_watch_interval="1mins"
--docker="docker" --docker_kill_orphans="true" --docker_registry="https://registry-1.docker.io"
--docker_remove_delay="6hrs" --docker_socket="/var/run/docker.sock" --docker_stop_timeout="0ns"
--docker_store_dir="/tmp/Endpoint_SlaveEndpointTest_NoAuthorizer_1_aidIsI/store/docker" --docker_volume_checkpoint_dir="/var/run/mesos/isolators/docker/volume"
--enforce_container_disk_quota="false" --executor_registration_timeout="1mins" --executor_reregistration_timeout="2secs"
--executor_shutdown_grace_period="5secs" --fetcher_cache_dir="/tmp/Endpoint_SlaveEndpointTest_NoAuthorizer_1_aidIsI/fetch"
--fetcher_cache_size="2GB" --frameworks_home="" --gc_delay="1weeks" --gc_disk_headroom="0.1"
--hadoop_home="" --help="false" --hostname_lookup="true" --http_command_executor="false" --http_credentials="/tmp/Endpoint_SlaveEndpointTest_NoAuthorizer_1_aidIsI/http_credentials"
--http_heartbeat_interval="30secs" --initialize_driver_logging="true" --isolation="posix/cpu,posix/mem"
--launcher="posix" --launcher_dir="/mesos/mesos-1.5.0/_build/src" --logbufsecs="0" --logging_level="INFO"
--max_completed_executors_per_framework="150" --oversubscribed_resources_interval="15secs"
--perf_duration="10secs" --perf_interval="1mins" --port="5051" --qos_correction_interval_min="0ns"
--quiet="false" --recover="reconnect" --recovery_timeout="15mins" --registration_backoff_factor="10ms"
--resources="cpus:2;gpus:0;mem:1024;disk:1024;ports:[31000-32000]" --revocable_cpu_low_priority="true"
--runtime_dir="/tmp/Endpoint_SlaveEndpointTest_NoAuthorizer_1_aidIsI" --sandbox_directory="/mnt/mesos/sandbox"
--strict="true" --switch_user="true" --systemd_enable_support="true" --systemd_runtime_directory="/run/systemd/system"
--version="false" --work_dir="/tmp/Endpoint_SlaveEndpointTest_NoAuthorizer_1_9lWxfw" --zk_session_timeout="10secs"
I0904 20:04:11.251874  5794 credentials.hpp:86] Loading credential for authentication from
'/tmp/Endpoint_SlaveEndpointTest_NoAuthorizer_1_aidIsI/credential'
I0904 20:04:11.252069  5794 slave.cpp:285] Agent using credential for: test-principal
I0904 20:04:11.252092  5794 credentials.hpp:37] Loading credentials for authentication from
'/tmp/Endpoint_SlaveEndpointTest_NoAuthorizer_1_aidIsI/http_credentials'
I0904 20:04:11.252346  5794 http.cpp:1045] Creating default 'basic' HTTP authenticator for
realm 'mesos-agent-readonly'
I0904 20:04:11.252527  5794 http.cpp:1045] Creating default 'basic' HTTP authenticator for
realm 'mesos-agent-readwrite'
I0904 20:04:11.253999  5794 slave.cpp:581] Agent resources: [{"name":"cpus","scalar":{"value":2.0},"type":"SCALAR"},{"name":"mem","scalar":{"value":1024.0},"type":"SCALAR"},{"name":"disk","scalar":{"value":1024.0},"type":"SCALAR"},{"name":"ports","ranges":{"range":[{"begin":31000,"end":32000}]},"type":"RANGES"}]
I0904 20:04:11.254233  5794 slave.cpp:589] Agent attributes: [  ]
I0904 20:04:11.254246  5794 slave.cpp:598] Agent hostname: d321ae4f73e1
I0904 20:04:11.254396  5808 status_update_manager.cpp:177] Pausing sending status updates
I0904 20:04:11.255914  5802 state.cpp:64] Recovering state from '/tmp/Endpoint_SlaveEndpointTest_NoAuthorizer_1_9lWxfw/meta'
I0904 20:04:11.256340  5812 status_update_manager.cpp:203] Recovering status update manager
I0904 20:04:11.256551  5806 containerizer.cpp:646] Recovering containerizer
I0904 20:04:11.258024  5798 provisioner.cpp:416] Provisioner recovery complete
I0904 20:04:11.258358  5807 slave.cpp:6296] Finished recovery
I0904 20:04:11.258925  5807 slave.cpp:6478] Querying resource estimator for oversubscribable
resources
I0904 20:04:11.259241  5803 slave.cpp:6492] Received oversubscribable resources {} from the
resource estimator
I0904 20:04:11.262182  5792 process.cpp:3954] Handling HTTP event for process 'slave(815)'
with path: '/slave(815)/monitor/statistics.json'
I0904 20:04:11.263450  5802 http.cpp:1185] HTTP GET for /slave(815)/monitor/statistics.json
from 172.17.0.7:35348
I0904 20:04:11.263523  5802 http.cpp:976] Authorizing principal 'test-principal' to GET the
'/monitor/statistics.json' endpoint
I0904 20:04:11.266903  5773 slave.cpp:859] Agent terminating
[       OK ] Endpoint/SlaveEndpointTest.NoAuthorizer/1 (31 ms)
[ RUN      ] Endpoint/SlaveEndpointTest.NoAuthorizer/2
I0904 20:04:11.277838  5773 containerizer.cpp:290] Using isolation { environment_secret, posix/cpu,
posix/mem, filesystem/posix, network/cni }
W0904 20:04:11.278321  5773 backend.cpp:76] Failed to create 'aufs' backend: AufsBackend requires
root privileges
W0904 20:04:11.278426  5773 backend.cpp:76] Failed to create 'bind' backend: BindBackend requires
root privileges
I0904 20:04:11.278457  5773 provisioner.cpp:255] Using default backend 'copy'
I0904 20:04:11.280040  5773 cluster.cpp:448] Creating default 'local' authorizer
I0904 20:04:11.281872  5793 slave.cpp:252] Mesos agent started on (816)@172.17.0.7:38794
I0904 20:04:11.281904  5793 slave.cpp:253] Flags at startup: --acls="" --appc_simple_discovery_uri_prefix="http://"
--appc_store_dir="/tmp/Endpoint_SlaveEndpointTest_NoAuthorizer_2_ES1czv/store/appc" --authenticate_http_readonly="true"
--authenticate_http_readwrite="true" --authenticatee="crammd5" --authentication_backoff_factor="1secs"
--authorizer="local" --cgroups_cpu_enable_pids_and_tids_count="false" --cgroups_enable_cfs="false"
--cgroups_hierarchy="/sys/fs/cgroup" --cgroups_limit_swap="false" --cgroups_root="mesos" --container_disk_watch_interval="15secs"
--containerizers="mesos" --credential="/tmp/Endpoint_SlaveEndpointTest_NoAuthorizer_2_ES1czv/credential"
--default_role="*" --disallow_sharing_agent_pid_namespace="false" --disk_watch_interval="1mins"
--docker="docker" --docker_kill_orphans="true" --docker_registry="https://registry-1.docker.io"
--docker_remove_delay="6hrs" --docker_socket="/var/run/docker.sock" --docker_stop_timeout="0ns"
--docker_store_dir="/tmp/Endpoint_SlaveEndpointTest_NoAuthorizer_2_ES1czv/store/docker" --docker_volume_checkpoint_dir="/var/run/mesos/isolators/docker/volume"
--enforce_container_disk_quota="false" --executor_registration_timeout="1mins" --executor_reregistration_timeout="2secs"
--executor_shutdown_grace_period="5secs" --fetcher_cache_dir="/tmp/Endpoint_SlaveEndpointTest_NoAuthorizer_2_ES1czv/fetch"
--fetcher_cache_size="2GB" --frameworks_home="" --gc_delay="1weeks" --gc_disk_headroom="0.1"
--hadoop_home="" --help="false" --hostname_lookup="true" --http_command_executor="false" --http_credentials="/tmp/Endpoint_SlaveEndpointTest_NoAuthorizer_2_ES1czv/http_credentials"
--http_heartbeat_interval="30secs" --initialize_driver_logging="true" --isolation="posix/cpu,posix/mem"
--launcher="posix" --launcher_dir="/mesos/mesos-1.5.0/_build/src" --logbufsecs="0" --logging_level="INFO"
--max_completed_executors_per_framework="150" --oversubscribed_resources_interval="15secs"
--perf_duration="10secs" --perf_interval="1mins" --port="5051" --qos_correction_interval_min="0ns"
--quiet="false" --recover="reconnect" --recovery_timeout="15mins" --registration_backoff_factor="10ms"
--resources="cpus:2;gpus:0;mem:1024;disk:1024;ports:[31000-32000]" --revocable_cpu_low_priority="true"
--runtime_dir="/tmp/Endpoint_SlaveEndpointTest_NoAuthorizer_2_ES1czv" --sandbox_directory="/mnt/mesos/sandbox"
--strict="true" --switch_user="true" --systemd_enable_support="true" --systemd_runtime_directory="/run/systemd/system"
--version="false" --work_dir="/tmp/Endpoint_SlaveEndpointTest_NoAuthorizer_2_XB9ohj" --zk_session_timeout="10secs"
I0904 20:04:11.282516  5793 credentials.hpp:86] Loading credential for authentication from
'/tmp/Endpoint_SlaveEndpointTest_NoAuthorizer_2_ES1czv/credential'
I0904 20:04:11.282709  5793 slave.cpp:285] Agent using credential for: test-principal
I0904 20:04:11.282740  5793 credentials.hpp:37] Loading credentials for authentication from
'/tmp/Endpoint_SlaveEndpointTest_NoAuthorizer_2_ES1czv/http_credentials'
I0904 20:04:11.283066  5793 http.cpp:1045] Creating default 'basic' HTTP authenticator for
realm 'mesos-agent-readonly'
I0904 20:04:11.283246  5793 http.cpp:1045] Creating default 'basic' HTTP authenticator for
realm 'mesos-agent-readwrite'
I0904 20:04:11.284564  5793 slave.cpp:581] Agent resources: [{"name":"cpus","scalar":{"value":2.0},"type":"SCALAR"},{"name":"mem","scalar":{"value":1024.0},"type":"SCALAR"},{"name":"disk","scalar":{"value":1024.0},"type":"SCALAR"},{"name":"ports","ranges":{"range":[{"begin":31000,"end":32000}]},"type":"RANGES"}]
I0904 20:04:11.284799  5793 slave.cpp:589] Agent attributes: [  ]
I0904 20:04:11.284813  5793 slave.cpp:598] Agent hostname: d321ae4f73e1
I0904 20:04:11.284958  5807 status_update_manager.cpp:177] Pausing sending status updates
I0904 20:04:11.286244  5809 state.cpp:64] Recovering state from '/tmp/Endpoint_SlaveEndpointTest_NoAuthorizer_2_XB9ohj/meta'
I0904 20:04:11.286532  5803 status_update_manager.cpp:203] Recovering status update manager
I0904 20:04:11.286731  5808 containerizer.cpp:646] Recovering containerizer
I0904 20:04:11.288223  5793 provisioner.cpp:416] Provisioner recovery complete
I0904 20:04:11.288547  5799 slave.cpp:6296] Finished recovery
I0904 20:04:11.289026  5799 slave.cpp:6478] Querying resource estimator for oversubscribable
resources
I0904 20:04:11.289269  5792 slave.cpp:6492] Received oversubscribable resources {} from the
resource estimator
I0904 20:04:11.291435  5797 process.cpp:3954] Handling HTTP event for process 'slave(816)'
with path: '/slave(816)/containers'
I0904 20:04:11.292618  5809 http.cpp:1185] HTTP GET for /slave(816)/containers from 172.17.0.7:35350
I0904 20:04:11.292687  5809 http.cpp:976] Authorizing principal 'test-principal' to GET the
'/containers' endpoint
I0904 20:04:11.296381  5807 slave.cpp:859] Agent terminating
[       OK ] Endpoint/SlaveEndpointTest.NoAuthorizer/2 (29 ms)
[----------] 9 tests from Endpoint/SlaveEndpointTest (323 ms total)

[----------] 2 tests from ContainerizerType/DefaultContainerDNSFlagTest
[ RUN      ] ContainerizerType/DefaultContainerDNSFlagTest.ValidateFlag/0
[       OK ] ContainerizerType/DefaultContainerDNSFlagTest.ValidateFlag/0 (17 ms)
[ RUN      ] ContainerizerType/DefaultContainerDNSFlagTest.ValidateFlag/1
[       OK ] ContainerizerType/DefaultContainerDNSFlagTest.ValidateFlag/1 (16 ms)
[----------] 2 tests from ContainerizerType/DefaultContainerDNSFlagTest (33 ms total)

[----------] Global test environment tear-down
[==========] 1667 tests from 183 test cases ran. (516073 ms total)
[  PASSED  ] 1666 tests.
[  FAILED  ] 1 test, listed below:
[  FAILED  ] ExamplesTest.V0JavaFramework

 1 FAILED TEST
  YOU HAVE 20 DISABLED TESTS

I0904 20:04:11.411423  5816 process.cpp:1072] Failed to accept socket: future discarded
make[4]: *** [check-local] Error 1
make[4]: Leaving directory `/mesos/mesos-1.5.0/_build/src'
make[3]: *** [check-am] Error 2
make[3]: Leaving directory `/mesos/mesos-1.5.0/_build/src'
make[2]: *** [check] Error 2
make[2]: Leaving directory `/mesos/mesos-1.5.0/_build/src'
make[1]: *** [check-recursive] Error 1
make[1]: Leaving directory `/mesos/mesos-1.5.0/_build'
make: *** [distcheck] Error 1
+ docker rmi mesos-1504552309-16052
Untagged: mesos-1504552309-16052:latest
Deleted: sha256:26ffe96abb23e66252c7c6cfbde630e45dd2cc8edc4624ad035ea2e1501bdc72
Deleted: sha256:29cc9873e24839998dea935cdc5e1a53b90c5b23ee474bbf6b47a1d561fae692
Deleted: sha256:e1596c7206e7a2e738e4a8ab6ec38c34344d4391865b0bd2d0e082346ff55b7d
Deleted: sha256:60515c633c1a78351c511be82a56a233acce33fea399fcdf9d30425f48fd35b5
Deleted: sha256:30864a4138d6285f25302e13ad5bfca496713421a563dea0056ab2edcbfff078
Deleted: sha256:55d37bdf24f8b52e3dcad6d41de1d5bf9abd16e3fce3c1e6cac9415fad59b8e7
Deleted: sha256:5a7536d707f65d075bb2abff819c591df86ba3d43a659769cca5053c928bc1c4
Deleted: sha256:6641bba165cb0f46fde7658fa52852752362264e9376d883836a62f8a4a38f4a
Deleted: sha256:06f8f22fe84612fa4eae4f45f3718d18ef3e7fc8e0202bd53ab784847de9ebd2
Deleted: sha256:53d92d1f6077eb60989a6c63d713a2a603c81cab2b4fdf7cb694392c8753e4ac
Deleted: sha256:dc20076dec0e2be75170cf8cbf30526349427eaa4a367ba20054135f933cf2ed
Deleted: sha256:18ff92f676da78e54fc999a4825671eb53b0d706544379c1a893cefa551af721
Deleted: sha256:c858a62fef4d2608bc13b3c8f8ad7b478ccc77f907e7b9533afef9b33f54edaa
Deleted: sha256:5188c92571e0d43f5f0517f9ae24dc669c8fbe351d23c7843478a14df95a7ee9
Deleted: sha256:0159520a39a2f3f31251c6acfca36b4ab199589beca64e2a35df2f37114dd7a2
Deleted: sha256:3a75ac72e6c5bcd3e509f73724b93ebbc82876dfe8578de782f311c639057d86
Deleted: sha256:eeb915ba591055d3eaebd70c5cdc9af935a8f09fc30c09d7f70a37ec6aa73316
Deleted: sha256:e280b29cb4e471a9fff3981e3fd7b4b281ed543e9725b87454e5e1f738785102
Deleted: sha256:e6492e4292b93454436eed612a5acd758a45e6afc55ada3ab7561ab816538991
Deleted: sha256:4ac7f12552b32ef418617007fe64ab2607c70939aaadbd8c4853fcc3407106c4
Deleted: sha256:9e7de3a2aaed56b2cceefb9854adf6fab4b0ed85faf8a4162eb0f6860691a4ed
Deleted: sha256:c9743d15ae913de17193b4b50e9ed5d956c898633913809b03511e6528116aba
Deleted: sha256:91a6b8b526cdd2c4dffe9217be855fa23537a8d3966029bcb5116ca54bf359ea
Deleted: sha256:d91e891f7b254bf551f5279007051f36749500acd88d2f482c4fcba96762fba2
Build step 'Execute shell' marked build as failure

Mime
View raw message