mesos-builds mailing list archives

Site index · List index
Message view « Date » · « Thread »
Top « Date » · « Thread »
From Apache Jenkins Server <jenk...@builds.apache.org>
Subject Build failed in Jenkins: Mesos-Buildbot » autotools,clang,--verbose,GLOG_v=1 MESOS_VERBOSE=1,ubuntu:14.04,(ubuntu)&&(!ubuntu-us1)&&(!ubuntu-eu2)&&(!qnode3)&&(!H23) #4241
Date Tue, 19 Sep 2017 23:02:01 GMT
See <https://builds.apache.org/job/Mesos-Buildbot/BUILDTOOL=autotools,COMPILER=clang,CONFIGURATION=--verbose,ENVIRONMENT=GLOG_v=1%20MESOS_VERBOSE=1,OS=ubuntu%3A14.04,label_exp=(ubuntu)&&(!ubuntu-us1)&&(!ubuntu-eu2)&&(!qnode3)&&(!H23)/4241/display/redirect?page=changes>

Changes:

[yujie.jay] Added index in the container volume doc.

------------------------------------------
[...truncated 31.45 MB...]
I0919 23:01:30.611310  3900 http.cpp:1045] Creating default 'basic' HTTP authenticator for
realm 'mesos-agent-readwrite'
I0919 23:01:30.613023  3900 slave.cpp:583] Agent resources: [{"name":"cpus","scalar":{"value":2.0},"type":"SCALAR"},{"name":"mem","scalar":{"value":1024.0},"type":"SCALAR"},{"name":"disk","scalar":{"value":1024.0},"type":"SCALAR"},{"name":"ports","ranges":{"range":[{"begin":31000,"end":32000}]},"type":"RANGES"}]
I0919 23:01:30.613306  3900 slave.cpp:591] Agent attributes: [  ]
I0919 23:01:30.613333  3900 slave.cpp:600] Agent hostname: 6cba1c4c6495
I0919 23:01:30.613577  3908 status_update_manager.cpp:177] Pausing sending status updates
I0919 23:01:30.615334  3903 state.cpp:64] Recovering state from '/tmp/Endpoint_SlaveEndpointTest_AuthorizedRequest_2_M4cfu9/meta'
I0919 23:01:30.615667  3897 status_update_manager.cpp:203] Recovering status update manager
I0919 23:01:30.615916  3902 containerizer.cpp:648] Recovering containerizer
I0919 23:01:30.617456  3904 provisioner.cpp:416] Provisioner recovery complete
I0919 23:01:30.617822  3903 slave.cpp:6298] Finished recovery
I0919 23:01:30.618327  3903 slave.cpp:6480] Querying resource estimator for oversubscribable
resources
I0919 23:01:30.618571  3901 slave.cpp:6494] Received oversubscribable resources {} from the
resource estimator
I0919 23:01:30.621273  3893 process.cpp:3929] Handling HTTP event for process 'slave(810)'
with path: '/slave(810)/containers'
I0919 23:01:30.622856  3908 http.cpp:1185] HTTP GET for /slave(810)/containers from 172.17.0.2:56116
I0919 23:01:30.622937  3908 http.cpp:976] Authorizing principal 'test-principal' to GET the
'/containers' endpoint
I0919 23:01:30.627066  3875 slave.cpp:861] Agent terminating
[       OK ] Endpoint/SlaveEndpointTest.AuthorizedRequest/2 (36 ms)
[ RUN      ] Endpoint/SlaveEndpointTest.UnauthorizedRequest/0
I0919 23:01:30.640019  3875 containerizer.cpp:292] Using isolation { environment_secret, posix/cpu,
posix/mem, filesystem/posix, network/cni }
W0919 23:01:30.640451  3875 backend.cpp:76] Failed to create 'aufs' backend: AufsBackend requires
root privileges
W0919 23:01:30.640554  3875 backend.cpp:76] Failed to create 'bind' backend: BindBackend requires
root privileges
I0919 23:01:30.640585  3875 provisioner.cpp:255] Using default backend 'copy'
I0919 23:01:30.643592  3903 slave.cpp:252] Mesos agent started on (811)@172.17.0.2:33545
I0919 23:01:30.643626  3903 slave.cpp:253] Flags at startup: --acls="" --appc_simple_discovery_uri_prefix="http://"
--appc_store_dir="/tmp/Endpoint_SlaveEndpointTest_UnauthorizedRequest_0_LWn9mA/store/appc"
--authenticate_http_readonly="true" --authenticate_http_readwrite="true" --authenticatee="crammd5"
--authentication_backoff_factor="1secs" --authorizer="local" --cgroups_cpu_enable_pids_and_tids_count="false"
--cgroups_enable_cfs="false" --cgroups_hierarchy="/sys/fs/cgroup" --cgroups_limit_swap="false"
--cgroups_root="mesos" --container_disk_watch_interval="15secs" --containerizers="mesos" --credential="/tmp/Endpoint_SlaveEndpointTest_UnauthorizedRequest_0_LWn9mA/credential"
--default_role="*" --disallow_sharing_agent_pid_namespace="false" --disk_watch_interval="1mins"
--docker="docker" --docker_kill_orphans="true" --docker_registry="https://registry-1.docker.io"
--docker_remove_delay="6hrs" --docker_socket="/var/run/docker.sock" --docker_stop_timeout="0ns"
--docker_store_dir="/tmp/Endpoint_SlaveEndpointTest_UnauthorizedRequest_0_LWn9mA/store/docker"
--docker_volume_checkpoint_dir="/var/run/mesos/isolators/docker/volume" --enforce_container_disk_quota="false"
--executor_registration_timeout="1mins" --executor_reregistration_timeout="2secs" --executor_shutdown_grace_period="5secs"
--fetcher_cache_dir="/tmp/Endpoint_SlaveEndpointTest_UnauthorizedRequest_0_LWn9mA/fetch" --fetcher_cache_size="2GB"
--frameworks_home="" --gc_delay="1weeks" --gc_disk_headroom="0.1" --hadoop_home="" --help="false"
--hostname_lookup="true" --http_command_executor="false" --http_credentials="/tmp/Endpoint_SlaveEndpointTest_UnauthorizedRequest_0_LWn9mA/http_credentials"
--http_heartbeat_interval="30secs" --initialize_driver_logging="true" --isolation="posix/cpu,posix/mem"
--launcher="posix" --launcher_dir="/mesos/mesos-1.5.0/_build/src" --logbufsecs="0" --logging_level="INFO"
--max_completed_executors_per_framework="150" --oversubscribed_resources_interval="15secs"
--perf_duration="10secs" --perf_interval="1mins" --port="5051" --qos_correction_interval_min="0ns"
--quiet="false" --recover="reconnect" --recovery_timeout="15mins" --registration_backoff_factor="10ms"
--resources="cpus:2;gpus:0;mem:1024;disk:1024;ports:[31000-32000]" --revocable_cpu_low_priority="true"
--runtime_dir="/tmp/Endpoint_SlaveEndpointTest_UnauthorizedRequest_0_LWn9mA" --sandbox_directory="/mnt/mesos/sandbox"
--strict="true" --switch_user="true" --systemd_enable_support="true" --systemd_runtime_directory="/run/systemd/system"
--version="false" --work_dir="/tmp/Endpoint_SlaveEndpointTest_UnauthorizedRequest_0_yutSXu"
--zk_session_timeout="10secs"
I0919 23:01:30.644034  3903 credentials.hpp:86] Loading credential for authentication from
'/tmp/Endpoint_SlaveEndpointTest_UnauthorizedRequest_0_LWn9mA/credential'
I0919 23:01:30.644191  3903 slave.cpp:285] Agent using credential for: test-principal
I0919 23:01:30.644217  3903 credentials.hpp:37] Loading credentials for authentication from
'/tmp/Endpoint_SlaveEndpointTest_UnauthorizedRequest_0_LWn9mA/http_credentials'
I0919 23:01:30.644454  3903 http.cpp:1045] Creating default 'basic' HTTP authenticator for
realm 'mesos-agent-readonly'
I0919 23:01:30.644616  3903 http.cpp:1045] Creating default 'basic' HTTP authenticator for
realm 'mesos-agent-readwrite'
I0919 23:01:30.645903  3903 slave.cpp:583] Agent resources: [{"name":"cpus","scalar":{"value":2.0},"type":"SCALAR"},{"name":"mem","scalar":{"value":1024.0},"type":"SCALAR"},{"name":"disk","scalar":{"value":1024.0},"type":"SCALAR"},{"name":"ports","ranges":{"range":[{"begin":31000,"end":32000}]},"type":"RANGES"}]
I0919 23:01:30.646101  3903 slave.cpp:591] Agent attributes: [  ]
I0919 23:01:30.646121  3903 slave.cpp:600] Agent hostname: 6cba1c4c6495
I0919 23:01:30.646245  3894 status_update_manager.cpp:177] Pausing sending status updates
I0919 23:01:30.647636  3900 state.cpp:64] Recovering state from '/tmp/Endpoint_SlaveEndpointTest_UnauthorizedRequest_0_yutSXu/meta'
I0919 23:01:30.647933  3899 status_update_manager.cpp:203] Recovering status update manager
I0919 23:01:30.648115  3898 containerizer.cpp:648] Recovering containerizer
I0919 23:01:30.649305  3900 provisioner.cpp:416] Provisioner recovery complete
I0919 23:01:30.649711  3899 slave.cpp:6298] Finished recovery
I0919 23:01:30.650357  3899 slave.cpp:6480] Querying resource estimator for oversubscribable
resources
I0919 23:01:30.650655  3898 slave.cpp:6494] Received oversubscribable resources {} from the
resource estimator
I0919 23:01:30.653576  3900 process.cpp:3929] Handling HTTP event for process 'slave(811)'
with path: '/slave(811)/monitor/statistics'
I0919 23:01:30.655057  3897 http.cpp:1185] HTTP GET for /slave(811)/monitor/statistics from
172.17.0.2:56117
I0919 23:01:30.655148  3897 http.cpp:976] Authorizing principal 'test-principal' to GET the
'/monitor/statistics' endpoint
I0919 23:01:30.657697  3875 slave.cpp:861] Agent terminating
[       OK ] Endpoint/SlaveEndpointTest.UnauthorizedRequest/0 (31 ms)
[ RUN      ] Endpoint/SlaveEndpointTest.UnauthorizedRequest/1
I0919 23:01:30.672112  3875 containerizer.cpp:292] Using isolation { environment_secret, posix/cpu,
posix/mem, filesystem/posix, network/cni }
W0919 23:01:30.672719  3875 backend.cpp:76] Failed to create 'aufs' backend: AufsBackend requires
root privileges
W0919 23:01:30.672889  3875 backend.cpp:76] Failed to create 'bind' backend: BindBackend requires
root privileges
I0919 23:01:30.672935  3875 provisioner.cpp:255] Using default backend 'copy'
I0919 23:01:30.676407  3900 slave.cpp:252] Mesos agent started on (812)@172.17.0.2:33545
I0919 23:01:30.676447  3900 slave.cpp:253] Flags at startup: --acls="" --appc_simple_discovery_uri_prefix="http://"
--appc_store_dir="/tmp/Endpoint_SlaveEndpointTest_UnauthorizedRequest_1_7G70gW/store/appc"
--authenticate_http_readonly="true" --authenticate_http_readwrite="true" --authenticatee="crammd5"
--authentication_backoff_factor="1secs" --authorizer="local" --cgroups_cpu_enable_pids_and_tids_count="false"
--cgroups_enable_cfs="false" --cgroups_hierarchy="/sys/fs/cgroup" --cgroups_limit_swap="false"
--cgroups_root="mesos" --container_disk_watch_interval="15secs" --containerizers="mesos" --credential="/tmp/Endpoint_SlaveEndpointTest_UnauthorizedRequest_1_7G70gW/credential"
--default_role="*" --disallow_sharing_agent_pid_namespace="false" --disk_watch_interval="1mins"
--docker="docker" --docker_kill_orphans="true" --docker_registry="https://registry-1.docker.io"
--docker_remove_delay="6hrs" --docker_socket="/var/run/docker.sock" --docker_stop_timeout="0ns"
--docker_store_dir="/tmp/Endpoint_SlaveEndpointTest_UnauthorizedRequest_1_7G70gW/store/docker"
--docker_volume_checkpoint_dir="/var/run/mesos/isolators/docker/volume" --enforce_container_disk_quota="false"
--executor_registration_timeout="1mins" --executor_reregistration_timeout="2secs" --executor_shutdown_grace_period="5secs"
--fetcher_cache_dir="/tmp/Endpoint_SlaveEndpointTest_UnauthorizedRequest_1_7G70gW/fetch" --fetcher_cache_size="2GB"
--frameworks_home="" --gc_delay="1weeks" --gc_disk_headroom="0.1" --hadoop_home="" --help="false"
--hostname_lookup="true" --http_command_executor="false" --http_credentials="/tmp/Endpoint_SlaveEndpointTest_UnauthorizedRequest_1_7G70gW/http_credentials"
--http_heartbeat_interval="30secs" --initialize_driver_logging="true" --isolation="posix/cpu,posix/mem"
--launcher="posix" --launcher_dir="/mesos/mesos-1.5.0/_build/src" --logbufsecs="0" --logging_level="INFO"
--max_completed_executors_per_framework="150" --oversubscribed_resources_interval="15secs"
--perf_duration="10secs" --perf_interval="1mins" --port="5051" --qos_correction_interval_min="0ns"
--quiet="false" --recover="reconnect" --recovery_timeout="15mins" --registration_backoff_factor="10ms"
--resources="cpus:2;gpus:0;mem:1024;disk:1024;ports:[31000-32000]" --revocable_cpu_low_priority="true"
--runtime_dir="/tmp/Endpoint_SlaveEndpointTest_UnauthorizedRequest_1_7G70gW" --sandbox_directory="/mnt/mesos/sandbox"
--strict="true" --switch_user="true" --systemd_enable_support="true" --systemd_runtime_directory="/run/systemd/system"
--version="false" --work_dir="/tmp/Endpoint_SlaveEndpointTest_UnauthorizedRequest_1_UgbGMQ"
--zk_session_timeout="10secs"
I0919 23:01:30.677170  3900 credentials.hpp:86] Loading credential for authentication from
'/tmp/Endpoint_SlaveEndpointTest_UnauthorizedRequest_1_7G70gW/credential'
I0919 23:01:30.677412  3900 slave.cpp:285] Agent using credential for: test-principal
I0919 23:01:30.677451  3900 credentials.hpp:37] Loading credentials for authentication from
'/tmp/Endpoint_SlaveEndpointTest_UnauthorizedRequest_1_7G70gW/http_credentials'
I0919 23:01:30.677779  3900 http.cpp:1045] Creating default 'basic' HTTP authenticator for
realm 'mesos-agent-readonly'
I0919 23:01:30.677958  3900 http.cpp:1045] Creating default 'basic' HTTP authenticator for
realm 'mesos-agent-readwrite'
I0919 23:01:30.679224  3900 slave.cpp:583] Agent resources: [{"name":"cpus","scalar":{"value":2.0},"type":"SCALAR"},{"name":"mem","scalar":{"value":1024.0},"type":"SCALAR"},{"name":"disk","scalar":{"value":1024.0},"type":"SCALAR"},{"name":"ports","ranges":{"range":[{"begin":31000,"end":32000}]},"type":"RANGES"}]
I0919 23:01:30.679471  3900 slave.cpp:591] Agent attributes: [  ]
I0919 23:01:30.679498  3900 slave.cpp:600] Agent hostname: 6cba1c4c6495
I0919 23:01:30.679666  3901 status_update_manager.cpp:177] Pausing sending status updates
I0919 23:01:30.681291  3895 state.cpp:64] Recovering state from '/tmp/Endpoint_SlaveEndpointTest_UnauthorizedRequest_1_UgbGMQ/meta'
I0919 23:01:30.681752  3899 status_update_manager.cpp:203] Recovering status update manager
I0919 23:01:30.681993  3906 containerizer.cpp:648] Recovering containerizer
I0919 23:01:30.683401  3905 provisioner.cpp:416] Provisioner recovery complete
I0919 23:01:30.683851  3899 slave.cpp:6298] Finished recovery
I0919 23:01:30.684361  3899 slave.cpp:6480] Querying resource estimator for oversubscribable
resources
I0919 23:01:30.684579  3901 slave.cpp:6494] Received oversubscribable resources {} from the
resource estimator
I0919 23:01:30.687259  3905 process.cpp:3929] Handling HTTP event for process 'slave(812)'
with path: '/slave(812)/monitor/statistics.json'
I0919 23:01:30.688678  3899 http.cpp:1185] HTTP GET for /slave(812)/monitor/statistics.json
from 172.17.0.2:56120
I0919 23:01:30.688763  3899 http.cpp:976] Authorizing principal 'test-principal' to GET the
'/monitor/statistics.json' endpoint
I0919 23:01:30.691746  3875 slave.cpp:861] Agent terminating
[       OK ] Endpoint/SlaveEndpointTest.UnauthorizedRequest/1 (34 ms)
[ RUN      ] Endpoint/SlaveEndpointTest.UnauthorizedRequest/2
I0919 23:01:30.704919  3875 containerizer.cpp:292] Using isolation { environment_secret, posix/cpu,
posix/mem, filesystem/posix, network/cni }
W0919 23:01:30.705603  3875 backend.cpp:76] Failed to create 'aufs' backend: AufsBackend requires
root privileges
W0919 23:01:30.705768  3875 backend.cpp:76] Failed to create 'bind' backend: BindBackend requires
root privileges
I0919 23:01:30.705848  3875 provisioner.cpp:255] Using default backend 'copy'
I0919 23:01:30.710109  3898 slave.cpp:252] Mesos agent started on (813)@172.17.0.2:33545
I0919 23:01:30.710151  3898 slave.cpp:253] Flags at startup: --acls="" --appc_simple_discovery_uri_prefix="http://"
--appc_store_dir="/tmp/Endpoint_SlaveEndpointTest_UnauthorizedRequest_2_9fHJwi/store/appc"
--authenticate_http_readonly="true" --authenticate_http_readwrite="true" --authenticatee="crammd5"
--authentication_backoff_factor="1secs" --authorizer="local" --cgroups_cpu_enable_pids_and_tids_count="false"
--cgroups_enable_cfs="false" --cgroups_hierarchy="/sys/fs/cgroup" --cgroups_limit_swap="false"
--cgroups_root="mesos" --container_disk_watch_interval="15secs" --containerizers="mesos" --credential="/tmp/Endpoint_SlaveEndpointTest_UnauthorizedRequest_2_9fHJwi/credential"
--default_role="*" --disallow_sharing_agent_pid_namespace="false" --disk_watch_interval="1mins"
--docker="docker" --docker_kill_orphans="true" --docker_registry="https://registry-1.docker.io"
--docker_remove_delay="6hrs" --docker_socket="/var/run/docker.sock" --docker_stop_timeout="0ns"
--docker_store_dir="/tmp/Endpoint_SlaveEndpointTest_UnauthorizedRequest_2_9fHJwi/store/docker"
--docker_volume_checkpoint_dir="/var/run/mesos/isolators/docker/volume" --enforce_container_disk_quota="false"
--executor_registration_timeout="1mins" --executor_reregistration_timeout="2secs" --executor_shutdown_grace_period="5secs"
--fetcher_cache_dir="/tmp/Endpoint_SlaveEndpointTest_UnauthorizedRequest_2_9fHJwi/fetch" --fetcher_cache_size="2GB"
--frameworks_home="" --gc_delay="1weeks" --gc_disk_headroom="0.1" --hadoop_home="" --help="false"
--hostname_lookup="true" --http_command_executor="false" --http_credentials="/tmp/Endpoint_SlaveEndpointTest_UnauthorizedRequest_2_9fHJwi/http_credentials"
--http_heartbeat_interval="30secs" --initialize_driver_logging="true" --isolation="posix/cpu,posix/mem"
--launcher="posix" --launcher_dir="/mesos/mesos-1.5.0/_build/src" --logbufsecs="0" --logging_level="INFO"
--max_completed_executors_per_framework="150" --oversubscribed_resources_interval="15secs"
--perf_duration="10secs" --perf_interval="1mins" --port="5051" --qos_correction_interval_min="0ns"
--quiet="false" --recover="reconnect" --recovery_timeout="15mins" --registration_backoff_factor="10ms"
--resources="cpus:2;gpus:0;mem:1024;disk:1024;ports:[31000-32000]" --revocable_cpu_low_priority="true"
--runtime_dir="/tmp/Endpoint_SlaveEndpointTest_UnauthorizedRequest_2_9fHJwi" --sandbox_directory="/mnt/mesos/sandbox"
--strict="true" --switch_user="true" --systemd_enable_support="true" --systemd_runtime_directory="/run/systemd/system"
--version="false" --work_dir="/tmp/Endpoint_SlaveEndpointTest_UnauthorizedRequest_2_CYwZWc"
--zk_session_timeout="10secs"
I0919 23:01:30.710741  3898 credentials.hpp:86] Loading credential for authentication from
'/tmp/Endpoint_SlaveEndpointTest_UnauthorizedRequest_2_9fHJwi/credential'
I0919 23:01:30.710970  3898 slave.cpp:285] Agent using credential for: test-principal
I0919 23:01:30.711009  3898 credentials.hpp:37] Loading credentials for authentication from
'/tmp/Endpoint_SlaveEndpointTest_UnauthorizedRequest_2_9fHJwi/http_credentials'
I0919 23:01:30.711374  3898 http.cpp:1045] Creating default 'basic' HTTP authenticator for
realm 'mesos-agent-readonly'
I0919 23:01:30.711529  3898 http.cpp:1045] Creating default 'basic' HTTP authenticator for
realm 'mesos-agent-readwrite'
I0919 23:01:30.712777  3898 slave.cpp:583] Agent resources: [{"name":"cpus","scalar":{"value":2.0},"type":"SCALAR"},{"name":"mem","scalar":{"value":1024.0},"type":"SCALAR"},{"name":"disk","scalar":{"value":1024.0},"type":"SCALAR"},{"name":"ports","ranges":{"range":[{"begin":31000,"end":32000}]},"type":"RANGES"}]
I0919 23:01:30.713002  3898 slave.cpp:591] Agent attributes: [  ]
I0919 23:01:30.713016  3898 slave.cpp:600] Agent hostname: 6cba1c4c6495
I0919 23:01:30.713196  3908 status_update_manager.cpp:177] Pausing sending status updates
I0919 23:01:30.714926  3903 state.cpp:64] Recovering state from '/tmp/Endpoint_SlaveEndpointTest_UnauthorizedRequest_2_CYwZWc/meta'
I0919 23:01:30.715215  3905 status_update_manager.cpp:203] Recovering status update manager
I0919 23:01:30.715481  3897 containerizer.cpp:648] Recovering containerizer
I0919 23:01:30.716977  3903 provisioner.cpp:416] Provisioner recovery complete
I0919 23:01:30.717474  3905 slave.cpp:6298] Finished recovery
I0919 23:01:30.717952  3905 slave.cpp:6480] Querying resource estimator for oversubscribable
resources
I0919 23:01:30.718173  3908 slave.cpp:6494] Received oversubscribable resources {} from the
resource estimator
I0919 23:01:30.720718  3901 process.cpp:3929] Handling HTTP event for process 'slave(813)'
with path: '/slave(813)/containers'
I0919 23:01:30.722271  3896 http.cpp:1185] HTTP GET for /slave(813)/containers from 172.17.0.2:56121
I0919 23:01:30.722362  3896 http.cpp:976] Authorizing principal 'test-principal' to GET the
'/containers' endpoint
I0919 23:01:30.725293  3875 slave.cpp:861] Agent terminating
[       OK ] Endpoint/SlaveEndpointTest.UnauthorizedRequest/2 (33 ms)
[ RUN      ] Endpoint/SlaveEndpointTest.NoAuthorizer/0
I0919 23:01:30.738484  3875 containerizer.cpp:292] Using isolation { environment_secret, posix/cpu,
posix/mem, filesystem/posix, network/cni }
W0919 23:01:30.739037  3875 backend.cpp:76] Failed to create 'aufs' backend: AufsBackend requires
root privileges
W0919 23:01:30.739169  3875 backend.cpp:76] Failed to create 'bind' backend: BindBackend requires
root privileges
I0919 23:01:30.739208  3875 provisioner.cpp:255] Using default backend 'copy'
I0919 23:01:30.741000  3875 cluster.cpp:448] Creating default 'local' authorizer
I0919 23:01:30.743047  3896 slave.cpp:252] Mesos agent started on (814)@172.17.0.2:33545
I0919 23:01:30.743089  3896 slave.cpp:253] Flags at startup: --acls="" --appc_simple_discovery_uri_prefix="http://"
--appc_store_dir="/tmp/Endpoint_SlaveEndpointTest_NoAuthorizer_0_oAd77E/store/appc" --authenticate_http_readonly="true"
--authenticate_http_readwrite="true" --authenticatee="crammd5" --authentication_backoff_factor="1secs"
--authorizer="local" --cgroups_cpu_enable_pids_and_tids_count="false" --cgroups_enable_cfs="false"
--cgroups_hierarchy="/sys/fs/cgroup" --cgroups_limit_swap="false" --cgroups_root="mesos" --container_disk_watch_interval="15secs"
--containerizers="mesos" --credential="/tmp/Endpoint_SlaveEndpointTest_NoAuthorizer_0_oAd77E/credential"
--default_role="*" --disallow_sharing_agent_pid_namespace="false" --disk_watch_interval="1mins"
--docker="docker" --docker_kill_orphans="true" --docker_registry="https://registry-1.docker.io"
--docker_remove_delay="6hrs" --docker_socket="/var/run/docker.sock" --docker_stop_timeout="0ns"
--docker_store_dir="/tmp/Endpoint_SlaveEndpointTest_NoAuthorizer_0_oAd77E/store/docker" --docker_volume_checkpoint_dir="/var/run/mesos/isolators/docker/volume"
--enforce_container_disk_quota="false" --executor_registration_timeout="1mins" --executor_reregistration_timeout="2secs"
--executor_shutdown_grace_period="5secs" --fetcher_cache_dir="/tmp/Endpoint_SlaveEndpointTest_NoAuthorizer_0_oAd77E/fetch"
--fetcher_cache_size="2GB" --frameworks_home="" --gc_delay="1weeks" --gc_disk_headroom="0.1"
--hadoop_home="" --help="false" --hostname_lookup="true" --http_command_executor="false" --http_credentials="/tmp/Endpoint_SlaveEndpointTest_NoAuthorizer_0_oAd77E/http_credentials"
--http_heartbeat_interval="30secs" --initialize_driver_logging="true" --isolation="posix/cpu,posix/mem"
--launcher="posix" --launcher_dir="/mesos/mesos-1.5.0/_build/src" --logbufsecs="0" --logging_level="INFO"
--max_completed_executors_per_framework="150" --oversubscribed_resources_interval="15secs"
--perf_duration="10secs" --perf_interval="1mins" --port="5051" --qos_correction_interval_min="0ns"
--quiet="false" --recover="reconnect" --recovery_timeout="15mins" --registration_backoff_factor="10ms"
--resources="cpus:2;gpus:0;mem:1024;disk:1024;ports:[31000-32000]" --revocable_cpu_low_priority="true"
--runtime_dir="/tmp/Endpoint_SlaveEndpointTest_NoAuthorizer_0_oAd77E" --sandbox_directory="/mnt/mesos/sandbox"
--strict="true" --switch_user="true" --systemd_enable_support="true" --systemd_runtime_directory="/run/systemd/system"
--version="false" --work_dir="/tmp/Endpoint_SlaveEndpointTest_NoAuthorizer_0_yuJXsz" --zk_session_timeout="10secs"
I0919 23:01:30.743494  3896 credentials.hpp:86] Loading credential for authentication from
'/tmp/Endpoint_SlaveEndpointTest_NoAuthorizer_0_oAd77E/credential'
I0919 23:01:30.743695  3896 slave.cpp:285] Agent using credential for: test-principal
I0919 23:01:30.743726  3896 credentials.hpp:37] Loading credentials for authentication from
'/tmp/Endpoint_SlaveEndpointTest_NoAuthorizer_0_oAd77E/http_credentials'
I0919 23:01:30.744048  3896 http.cpp:1045] Creating default 'basic' HTTP authenticator for
realm 'mesos-agent-readonly'
I0919 23:01:30.744252  3896 http.cpp:1045] Creating default 'basic' HTTP authenticator for
realm 'mesos-agent-readwrite'
I0919 23:01:30.745805  3896 slave.cpp:583] Agent resources: [{"name":"cpus","scalar":{"value":2.0},"type":"SCALAR"},{"name":"mem","scalar":{"value":1024.0},"type":"SCALAR"},{"name":"disk","scalar":{"value":1024.0},"type":"SCALAR"},{"name":"ports","ranges":{"range":[{"begin":31000,"end":32000}]},"type":"RANGES"}]
I0919 23:01:30.746052  3896 slave.cpp:591] Agent attributes: [  ]
I0919 23:01:30.746073  3896 slave.cpp:600] Agent hostname: 6cba1c4c6495
I0919 23:01:30.746222  3908 status_update_manager.cpp:177] Pausing sending status updates
I0919 23:01:30.747872  3894 state.cpp:64] Recovering state from '/tmp/Endpoint_SlaveEndpointTest_NoAuthorizer_0_yuJXsz/meta'
I0919 23:01:30.748261  3905 status_update_manager.cpp:203] Recovering status update manager
I0919 23:01:30.748508  3897 containerizer.cpp:648] Recovering containerizer
I0919 23:01:30.749872  3894 provisioner.cpp:416] Provisioner recovery complete
I0919 23:01:30.750239  3895 slave.cpp:6298] Finished recovery
I0919 23:01:30.750861  3895 slave.cpp:6480] Querying resource estimator for oversubscribable
resources
I0919 23:01:30.751173  3900 slave.cpp:6494] Received oversubscribable resources {} from the
resource estimator
I0919 23:01:30.753852  3901 process.cpp:3929] Handling HTTP event for process 'slave(814)'
with path: '/slave(814)/monitor/statistics'
I0919 23:01:30.755174  3903 http.cpp:1185] HTTP GET for /slave(814)/monitor/statistics from
172.17.0.2:56122
I0919 23:01:30.755256  3903 http.cpp:976] Authorizing principal 'test-principal' to GET the
'/monitor/statistics' endpoint
I0919 23:01:30.758317  3907 slave.cpp:861] Agent terminating
[       OK ] Endpoint/SlaveEndpointTest.NoAuthorizer/0 (33 ms)
[ RUN      ] Endpoint/SlaveEndpointTest.NoAuthorizer/1
I0919 23:01:30.772775  3875 containerizer.cpp:292] Using isolation { environment_secret, posix/cpu,
posix/mem, filesystem/posix, network/cni }
W0919 23:01:30.773386  3875 backend.cpp:76] Failed to create 'aufs' backend: AufsBackend requires
root privileges
W0919 23:01:30.773550  3875 backend.cpp:76] Failed to create 'bind' backend: BindBackend requires
root privileges
I0919 23:01:30.773593  3875 provisioner.cpp:255] Using default backend 'copy'
I0919 23:01:30.775634  3875 cluster.cpp:448] Creating default 'local' authorizer
I0919 23:01:30.778301  3893 slave.cpp:252] Mesos agent started on (815)@172.17.0.2:33545
I0919 23:01:30.778333  3893 slave.cpp:253] Flags at startup: --acls="" --appc_simple_discovery_uri_prefix="http://"
--appc_store_dir="/tmp/Endpoint_SlaveEndpointTest_NoAuthorizer_1_Oouc51/store/appc" --authenticate_http_readonly="true"
--authenticate_http_readwrite="true" --authenticatee="crammd5" --authentication_backoff_factor="1secs"
--authorizer="local" --cgroups_cpu_enable_pids_and_tids_count="false" --cgroups_enable_cfs="false"
--cgroups_hierarchy="/sys/fs/cgroup" --cgroups_limit_swap="false" --cgroups_root="mesos" --container_disk_watch_interval="15secs"
--containerizers="mesos" --credential="/tmp/Endpoint_SlaveEndpointTest_NoAuthorizer_1_Oouc51/credential"
--default_role="*" --disallow_sharing_agent_pid_namespace="false" --disk_watch_interval="1mins"
--docker="docker" --docker_kill_orphans="true" --docker_registry="https://registry-1.docker.io"
--docker_remove_delay="6hrs" --docker_socket="/var/run/docker.sock" --docker_stop_timeout="0ns"
--docker_store_dir="/tmp/Endpoint_SlaveEndpointTest_NoAuthorizer_1_Oouc51/store/docker" --docker_volume_checkpoint_dir="/var/run/mesos/isolators/docker/volume"
--enforce_container_disk_quota="false" --executor_registration_timeout="1mins" --executor_reregistration_timeout="2secs"
--executor_shutdown_grace_period="5secs" --fetcher_cache_dir="/tmp/Endpoint_SlaveEndpointTest_NoAuthorizer_1_Oouc51/fetch"
--fetcher_cache_size="2GB" --frameworks_home="" --gc_delay="1weeks" --gc_disk_headroom="0.1"
--hadoop_home="" --help="false" --hostname_lookup="true" --http_command_executor="false" --http_credentials="/tmp/Endpoint_SlaveEndpointTest_NoAuthorizer_1_Oouc51/http_credentials"
--http_heartbeat_interval="30secs" --initialize_driver_logging="true" --isolation="posix/cpu,posix/mem"
--launcher="posix" --launcher_dir="/mesos/mesos-1.5.0/_build/src" --logbufsecs="0" --logging_level="INFO"
--max_completed_executors_per_framework="150" --oversubscribed_resources_interval="15secs"
--perf_duration="10secs" --perf_interval="1mins" --port="5051" --qos_correction_interval_min="0ns"
--quiet="false" --recover="reconnect" --recovery_timeout="15mins" --registration_backoff_factor="10ms"
--resources="cpus:2;gpus:0;mem:1024;disk:1024;ports:[31000-32000]" --revocable_cpu_low_priority="true"
--runtime_dir="/tmp/Endpoint_SlaveEndpointTest_NoAuthorizer_1_Oouc51" --sandbox_directory="/mnt/mesos/sandbox"
--strict="true" --switch_user="true" --systemd_enable_support="true" --systemd_runtime_directory="/run/systemd/system"
--version="false" --work_dir="/tmp/Endpoint_SlaveEndpointTest_NoAuthorizer_1_T2EzkW" --zk_session_timeout="10secs"
I0919 23:01:30.778728  3893 credentials.hpp:86] Loading credential for authentication from
'/tmp/Endpoint_SlaveEndpointTest_NoAuthorizer_1_Oouc51/credential'
I0919 23:01:30.778923  3893 slave.cpp:285] Agent using credential for: test-principal
I0919 23:01:30.778946  3893 credentials.hpp:37] Loading credentials for authentication from
'/tmp/Endpoint_SlaveEndpointTest_NoAuthorizer_1_Oouc51/http_credentials'
I0919 23:01:30.779191  3893 http.cpp:1045] Creating default 'basic' HTTP authenticator for
realm 'mesos-agent-readonly'
I0919 23:01:30.779404  3893 http.cpp:1045] Creating default 'basic' HTTP authenticator for
realm 'mesos-agent-readwrite'
I0919 23:01:30.781220  3893 slave.cpp:583] Agent resources: [{"name":"cpus","scalar":{"value":2.0},"type":"SCALAR"},{"name":"mem","scalar":{"value":1024.0},"type":"SCALAR"},{"name":"disk","scalar":{"value":1024.0},"type":"SCALAR"},{"name":"ports","ranges":{"range":[{"begin":31000,"end":32000}]},"type":"RANGES"}]
I0919 23:01:30.781507  3893 slave.cpp:591] Agent attributes: [  ]
I0919 23:01:30.781558  3893 slave.cpp:600] Agent hostname: 6cba1c4c6495
I0919 23:01:30.781750  3897 status_update_manager.cpp:177] Pausing sending status updates
I0919 23:01:30.783638  3904 state.cpp:64] Recovering state from '/tmp/Endpoint_SlaveEndpointTest_NoAuthorizer_1_T2EzkW/meta'
I0919 23:01:30.783910  3904 status_update_manager.cpp:203] Recovering status update manager
I0919 23:01:30.784093  3904 containerizer.cpp:648] Recovering containerizer
I0919 23:01:30.785604  3903 provisioner.cpp:416] Provisioner recovery complete
I0919 23:01:30.785977  3895 slave.cpp:6298] Finished recovery
I0919 23:01:30.786523  3895 slave.cpp:6480] Querying resource estimator for oversubscribable
resources
I0919 23:01:30.786782  3907 slave.cpp:6494] Received oversubscribable resources {} from the
resource estimator
I0919 23:01:30.789674  3896 process.cpp:3929] Handling HTTP event for process 'slave(815)'
with path: '/slave(815)/monitor/statistics.json'
I0919 23:01:30.790799  3904 http.cpp:1185] HTTP GET for /slave(815)/monitor/statistics.json
from 172.17.0.2:56129
I0919 23:01:30.790892  3904 http.cpp:976] Authorizing principal 'test-principal' to GET the
'/monitor/statistics.json' endpoint
I0919 23:01:30.794219  3904 slave.cpp:861] Agent terminating
[       OK ] Endpoint/SlaveEndpointTest.NoAuthorizer/1 (35 ms)
[ RUN      ] Endpoint/SlaveEndpointTest.NoAuthorizer/2
I0919 23:01:30.807955  3875 containerizer.cpp:292] Using isolation { environment_secret, posix/cpu,
posix/mem, filesystem/posix, network/cni }
W0919 23:01:30.808503  3875 backend.cpp:76] Failed to create 'aufs' backend: AufsBackend requires
root privileges
W0919 23:01:30.808614  3875 backend.cpp:76] Failed to create 'bind' backend: BindBackend requires
root privileges
I0919 23:01:30.808653  3875 provisioner.cpp:255] Using default backend 'copy'
I0919 23:01:30.810406  3875 cluster.cpp:448] Creating default 'local' authorizer
I0919 23:01:30.812209  3903 slave.cpp:252] Mesos agent started on (816)@172.17.0.2:33545
I0919 23:01:30.812250  3903 slave.cpp:253] Flags at startup: --acls="" --appc_simple_discovery_uri_prefix="http://"
--appc_store_dir="/tmp/Endpoint_SlaveEndpointTest_NoAuthorizer_2_eBYtpp/store/appc" --authenticate_http_readonly="true"
--authenticate_http_readwrite="true" --authenticatee="crammd5" --authentication_backoff_factor="1secs"
--authorizer="local" --cgroups_cpu_enable_pids_and_tids_count="false" --cgroups_enable_cfs="false"
--cgroups_hierarchy="/sys/fs/cgroup" --cgroups_limit_swap="false" --cgroups_root="mesos" --container_disk_watch_interval="15secs"
--containerizers="mesos" --credential="/tmp/Endpoint_SlaveEndpointTest_NoAuthorizer_2_eBYtpp/credential"
--default_role="*" --disallow_sharing_agent_pid_namespace="false" --disk_watch_interval="1mins"
--docker="docker" --docker_kill_orphans="true" --docker_registry="https://registry-1.docker.io"
--docker_remove_delay="6hrs" --docker_socket="/var/run/docker.sock" --docker_stop_timeout="0ns"
--docker_store_dir="/tmp/Endpoint_SlaveEndpointTest_NoAuthorizer_2_eBYtpp/store/docker" --docker_volume_checkpoint_dir="/var/run/mesos/isolators/docker/volume"
--enforce_container_disk_quota="false" --executor_registration_timeout="1mins" --executor_reregistration_timeout="2secs"
--executor_shutdown_grace_period="5secs" --fetcher_cache_dir="/tmp/Endpoint_SlaveEndpointTest_NoAuthorizer_2_eBYtpp/fetch"
--fetcher_cache_size="2GB" --frameworks_home="" --gc_delay="1weeks" --gc_disk_headroom="0.1"
--hadoop_home="" --help="false" --hostname_lookup="true" --http_command_executor="false" --http_credentials="/tmp/Endpoint_SlaveEndpointTest_NoAuthorizer_2_eBYtpp/http_credentials"
--http_heartbeat_interval="30secs" --initialize_driver_logging="true" --isolation="posix/cpu,posix/mem"
--launcher="posix" --launcher_dir="/mesos/mesos-1.5.0/_build/src" --logbufsecs="0" --logging_level="INFO"
--max_completed_executors_per_framework="150" --oversubscribed_resources_interval="15secs"
--perf_duration="10secs" --perf_interval="1mins" --port="5051" --qos_correction_interval_min="0ns"
--quiet="false" --recover="reconnect" --recovery_timeout="15mins" --registration_backoff_factor="10ms"
--resources="cpus:2;gpus:0;mem:1024;disk:1024;ports:[31000-32000]" --revocable_cpu_low_priority="true"
--runtime_dir="/tmp/Endpoint_SlaveEndpointTest_NoAuthorizer_2_eBYtpp" --sandbox_directory="/mnt/mesos/sandbox"
--strict="true" --switch_user="true" --systemd_enable_support="true" --systemd_runtime_directory="/run/systemd/system"
--version="false" --work_dir="/tmp/Endpoint_SlaveEndpointTest_NoAuthorizer_2_X0C3yj" --zk_session_timeout="10secs"
I0919 23:01:30.812979  3903 credentials.hpp:86] Loading credential for authentication from
'/tmp/Endpoint_SlaveEndpointTest_NoAuthorizer_2_eBYtpp/credential'
I0919 23:01:30.813233  3903 slave.cpp:285] Agent using credential for: test-principal
I0919 23:01:30.813272  3903 credentials.hpp:37] Loading credentials for authentication from
'/tmp/Endpoint_SlaveEndpointTest_NoAuthorizer_2_eBYtpp/http_credentials'
I0919 23:01:30.813659  3903 http.cpp:1045] Creating default 'basic' HTTP authenticator for
realm 'mesos-agent-readonly'
I0919 23:01:30.813885  3903 http.cpp:1045] Creating default 'basic' HTTP authenticator for
realm 'mesos-agent-readwrite'
I0919 23:01:30.815304  3903 slave.cpp:583] Agent resources: [{"name":"cpus","scalar":{"value":2.0},"type":"SCALAR"},{"name":"mem","scalar":{"value":1024.0},"type":"SCALAR"},{"name":"disk","scalar":{"value":1024.0},"type":"SCALAR"},{"name":"ports","ranges":{"range":[{"begin":31000,"end":32000}]},"type":"RANGES"}]
I0919 23:01:30.815524  3903 slave.cpp:591] Agent attributes: [  ]
I0919 23:01:30.815541  3903 slave.cpp:600] Agent hostname: 6cba1c4c6495
I0919 23:01:30.815709  3900 status_update_manager.cpp:177] Pausing sending status updates
I0919 23:01:30.817049  3904 state.cpp:64] Recovering state from '/tmp/Endpoint_SlaveEndpointTest_NoAuthorizer_2_X0C3yj/meta'
I0919 23:01:30.817307  3904 status_update_manager.cpp:203] Recovering status update manager
I0919 23:01:30.817500  3904 containerizer.cpp:648] Recovering containerizer
I0919 23:01:30.818974  3897 provisioner.cpp:416] Provisioner recovery complete
I0919 23:01:30.819327  3907 slave.cpp:6298] Finished recovery
I0919 23:01:30.819754  3907 slave.cpp:6480] Querying resource estimator for oversubscribable
resources
I0919 23:01:30.819963  3894 slave.cpp:6494] Received oversubscribable resources {} from the
resource estimator
I0919 23:01:30.822598  3901 process.cpp:3929] Handling HTTP event for process 'slave(816)'
with path: '/slave(816)/containers'
I0919 23:01:30.823830  3900 http.cpp:1185] HTTP GET for /slave(816)/containers from 172.17.0.2:56130
I0919 23:01:30.823904  3900 http.cpp:976] Authorizing principal 'test-principal' to GET the
'/containers' endpoint
I0919 23:01:30.827760  3875 slave.cpp:861] Agent terminating
[       OK ] Endpoint/SlaveEndpointTest.NoAuthorizer/2 (32 ms)
[----------] 9 tests from Endpoint/SlaveEndpointTest (307 ms total)

[----------] 2 tests from ContainerizerType/DefaultContainerDNSFlagTest
[ RUN      ] ContainerizerType/DefaultContainerDNSFlagTest.ValidateFlag/0
[       OK ] ContainerizerType/DefaultContainerDNSFlagTest.ValidateFlag/0 (12 ms)
[ RUN      ] ContainerizerType/DefaultContainerDNSFlagTest.ValidateFlag/1
[       OK ] ContainerizerType/DefaultContainerDNSFlagTest.ValidateFlag/1 (8 ms)
[----------] 2 tests from ContainerizerType/DefaultContainerDNSFlagTest (20 ms total)

[----------] Global test environment tear-down
[==========] 1667 tests from 183 test cases ran. (622318 ms total)
[  PASSED  ] 1665 tests.
[  FAILED  ] 2 tests, listed below:
[  FAILED  ] ContentType/MasterAPITest.ReserveResources/0, where GetParam() = application/x-protobuf
[  FAILED  ] ContentType/MasterAPITest.ReserveResources/1, where GetParam() = application/json

 2 FAILED TESTS
  YOU HAVE 20 DISABLED TESTS

I0919 23:01:30.921296  3909 process.cpp:1068] Failed to accept socket: future discarded
make[4]: *** [check-local] Error 1
make[4]: Leaving directory `/mesos/mesos-1.5.0/_build/src'
make[3]: *** [check-am] Error 2
make[3]: Leaving directory `/mesos/mesos-1.5.0/_build/src'
make[2]: *** [check] Error 2
make[2]: Leaving directory `/mesos/mesos-1.5.0/_build/src'
make[1]: *** [check-recursive] Error 1
make[1]: Leaving directory `/mesos/mesos-1.5.0/_build'
make: *** [distcheck] Error 1
+ docker rmi mesos-1505858377-26247
Untagged: mesos-1505858377-26247:latest
Deleted: sha256:7a175931e989a925d93b833a534959c80ff5830aab48af414ae6fcba726aa090
Deleted: sha256:3d64cda57bf16d9c2e03149b90e28c22632b93cf84240c5e1dc6fbe3ffb5ef71
Deleted: sha256:c5167b55dffc405833474152ad62e1bcbae1c330d3addbfe844c644be63e0696
Deleted: sha256:f6d87addfd29faff5095f924b720be39b1454387034318cb5156e895b299ffaa
Deleted: sha256:194ce4446a17946305707e0f6360fcf077e0293977f859c9ab090fcd3ed82e94
Deleted: sha256:93635049f008aaab60721deecd43eef3f99b035452513f39891a6ac40fa20bf0
Deleted: sha256:7a57ca0fdd8ac18f996cf6061d92f902160944937fc3bbc846400594f12ef99f
Deleted: sha256:bbad74d70575dffae836914f34a0e58502bf8f1a3786d49aa573becf119254c2
Deleted: sha256:de8b02f6db1c8a3a02c2f2161e6ebf620b40d7e3cddd5027b290afa8fbc8b0fe
Deleted: sha256:9bcfc120f4dde0a622addf183bafc45cb4f89d5aadcd315f2b7b85f9ada169f8
Deleted: sha256:e39a83f0f1f65b632bffe43e8adc21b6e0a549509cc088ce4683847b7a570696
Deleted: sha256:66fbb7c060b47ddc75e90f290af24893b2994299d563e7be5f94ca63e84294ae
Deleted: sha256:3305516c49dfe99d25e010e11bd097731edfcff16cb9bf8b72e5b2c3e4b4dd38
Deleted: sha256:fa1e2f7147239c72e509bb7493ff6b55bb61b967c2242542830b2cf92153524a
Deleted: sha256:90d45a4963d79f36975f21e28adde09326b621337a9e12d69f9898822d8b43fc
Deleted: sha256:d9923795fbeda2037008f6ec99227c246361ea8e799a011cd27310b81ded8565
Deleted: sha256:652380f59f205fd1ab71c59b513e4adeea7659ff5cdffbd2e30a827aa7124fbc
Deleted: sha256:5e1e4dce0aee7ab0723e45c7022ce75e7085fcc38b926550eedbcdd10640fde6
Deleted: sha256:1512b6946d2d5d0b8f39671a3f9e47340aef43983f4b9942ddff3fc2c5d1825d
Deleted: sha256:1f7927ae6bcd0ad668bfe2a252044dc6079647b2406314c1380997c3010c7586
Deleted: sha256:c62b91b9e57bfab46de3d2625520a23a41b5d77f7f7f8c909a5e3ee272f706ef
Deleted: sha256:f60d7dad52b10957a11ce66b4e3d4964da3dc4503fb79c0649b528b75dfddcb3
Deleted: sha256:fc6bd32af23aab03e9fc93b242d04870a9b8445120aa8c48b7e1280a1ff5c6db
Deleted: sha256:6d29300684475b57214b52cc4399460e5c3afce2e142ea56e2a1d662c4871db2
Deleted: sha256:ed1de64b561b0ce0ff9e3c8836ec853cc1fe31d3a6685c9367e0ddace9af4ab8
Deleted: sha256:03f73f0dc39aebcff840c5e242013a33978d114671cd08b260bd6e9afbc59996
Deleted: sha256:c0e24aa69fc7337d816dd1074ada33f5645cfb746658b7b45cda7ae82f9cfc33
Deleted: sha256:78a720775f018cd68f31108e27eee9091d9c6bcb5c68360f215b03b06e61cf2c
Build step 'Execute shell' marked build as failure
Not sending mail to unregistered user yujie.jay@gmail.com

Mime
View raw message