mesos-builds mailing list archives

Site index · List index
Message view « Date » · « Thread »
Top « Date » · « Thread »
From Apache Jenkins Server <jenk...@builds.apache.org>
Subject Build failed in Jenkins: Mesos-Buildbot » autotools,gcc,--verbose,GLOG_v=1 MESOS_VERBOSE=1,centos:7,(ubuntu)&&(!ubuntu-us1)&&(!ubuntu-eu2) #4196
Date Tue, 05 Sep 2017 09:06:41 GMT
See <https://builds.apache.org/job/Mesos-Buildbot/BUILDTOOL=autotools,COMPILER=gcc,CONFIGURATION=--verbose,ENVIRONMENT=GLOG_v=1%20MESOS_VERBOSE=1,OS=centos%3A7,label_exp=(ubuntu)&&(!ubuntu-us1)&&(!ubuntu-eu2)/4196/display/redirect?page=changes>

Changes:

[songzihao1990] Added MESOS-7926 to the 1.4.0 CHANGELOG.

------------------------------------------
[...truncated 30.87 MB...]
I0905 09:06:23.290405  6129 http.cpp:1026] Creating default 'basic' HTTP authenticator for
realm 'mesos-agent-readwrite'
I0905 09:06:23.292716  6129 slave.cpp:565] Agent resources: [{"name":"cpus","scalar":{"value":2.0},"type":"SCALAR"},{"name":"mem","scalar":{"value":1024.0},"type":"SCALAR"},{"name":"disk","scalar":{"value":1024.0},"type":"SCALAR"},{"name":"ports","ranges":{"range":[{"begin":31000,"end":32000}]},"type":"RANGES"}]
I0905 09:06:23.293210  6129 slave.cpp:573] Agent attributes: [  ]
I0905 09:06:23.293256  6129 slave.cpp:582] Agent hostname: c3c94b45d47a
I0905 09:06:23.293521  6126 status_update_manager.cpp:177] Pausing sending status updates
I0905 09:06:23.295675  6127 state.cpp:64] Recovering state from '/tmp/Endpoint_SlaveEndpointTest_AuthorizedRequest_2_UcuCLu/meta'
I0905 09:06:23.296145  6126 status_update_manager.cpp:203] Recovering status update manager
I0905 09:06:23.296464  6124 containerizer.cpp:609] Recovering containerizer
I0905 09:06:23.298692  6125 provisioner.cpp:416] Provisioner recovery complete
I0905 09:06:23.299427  6128 slave.cpp:6295] Finished recovery
I0905 09:06:23.300031  6128 slave.cpp:6477] Querying resource estimator for oversubscribable
resources
I0905 09:06:23.300459  6131 slave.cpp:6491] Received oversubscribable resources {} from the
resource estimator
I0905 09:06:23.304811  6127 process.cpp:3933] Handling HTTP event for process 'slave(796)'
with path: '/slave(796)/containers'
I0905 09:06:23.306993  6129 http.cpp:1166] HTTP GET for /slave(796)/containers from 172.17.0.2:59516
I0905 09:06:23.307150  6129 http.cpp:957] Authorizing principal 'test-principal' to GET the
'/containers' endpoint
I0905 09:06:23.313045  6124 slave.cpp:843] Agent terminating
[       OK ] Endpoint/SlaveEndpointTest.AuthorizedRequest/2 (48 ms)
[ RUN      ] Endpoint/SlaveEndpointTest.UnauthorizedRequest/0
I0905 09:06:23.330783  6105 containerizer.cpp:246] Using isolation: posix/cpu,posix/mem,filesystem/posix,network/cni,environment_secret
W0905 09:06:23.331567  6105 backend.cpp:76] Failed to create 'overlay' backend: OverlayBackend
requires root privileges
W0905 09:06:23.331764  6105 backend.cpp:76] Failed to create 'bind' backend: BindBackend requires
root privileges
I0905 09:06:23.331807  6105 provisioner.cpp:255] Using default backend 'copy'
I0905 09:06:23.337527  6131 slave.cpp:250] Mesos agent started on (797)@172.17.0.2:41901
I0905 09:06:23.337568  6131 slave.cpp:251] Flags at startup: --acls="" --appc_simple_discovery_uri_prefix="http://"
--appc_store_dir="/tmp/Endpoint_SlaveEndpointTest_UnauthorizedRequest_0_1ztsRz/store/appc"
--authenticate_http_readonly="true" --authenticate_http_readwrite="true" --authenticatee="crammd5"
--authentication_backoff_factor="1secs" --authorizer="local" --cgroups_cpu_enable_pids_and_tids_count="false"
--cgroups_enable_cfs="false" --cgroups_hierarchy="/sys/fs/cgroup" --cgroups_limit_swap="false"
--cgroups_root="mesos" --container_disk_watch_interval="15secs" --containerizers="mesos" --credential="/tmp/Endpoint_SlaveEndpointTest_UnauthorizedRequest_0_1ztsRz/credential"
--default_role="*" --disallow_sharing_agent_pid_namespace="false" --disk_watch_interval="1mins"
--docker="docker" --docker_kill_orphans="true" --docker_registry="https://registry-1.docker.io"
--docker_remove_delay="6hrs" --docker_socket="/var/run/docker.sock" --docker_stop_timeout="0ns"
--docker_store_dir="/tmp/Endpoint_SlaveEndpointTest_UnauthorizedRequest_0_1ztsRz/store/docker"
--docker_volume_checkpoint_dir="/var/run/mesos/isolators/docker/volume" --enforce_container_disk_quota="false"
--executor_registration_timeout="1mins" --executor_reregistration_timeout="2secs" --executor_shutdown_grace_period="5secs"
--fetcher_cache_dir="/tmp/Endpoint_SlaveEndpointTest_UnauthorizedRequest_0_1ztsRz/fetch" --fetcher_cache_size="2GB"
--frameworks_home="" --gc_delay="1weeks" --gc_disk_headroom="0.1" --hadoop_home="" --help="false"
--hostname_lookup="true" --http_command_executor="false" --http_credentials="/tmp/Endpoint_SlaveEndpointTest_UnauthorizedRequest_0_1ztsRz/http_credentials"
--http_heartbeat_interval="30secs" --initialize_driver_logging="true" --isolation="posix/cpu,posix/mem"
--launcher="posix" --launcher_dir="/mesos/mesos-1.4.0/_build/src" --logbufsecs="0" --logging_level="INFO"
--max_completed_executors_per_framework="150" --oversubscribed_resources_interval="15secs"
--perf_duration="10secs" --perf_interval="1mins" --port="5051" --qos_correction_interval_min="0ns"
--quiet="false" --recover="reconnect" --recovery_timeout="15mins" --registration_backoff_factor="10ms"
--resources="cpus:2;gpus:0;mem:1024;disk:1024;ports:[31000-32000]" --revocable_cpu_low_priority="true"
--runtime_dir="/tmp/Endpoint_SlaveEndpointTest_UnauthorizedRequest_0_1ztsRz" --sandbox_directory="/mnt/mesos/sandbox"
--strict="true" --switch_user="true" --systemd_enable_support="true" --systemd_runtime_directory="/run/systemd/system"
--version="false" --work_dir="/tmp/Endpoint_SlaveEndpointTest_UnauthorizedRequest_0_6oOWom"
I0905 09:06:23.338408  6131 credentials.hpp:86] Loading credential for authentication from
'/tmp/Endpoint_SlaveEndpointTest_UnauthorizedRequest_0_1ztsRz/credential'
I0905 09:06:23.338768  6131 slave.cpp:283] Agent using credential for: test-principal
I0905 09:06:23.338809  6131 credentials.hpp:37] Loading credentials for authentication from
'/tmp/Endpoint_SlaveEndpointTest_UnauthorizedRequest_0_1ztsRz/http_credentials'
I0905 09:06:23.339354  6131 http.cpp:1026] Creating default 'basic' HTTP authenticator for
realm 'mesos-agent-readonly'
I0905 09:06:23.339761  6131 http.cpp:1026] Creating default 'basic' HTTP authenticator for
realm 'mesos-agent-readwrite'
I0905 09:06:23.342243  6131 slave.cpp:565] Agent resources: [{"name":"cpus","scalar":{"value":2.0},"type":"SCALAR"},{"name":"mem","scalar":{"value":1024.0},"type":"SCALAR"},{"name":"disk","scalar":{"value":1024.0},"type":"SCALAR"},{"name":"ports","ranges":{"range":[{"begin":31000,"end":32000}]},"type":"RANGES"}]
I0905 09:06:23.342689  6131 slave.cpp:573] Agent attributes: [  ]
I0905 09:06:23.342712  6131 slave.cpp:582] Agent hostname: c3c94b45d47a
I0905 09:06:23.342929  6124 status_update_manager.cpp:177] Pausing sending status updates
I0905 09:06:23.345268  6130 state.cpp:64] Recovering state from '/tmp/Endpoint_SlaveEndpointTest_UnauthorizedRequest_0_6oOWom/meta'
I0905 09:06:23.345679  6128 status_update_manager.cpp:203] Recovering status update manager
I0905 09:06:23.345983  6131 containerizer.cpp:609] Recovering containerizer
I0905 09:06:23.348645  6131 provisioner.cpp:416] Provisioner recovery complete
I0905 09:06:23.349190  6129 slave.cpp:6295] Finished recovery
I0905 09:06:23.349820  6129 slave.cpp:6477] Querying resource estimator for oversubscribable
resources
I0905 09:06:23.350169  6130 slave.cpp:6491] Received oversubscribable resources {} from the
resource estimator
I0905 09:06:23.354296  6127 process.cpp:3933] Handling HTTP event for process 'slave(797)'
with path: '/slave(797)/monitor/statistics'
I0905 09:06:23.356834  6130 http.cpp:1166] HTTP GET for /slave(797)/monitor/statistics from
172.17.0.2:59518
I0905 09:06:23.356958  6130 http.cpp:957] Authorizing principal 'test-principal' to GET the
'/monitor/statistics' endpoint
I0905 09:06:23.360448  6105 slave.cpp:843] Agent terminating
[       OK ] Endpoint/SlaveEndpointTest.UnauthorizedRequest/0 (54 ms)
[ RUN      ] Endpoint/SlaveEndpointTest.UnauthorizedRequest/1
I0905 09:06:23.385697  6105 containerizer.cpp:246] Using isolation: posix/cpu,posix/mem,filesystem/posix,network/cni,environment_secret
W0905 09:06:23.386690  6105 backend.cpp:76] Failed to create 'overlay' backend: OverlayBackend
requires root privileges
W0905 09:06:23.387146  6105 backend.cpp:76] Failed to create 'bind' backend: BindBackend requires
root privileges
I0905 09:06:23.387332  6105 provisioner.cpp:255] Using default backend 'copy'
I0905 09:06:23.393290  6128 slave.cpp:250] Mesos agent started on (798)@172.17.0.2:41901
I0905 09:06:23.393332  6128 slave.cpp:251] Flags at startup: --acls="" --appc_simple_discovery_uri_prefix="http://"
--appc_store_dir="/tmp/Endpoint_SlaveEndpointTest_UnauthorizedRequest_1_LNZvbs/store/appc"
--authenticate_http_readonly="true" --authenticate_http_readwrite="true" --authenticatee="crammd5"
--authentication_backoff_factor="1secs" --authorizer="local" --cgroups_cpu_enable_pids_and_tids_count="false"
--cgroups_enable_cfs="false" --cgroups_hierarchy="/sys/fs/cgroup" --cgroups_limit_swap="false"
--cgroups_root="mesos" --container_disk_watch_interval="15secs" --containerizers="mesos" --credential="/tmp/Endpoint_SlaveEndpointTest_UnauthorizedRequest_1_LNZvbs/credential"
--default_role="*" --disallow_sharing_agent_pid_namespace="false" --disk_watch_interval="1mins"
--docker="docker" --docker_kill_orphans="true" --docker_registry="https://registry-1.docker.io"
--docker_remove_delay="6hrs" --docker_socket="/var/run/docker.sock" --docker_stop_timeout="0ns"
--docker_store_dir="/tmp/Endpoint_SlaveEndpointTest_UnauthorizedRequest_1_LNZvbs/store/docker"
--docker_volume_checkpoint_dir="/var/run/mesos/isolators/docker/volume" --enforce_container_disk_quota="false"
--executor_registration_timeout="1mins" --executor_reregistration_timeout="2secs" --executor_shutdown_grace_period="5secs"
--fetcher_cache_dir="/tmp/Endpoint_SlaveEndpointTest_UnauthorizedRequest_1_LNZvbs/fetch" --fetcher_cache_size="2GB"
--frameworks_home="" --gc_delay="1weeks" --gc_disk_headroom="0.1" --hadoop_home="" --help="false"
--hostname_lookup="true" --http_command_executor="false" --http_credentials="/tmp/Endpoint_SlaveEndpointTest_UnauthorizedRequest_1_LNZvbs/http_credentials"
--http_heartbeat_interval="30secs" --initialize_driver_logging="true" --isolation="posix/cpu,posix/mem"
--launcher="posix" --launcher_dir="/mesos/mesos-1.4.0/_build/src" --logbufsecs="0" --logging_level="INFO"
--max_completed_executors_per_framework="150" --oversubscribed_resources_interval="15secs"
--perf_duration="10secs" --perf_interval="1mins" --port="5051" --qos_correction_interval_min="0ns"
--quiet="false" --recover="reconnect" --recovery_timeout="15mins" --registration_backoff_factor="10ms"
--resources="cpus:2;gpus:0;mem:1024;disk:1024;ports:[31000-32000]" --revocable_cpu_low_priority="true"
--runtime_dir="/tmp/Endpoint_SlaveEndpointTest_UnauthorizedRequest_1_LNZvbs" --sandbox_directory="/mnt/mesos/sandbox"
--strict="true" --switch_user="true" --systemd_enable_support="true" --systemd_runtime_directory="/run/systemd/system"
--version="false" --work_dir="/tmp/Endpoint_SlaveEndpointTest_UnauthorizedRequest_1_ejk5ze"
I0905 09:06:23.394081  6128 credentials.hpp:86] Loading credential for authentication from
'/tmp/Endpoint_SlaveEndpointTest_UnauthorizedRequest_1_LNZvbs/credential'
I0905 09:06:23.394352  6128 slave.cpp:283] Agent using credential for: test-principal
I0905 09:06:23.394384  6128 credentials.hpp:37] Loading credentials for authentication from
'/tmp/Endpoint_SlaveEndpointTest_UnauthorizedRequest_1_LNZvbs/http_credentials'
I0905 09:06:23.394773  6128 http.cpp:1026] Creating default 'basic' HTTP authenticator for
realm 'mesos-agent-readonly'
I0905 09:06:23.395064  6128 http.cpp:1026] Creating default 'basic' HTTP authenticator for
realm 'mesos-agent-readwrite'
I0905 09:06:23.397339  6128 slave.cpp:565] Agent resources: [{"name":"cpus","scalar":{"value":2.0},"type":"SCALAR"},{"name":"mem","scalar":{"value":1024.0},"type":"SCALAR"},{"name":"disk","scalar":{"value":1024.0},"type":"SCALAR"},{"name":"ports","ranges":{"range":[{"begin":31000,"end":32000}]},"type":"RANGES"}]
I0905 09:06:23.397809  6128 slave.cpp:573] Agent attributes: [  ]
I0905 09:06:23.397831  6128 slave.cpp:582] Agent hostname: c3c94b45d47a
I0905 09:06:23.398099  6125 status_update_manager.cpp:177] Pausing sending status updates
I0905 09:06:23.400238  6127 state.cpp:64] Recovering state from '/tmp/Endpoint_SlaveEndpointTest_UnauthorizedRequest_1_ejk5ze/meta'
I0905 09:06:23.400852  6130 status_update_manager.cpp:203] Recovering status update manager
I0905 09:06:23.401084  6130 containerizer.cpp:609] Recovering containerizer
I0905 09:06:23.403512  6130 provisioner.cpp:416] Provisioner recovery complete
I0905 09:06:23.404170  6126 slave.cpp:6295] Finished recovery
I0905 09:06:23.404798  6126 slave.cpp:6477] Querying resource estimator for oversubscribable
resources
I0905 09:06:23.405143  6124 slave.cpp:6491] Received oversubscribable resources {} from the
resource estimator
I0905 09:06:23.409502  6128 process.cpp:3933] Handling HTTP event for process 'slave(798)'
with path: '/slave(798)/monitor/statistics.json'
I0905 09:06:23.411626  6131 http.cpp:1166] HTTP GET for /slave(798)/monitor/statistics.json
from 172.17.0.2:59520
I0905 09:06:23.411754  6131 http.cpp:957] Authorizing principal 'test-principal' to GET the
'/monitor/statistics.json' endpoint
I0905 09:06:23.415724  6105 slave.cpp:843] Agent terminating
[       OK ] Endpoint/SlaveEndpointTest.UnauthorizedRequest/1 (47 ms)
[ RUN      ] Endpoint/SlaveEndpointTest.UnauthorizedRequest/2
I0905 09:06:23.434099  6105 containerizer.cpp:246] Using isolation: posix/cpu,posix/mem,filesystem/posix,network/cni,environment_secret
W0905 09:06:23.435174  6105 backend.cpp:76] Failed to create 'overlay' backend: OverlayBackend
requires root privileges
W0905 09:06:23.435621  6105 backend.cpp:76] Failed to create 'bind' backend: BindBackend requires
root privileges
I0905 09:06:23.435678  6105 provisioner.cpp:255] Using default backend 'copy'
I0905 09:06:23.441704  6126 slave.cpp:250] Mesos agent started on (799)@172.17.0.2:41901
I0905 09:06:23.441748  6126 slave.cpp:251] Flags at startup: --acls="" --appc_simple_discovery_uri_prefix="http://"
--appc_store_dir="/tmp/Endpoint_SlaveEndpointTest_UnauthorizedRequest_2_n5PS1k/store/appc"
--authenticate_http_readonly="true" --authenticate_http_readwrite="true" --authenticatee="crammd5"
--authentication_backoff_factor="1secs" --authorizer="local" --cgroups_cpu_enable_pids_and_tids_count="false"
--cgroups_enable_cfs="false" --cgroups_hierarchy="/sys/fs/cgroup" --cgroups_limit_swap="false"
--cgroups_root="mesos" --container_disk_watch_interval="15secs" --containerizers="mesos" --credential="/tmp/Endpoint_SlaveEndpointTest_UnauthorizedRequest_2_n5PS1k/credential"
--default_role="*" --disallow_sharing_agent_pid_namespace="false" --disk_watch_interval="1mins"
--docker="docker" --docker_kill_orphans="true" --docker_registry="https://registry-1.docker.io"
--docker_remove_delay="6hrs" --docker_socket="/var/run/docker.sock" --docker_stop_timeout="0ns"
--docker_store_dir="/tmp/Endpoint_SlaveEndpointTest_UnauthorizedRequest_2_n5PS1k/store/docker"
--docker_volume_checkpoint_dir="/var/run/mesos/isolators/docker/volume" --enforce_container_disk_quota="false"
--executor_registration_timeout="1mins" --executor_reregistration_timeout="2secs" --executor_shutdown_grace_period="5secs"
--fetcher_cache_dir="/tmp/Endpoint_SlaveEndpointTest_UnauthorizedRequest_2_n5PS1k/fetch" --fetcher_cache_size="2GB"
--frameworks_home="" --gc_delay="1weeks" --gc_disk_headroom="0.1" --hadoop_home="" --help="false"
--hostname_lookup="true" --http_command_executor="false" --http_credentials="/tmp/Endpoint_SlaveEndpointTest_UnauthorizedRequest_2_n5PS1k/http_credentials"
--http_heartbeat_interval="30secs" --initialize_driver_logging="true" --isolation="posix/cpu,posix/mem"
--launcher="posix" --launcher_dir="/mesos/mesos-1.4.0/_build/src" --logbufsecs="0" --logging_level="INFO"
--max_completed_executors_per_framework="150" --oversubscribed_resources_interval="15secs"
--perf_duration="10secs" --perf_interval="1mins" --port="5051" --qos_correction_interval_min="0ns"
--quiet="false" --recover="reconnect" --recovery_timeout="15mins" --registration_backoff_factor="10ms"
--resources="cpus:2;gpus:0;mem:1024;disk:1024;ports:[31000-32000]" --revocable_cpu_low_priority="true"
--runtime_dir="/tmp/Endpoint_SlaveEndpointTest_UnauthorizedRequest_2_n5PS1k" --sandbox_directory="/mnt/mesos/sandbox"
--strict="true" --switch_user="true" --systemd_enable_support="true" --systemd_runtime_directory="/run/systemd/system"
--version="false" --work_dir="/tmp/Endpoint_SlaveEndpointTest_UnauthorizedRequest_2_S7wEi7"
I0905 09:06:23.442510  6126 credentials.hpp:86] Loading credential for authentication from
'/tmp/Endpoint_SlaveEndpointTest_UnauthorizedRequest_2_n5PS1k/credential'
I0905 09:06:23.442764  6126 slave.cpp:283] Agent using credential for: test-principal
I0905 09:06:23.442788  6126 credentials.hpp:37] Loading credentials for authentication from
'/tmp/Endpoint_SlaveEndpointTest_UnauthorizedRequest_2_n5PS1k/http_credentials'
I0905 09:06:23.443156  6126 http.cpp:1026] Creating default 'basic' HTTP authenticator for
realm 'mesos-agent-readonly'
I0905 09:06:23.443439  6126 http.cpp:1026] Creating default 'basic' HTTP authenticator for
realm 'mesos-agent-readwrite'
I0905 09:06:23.445683  6126 slave.cpp:565] Agent resources: [{"name":"cpus","scalar":{"value":2.0},"type":"SCALAR"},{"name":"mem","scalar":{"value":1024.0},"type":"SCALAR"},{"name":"disk","scalar":{"value":1024.0},"type":"SCALAR"},{"name":"ports","ranges":{"range":[{"begin":31000,"end":32000}]},"type":"RANGES"}]
I0905 09:06:23.446130  6126 slave.cpp:573] Agent attributes: [  ]
I0905 09:06:23.446152  6126 slave.cpp:582] Agent hostname: c3c94b45d47a
I0905 09:06:23.446478  6131 status_update_manager.cpp:177] Pausing sending status updates
I0905 09:06:23.448508  6130 state.cpp:64] Recovering state from '/tmp/Endpoint_SlaveEndpointTest_UnauthorizedRequest_2_S7wEi7/meta'
I0905 09:06:23.449043  6125 status_update_manager.cpp:203] Recovering status update manager
I0905 09:06:23.449342  6126 containerizer.cpp:609] Recovering containerizer
I0905 09:06:23.451462  6126 provisioner.cpp:416] Provisioner recovery complete
I0905 09:06:23.452086  6124 slave.cpp:6295] Finished recovery
I0905 09:06:23.452738  6124 slave.cpp:6477] Querying resource estimator for oversubscribable
resources
I0905 09:06:23.453076  6128 slave.cpp:6491] Received oversubscribable resources {} from the
resource estimator
I0905 09:06:23.457237  6128 process.cpp:3933] Handling HTTP event for process 'slave(799)'
with path: '/slave(799)/containers'
I0905 09:06:23.459167  6129 http.cpp:1166] HTTP GET for /slave(799)/containers from 172.17.0.2:59522
I0905 09:06:23.459400  6129 http.cpp:957] Authorizing principal 'test-principal' to GET the
'/containers' endpoint
I0905 09:06:23.463250  6105 slave.cpp:843] Agent terminating
[       OK ] Endpoint/SlaveEndpointTest.UnauthorizedRequest/2 (47 ms)
[ RUN      ] Endpoint/SlaveEndpointTest.NoAuthorizer/0
I0905 09:06:23.482077  6105 containerizer.cpp:246] Using isolation: posix/cpu,posix/mem,filesystem/posix,network/cni,environment_secret
W0905 09:06:23.483253  6105 backend.cpp:76] Failed to create 'overlay' backend: OverlayBackend
requires root privileges
W0905 09:06:23.483464  6105 backend.cpp:76] Failed to create 'bind' backend: BindBackend requires
root privileges
I0905 09:06:23.483506  6105 provisioner.cpp:255] Using default backend 'copy'
I0905 09:06:23.486227  6105 cluster.cpp:448] Creating default 'local' authorizer
I0905 09:06:23.489363  6128 slave.cpp:250] Mesos agent started on (800)@172.17.0.2:41901
I0905 09:06:23.489408  6128 slave.cpp:251] Flags at startup: --acls="" --appc_simple_discovery_uri_prefix="http://"
--appc_store_dir="/tmp/Endpoint_SlaveEndpointTest_NoAuthorizer_0_zVS7me/store/appc" --authenticate_http_readonly="true"
--authenticate_http_readwrite="true" --authenticatee="crammd5" --authentication_backoff_factor="1secs"
--authorizer="local" --cgroups_cpu_enable_pids_and_tids_count="false" --cgroups_enable_cfs="false"
--cgroups_hierarchy="/sys/fs/cgroup" --cgroups_limit_swap="false" --cgroups_root="mesos" --container_disk_watch_interval="15secs"
--containerizers="mesos" --credential="/tmp/Endpoint_SlaveEndpointTest_NoAuthorizer_0_zVS7me/credential"
--default_role="*" --disallow_sharing_agent_pid_namespace="false" --disk_watch_interval="1mins"
--docker="docker" --docker_kill_orphans="true" --docker_registry="https://registry-1.docker.io"
--docker_remove_delay="6hrs" --docker_socket="/var/run/docker.sock" --docker_stop_timeout="0ns"
--docker_store_dir="/tmp/Endpoint_SlaveEndpointTest_NoAuthorizer_0_zVS7me/store/docker" --docker_volume_checkpoint_dir="/var/run/mesos/isolators/docker/volume"
--enforce_container_disk_quota="false" --executor_registration_timeout="1mins" --executor_reregistration_timeout="2secs"
--executor_shutdown_grace_period="5secs" --fetcher_cache_dir="/tmp/Endpoint_SlaveEndpointTest_NoAuthorizer_0_zVS7me/fetch"
--fetcher_cache_size="2GB" --frameworks_home="" --gc_delay="1weeks" --gc_disk_headroom="0.1"
--hadoop_home="" --help="false" --hostname_lookup="true" --http_command_executor="false" --http_credentials="/tmp/Endpoint_SlaveEndpointTest_NoAuthorizer_0_zVS7me/http_credentials"
--http_heartbeat_interval="30secs" --initialize_driver_logging="true" --isolation="posix/cpu,posix/mem"
--launcher="posix" --launcher_dir="/mesos/mesos-1.4.0/_build/src" --logbufsecs="0" --logging_level="INFO"
--max_completed_executors_per_framework="150" --oversubscribed_resources_interval="15secs"
--perf_duration="10secs" --perf_interval="1mins" --port="5051" --qos_correction_interval_min="0ns"
--quiet="false" --recover="reconnect" --recovery_timeout="15mins" --registration_backoff_factor="10ms"
--resources="cpus:2;gpus:0;mem:1024;disk:1024;ports:[31000-32000]" --revocable_cpu_low_priority="true"
--runtime_dir="/tmp/Endpoint_SlaveEndpointTest_NoAuthorizer_0_zVS7me" --sandbox_directory="/mnt/mesos/sandbox"
--strict="true" --switch_user="true" --systemd_enable_support="true" --systemd_runtime_directory="/run/systemd/system"
--version="false" --work_dir="/tmp/Endpoint_SlaveEndpointTest_NoAuthorizer_0_0Frcw0"
I0905 09:06:23.490160  6128 credentials.hpp:86] Loading credential for authentication from
'/tmp/Endpoint_SlaveEndpointTest_NoAuthorizer_0_zVS7me/credential'
I0905 09:06:23.490432  6128 slave.cpp:283] Agent using credential for: test-principal
I0905 09:06:23.490464  6128 credentials.hpp:37] Loading credentials for authentication from
'/tmp/Endpoint_SlaveEndpointTest_NoAuthorizer_0_zVS7me/http_credentials'
I0905 09:06:23.490919  6128 http.cpp:1026] Creating default 'basic' HTTP authenticator for
realm 'mesos-agent-readonly'
I0905 09:06:23.491204  6128 http.cpp:1026] Creating default 'basic' HTTP authenticator for
realm 'mesos-agent-readwrite'
I0905 09:06:23.493477  6128 slave.cpp:565] Agent resources: [{"name":"cpus","scalar":{"value":2.0},"type":"SCALAR"},{"name":"mem","scalar":{"value":1024.0},"type":"SCALAR"},{"name":"disk","scalar":{"value":1024.0},"type":"SCALAR"},{"name":"ports","ranges":{"range":[{"begin":31000,"end":32000}]},"type":"RANGES"}]
I0905 09:06:23.493922  6128 slave.cpp:573] Agent attributes: [  ]
I0905 09:06:23.493947  6128 slave.cpp:582] Agent hostname: c3c94b45d47a
I0905 09:06:23.494232  6126 status_update_manager.cpp:177] Pausing sending status updates
I0905 09:06:23.496384  6129 state.cpp:64] Recovering state from '/tmp/Endpoint_SlaveEndpointTest_NoAuthorizer_0_0Frcw0/meta'
I0905 09:06:23.496920  6124 status_update_manager.cpp:203] Recovering status update manager
I0905 09:06:23.497220  6128 containerizer.cpp:609] Recovering containerizer
I0905 09:06:23.499400  6125 provisioner.cpp:416] Provisioner recovery complete
I0905 09:06:23.499925  6127 slave.cpp:6295] Finished recovery
I0905 09:06:23.500577  6127 slave.cpp:6477] Querying resource estimator for oversubscribable
resources
I0905 09:06:23.500988  6128 slave.cpp:6491] Received oversubscribable resources {} from the
resource estimator
I0905 09:06:23.504917  6129 process.cpp:3933] Handling HTTP event for process 'slave(800)'
with path: '/slave(800)/monitor/statistics'
I0905 09:06:23.507169  6128 http.cpp:1166] HTTP GET for /slave(800)/monitor/statistics from
172.17.0.2:59524
I0905 09:06:23.507419  6128 http.cpp:957] Authorizing principal 'test-principal' to GET the
'/monitor/statistics' endpoint
I0905 09:06:23.512707  6105 slave.cpp:843] Agent terminating
[       OK ] Endpoint/SlaveEndpointTest.NoAuthorizer/0 (48 ms)
[ RUN      ] Endpoint/SlaveEndpointTest.NoAuthorizer/1
I0905 09:06:23.531411  6105 containerizer.cpp:246] Using isolation: posix/cpu,posix/mem,filesystem/posix,network/cni,environment_secret
W0905 09:06:23.532199  6105 backend.cpp:76] Failed to create 'overlay' backend: OverlayBackend
requires root privileges
W0905 09:06:23.532402  6105 backend.cpp:76] Failed to create 'bind' backend: BindBackend requires
root privileges
I0905 09:06:23.532444  6105 provisioner.cpp:255] Using default backend 'copy'
I0905 09:06:23.535157  6105 cluster.cpp:448] Creating default 'local' authorizer
I0905 09:06:23.538348  6130 slave.cpp:250] Mesos agent started on (801)@172.17.0.2:41901
I0905 09:06:23.538390  6130 slave.cpp:251] Flags at startup: --acls="" --appc_simple_discovery_uri_prefix="http://"
--appc_store_dir="/tmp/Endpoint_SlaveEndpointTest_NoAuthorizer_1_vN25d8/store/appc" --authenticate_http_readonly="true"
--authenticate_http_readwrite="true" --authenticatee="crammd5" --authentication_backoff_factor="1secs"
--authorizer="local" --cgroups_cpu_enable_pids_and_tids_count="false" --cgroups_enable_cfs="false"
--cgroups_hierarchy="/sys/fs/cgroup" --cgroups_limit_swap="false" --cgroups_root="mesos" --container_disk_watch_interval="15secs"
--containerizers="mesos" --credential="/tmp/Endpoint_SlaveEndpointTest_NoAuthorizer_1_vN25d8/credential"
--default_role="*" --disallow_sharing_agent_pid_namespace="false" --disk_watch_interval="1mins"
--docker="docker" --docker_kill_orphans="true" --docker_registry="https://registry-1.docker.io"
--docker_remove_delay="6hrs" --docker_socket="/var/run/docker.sock" --docker_stop_timeout="0ns"
--docker_store_dir="/tmp/Endpoint_SlaveEndpointTest_NoAuthorizer_1_vN25d8/store/docker" --docker_volume_checkpoint_dir="/var/run/mesos/isolators/docker/volume"
--enforce_container_disk_quota="false" --executor_registration_timeout="1mins" --executor_reregistration_timeout="2secs"
--executor_shutdown_grace_period="5secs" --fetcher_cache_dir="/tmp/Endpoint_SlaveEndpointTest_NoAuthorizer_1_vN25d8/fetch"
--fetcher_cache_size="2GB" --frameworks_home="" --gc_delay="1weeks" --gc_disk_headroom="0.1"
--hadoop_home="" --help="false" --hostname_lookup="true" --http_command_executor="false" --http_credentials="/tmp/Endpoint_SlaveEndpointTest_NoAuthorizer_1_vN25d8/http_credentials"
--http_heartbeat_interval="30secs" --initialize_driver_logging="true" --isolation="posix/cpu,posix/mem"
--launcher="posix" --launcher_dir="/mesos/mesos-1.4.0/_build/src" --logbufsecs="0" --logging_level="INFO"
--max_completed_executors_per_framework="150" --oversubscribed_resources_interval="15secs"
--perf_duration="10secs" --perf_interval="1mins" --port="5051" --qos_correction_interval_min="0ns"
--quiet="false" --recover="reconnect" --recovery_timeout="15mins" --registration_backoff_factor="10ms"
--resources="cpus:2;gpus:0;mem:1024;disk:1024;ports:[31000-32000]" --revocable_cpu_low_priority="true"
--runtime_dir="/tmp/Endpoint_SlaveEndpointTest_NoAuthorizer_1_vN25d8" --sandbox_directory="/mnt/mesos/sandbox"
--strict="true" --switch_user="true" --systemd_enable_support="true" --systemd_runtime_directory="/run/systemd/system"
--version="false" --work_dir="/tmp/Endpoint_SlaveEndpointTest_NoAuthorizer_1_4xvbfU"
I0905 09:06:23.539417  6130 credentials.hpp:86] Loading credential for authentication from
'/tmp/Endpoint_SlaveEndpointTest_NoAuthorizer_1_vN25d8/credential'
I0905 09:06:23.539683  6130 slave.cpp:283] Agent using credential for: test-principal
I0905 09:06:23.539710  6130 credentials.hpp:37] Loading credentials for authentication from
'/tmp/Endpoint_SlaveEndpointTest_NoAuthorizer_1_vN25d8/http_credentials'
I0905 09:06:23.540112  6130 http.cpp:1026] Creating default 'basic' HTTP authenticator for
realm 'mesos-agent-readonly'
I0905 09:06:23.540405  6130 http.cpp:1026] Creating default 'basic' HTTP authenticator for
realm 'mesos-agent-readwrite'
I0905 09:06:23.542654  6130 slave.cpp:565] Agent resources: [{"name":"cpus","scalar":{"value":2.0},"type":"SCALAR"},{"name":"mem","scalar":{"value":1024.0},"type":"SCALAR"},{"name":"disk","scalar":{"value":1024.0},"type":"SCALAR"},{"name":"ports","ranges":{"range":[{"begin":31000,"end":32000}]},"type":"RANGES"}]
I0905 09:06:23.543100  6130 slave.cpp:573] Agent attributes: [  ]
I0905 09:06:23.543123  6130 slave.cpp:582] Agent hostname: c3c94b45d47a
I0905 09:06:23.543395  6127 status_update_manager.cpp:177] Pausing sending status updates
I0905 09:06:23.545604  6124 state.cpp:64] Recovering state from '/tmp/Endpoint_SlaveEndpointTest_NoAuthorizer_1_4xvbfU/meta'
I0905 09:06:23.546078  6131 status_update_manager.cpp:203] Recovering status update manager
I0905 09:06:23.546383  6130 containerizer.cpp:609] Recovering containerizer
I0905 09:06:23.548653  6126 provisioner.cpp:416] Provisioner recovery complete
I0905 09:06:23.549188  6124 slave.cpp:6295] Finished recovery
I0905 09:06:23.549859  6124 slave.cpp:6477] Querying resource estimator for oversubscribable
resources
I0905 09:06:23.550285  6128 slave.cpp:6491] Received oversubscribable resources {} from the
resource estimator
I0905 09:06:23.554352  6128 process.cpp:3933] Handling HTTP event for process 'slave(801)'
with path: '/slave(801)/monitor/statistics.json'
I0905 09:06:23.556565  6129 http.cpp:1166] HTTP GET for /slave(801)/monitor/statistics.json
from 172.17.0.2:59526
I0905 09:06:23.556735  6129 http.cpp:957] Authorizing principal 'test-principal' to GET the
'/monitor/statistics.json' endpoint
I0905 09:06:23.562221  6129 slave.cpp:843] Agent terminating
[       OK ] Endpoint/SlaveEndpointTest.NoAuthorizer/1 (49 ms)
[ RUN      ] Endpoint/SlaveEndpointTest.NoAuthorizer/2
I0905 09:06:23.580610  6105 containerizer.cpp:246] Using isolation: posix/cpu,posix/mem,filesystem/posix,network/cni,environment_secret
W0905 09:06:23.581408  6105 backend.cpp:76] Failed to create 'overlay' backend: OverlayBackend
requires root privileges
W0905 09:06:23.581614  6105 backend.cpp:76] Failed to create 'bind' backend: BindBackend requires
root privileges
I0905 09:06:23.581660  6105 provisioner.cpp:255] Using default backend 'copy'
I0905 09:06:23.584420  6105 cluster.cpp:448] Creating default 'local' authorizer
I0905 09:06:23.587512  6124 slave.cpp:250] Mesos agent started on (802)@172.17.0.2:41901
I0905 09:06:23.587554  6124 slave.cpp:251] Flags at startup: --acls="" --appc_simple_discovery_uri_prefix="http://"
--appc_store_dir="/tmp/Endpoint_SlaveEndpointTest_NoAuthorizer_2_3cQ4A2/store/appc" --authenticate_http_readonly="true"
--authenticate_http_readwrite="true" --authenticatee="crammd5" --authentication_backoff_factor="1secs"
--authorizer="local" --cgroups_cpu_enable_pids_and_tids_count="false" --cgroups_enable_cfs="false"
--cgroups_hierarchy="/sys/fs/cgroup" --cgroups_limit_swap="false" --cgroups_root="mesos" --container_disk_watch_interval="15secs"
--containerizers="mesos" --credential="/tmp/Endpoint_SlaveEndpointTest_NoAuthorizer_2_3cQ4A2/credential"
--default_role="*" --disallow_sharing_agent_pid_namespace="false" --disk_watch_interval="1mins"
--docker="docker" --docker_kill_orphans="true" --docker_registry="https://registry-1.docker.io"
--docker_remove_delay="6hrs" --docker_socket="/var/run/docker.sock" --docker_stop_timeout="0ns"
--docker_store_dir="/tmp/Endpoint_SlaveEndpointTest_NoAuthorizer_2_3cQ4A2/store/docker" --docker_volume_checkpoint_dir="/var/run/mesos/isolators/docker/volume"
--enforce_container_disk_quota="false" --executor_registration_timeout="1mins" --executor_reregistration_timeout="2secs"
--executor_shutdown_grace_period="5secs" --fetcher_cache_dir="/tmp/Endpoint_SlaveEndpointTest_NoAuthorizer_2_3cQ4A2/fetch"
--fetcher_cache_size="2GB" --frameworks_home="" --gc_delay="1weeks" --gc_disk_headroom="0.1"
--hadoop_home="" --help="false" --hostname_lookup="true" --http_command_executor="false" --http_credentials="/tmp/Endpoint_SlaveEndpointTest_NoAuthorizer_2_3cQ4A2/http_credentials"
--http_heartbeat_interval="30secs" --initialize_driver_logging="true" --isolation="posix/cpu,posix/mem"
--launcher="posix" --launcher_dir="/mesos/mesos-1.4.0/_build/src" --logbufsecs="0" --logging_level="INFO"
--max_completed_executors_per_framework="150" --oversubscribed_resources_interval="15secs"
--perf_duration="10secs" --perf_interval="1mins" --port="5051" --qos_correction_interval_min="0ns"
--quiet="false" --recover="reconnect" --recovery_timeout="15mins" --registration_backoff_factor="10ms"
--resources="cpus:2;gpus:0;mem:1024;disk:1024;ports:[31000-32000]" --revocable_cpu_low_priority="true"
--runtime_dir="/tmp/Endpoint_SlaveEndpointTest_NoAuthorizer_2_3cQ4A2" --sandbox_directory="/mnt/mesos/sandbox"
--strict="true" --switch_user="true" --systemd_enable_support="true" --systemd_runtime_directory="/run/systemd/system"
--version="false" --work_dir="/tmp/Endpoint_SlaveEndpointTest_NoAuthorizer_2_4JY9tO"
I0905 09:06:23.588361  6124 credentials.hpp:86] Loading credential for authentication from
'/tmp/Endpoint_SlaveEndpointTest_NoAuthorizer_2_3cQ4A2/credential'
I0905 09:06:23.588627  6124 slave.cpp:283] Agent using credential for: test-principal
I0905 09:06:23.588665  6124 credentials.hpp:37] Loading credentials for authentication from
'/tmp/Endpoint_SlaveEndpointTest_NoAuthorizer_2_3cQ4A2/http_credentials'
I0905 09:06:23.589063  6124 http.cpp:1026] Creating default 'basic' HTTP authenticator for
realm 'mesos-agent-readonly'
I0905 09:06:23.589373  6124 http.cpp:1026] Creating default 'basic' HTTP authenticator for
realm 'mesos-agent-readwrite'
I0905 09:06:23.591652  6124 slave.cpp:565] Agent resources: [{"name":"cpus","scalar":{"value":2.0},"type":"SCALAR"},{"name":"mem","scalar":{"value":1024.0},"type":"SCALAR"},{"name":"disk","scalar":{"value":1024.0},"type":"SCALAR"},{"name":"ports","ranges":{"range":[{"begin":31000,"end":32000}]},"type":"RANGES"}]
I0905 09:06:23.592097  6124 slave.cpp:573] Agent attributes: [  ]
I0905 09:06:23.592119  6124 slave.cpp:582] Agent hostname: c3c94b45d47a
I0905 09:06:23.592335  6129 status_update_manager.cpp:177] Pausing sending status updates
I0905 09:06:23.594570  6130 state.cpp:64] Recovering state from '/tmp/Endpoint_SlaveEndpointTest_NoAuthorizer_2_4JY9tO/meta'
I0905 09:06:23.594954  6128 status_update_manager.cpp:203] Recovering status update manager
I0905 09:06:23.595311  6127 containerizer.cpp:609] Recovering containerizer
I0905 09:06:23.597548  6125 provisioner.cpp:416] Provisioner recovery complete
I0905 09:06:23.598282  6128 slave.cpp:6295] Finished recovery
I0905 09:06:23.599015  6128 slave.cpp:6477] Querying resource estimator for oversubscribable
resources
I0905 09:06:23.599508  6127 slave.cpp:6491] Received oversubscribable resources {} from the
resource estimator
I0905 09:06:23.603449  6124 process.cpp:3933] Handling HTTP event for process 'slave(802)'
with path: '/slave(802)/containers'
I0905 09:06:23.605433  6127 http.cpp:1166] HTTP GET for /slave(802)/containers from 172.17.0.2:59528
I0905 09:06:23.605558  6127 http.cpp:957] Authorizing principal 'test-principal' to GET the
'/containers' endpoint
I0905 09:06:23.611178  6129 slave.cpp:843] Agent terminating
[       OK ] Endpoint/SlaveEndpointTest.NoAuthorizer/2 (49 ms)
[----------] 9 tests from Endpoint/SlaveEndpointTest (446 ms total)

[----------] 2 tests from ContainerizerType/DefaultContainerDNSFlagTest
[ RUN      ] ContainerizerType/DefaultContainerDNSFlagTest.ValidateFlag/0
[       OK ] ContainerizerType/DefaultContainerDNSFlagTest.ValidateFlag/0 (18 ms)
[ RUN      ] ContainerizerType/DefaultContainerDNSFlagTest.ValidateFlag/1
[       OK ] ContainerizerType/DefaultContainerDNSFlagTest.ValidateFlag/1 (19 ms)
[----------] 2 tests from ContainerizerType/DefaultContainerDNSFlagTest (38 ms total)

[----------] Global test environment tear-down
[==========] 1652 tests from 182 test cases ran. (804119 ms total)
[  PASSED  ] 1647 tests.
[  FAILED  ] 5 tests, listed below:
[  FAILED  ] CommandExecutorCheckTest.CommandCheckDeliveredAndReconciled
[  FAILED  ] DefaultExecutorCheckTest.CommandCheckDeliveredAndReconciled
[  FAILED  ] DefaultExecutorCheckTest.CommandCheckStatusChange
[  FAILED  ] DefaultExecutorCheckTest.CommandCheckSeesParentsEnv
[  FAILED  ] DefaultExecutorCheckTest.CommandCheckSharesWorkDirWithTask

 5 FAILED TESTS
  YOU HAVE 20 DISABLED TESTS

I0905 09:06:23.804239  6132 process.cpp:1072] Failed to accept socket: future discarded
make[4]: *** [check-local] Error 1
make[4]: Leaving directory `/mesos/mesos-1.4.0/_build/src'
make[3]: *** [check-am] Error 2
make[3]: Leaving directory `/mesos/mesos-1.4.0/_build/src'
make[2]: *** [check] Error 2
make[2]: Leaving directory `/mesos/mesos-1.4.0/_build/src'
make[1]: *** [check-recursive] Error 1
make[1]: Leaving directory `/mesos/mesos-1.4.0/_build'
make: *** [distcheck] Error 1
+ docker rmi mesos-1504597145-6307
Untagged: mesos-1504597145-6307:latest
Deleted: sha256:f45c21899995a74c634dd8a72c3f3989628b7b81cf5be76193f96af5e483e540
Deleted: sha256:c60b7c39d396fcfb6def130e2c819f5a66287441c604fb659ce0d4980d11fa07
Deleted: sha256:6014744335f8fa34e40152d322ed373f6de04330ef53e85e20a4a9c29415d212
Deleted: sha256:3c237d6fc0e1c937ffb303972c6d1667c5e30c55a3f45f1114b04433712ab5f9
Deleted: sha256:05a994736386f7dd6cf8b1479139e8b633405dc174633208f515f1d4ada3eed3
Deleted: sha256:081b3c9e43bb0c51fb1e65e7e82165ae84f045513c415fc6fe992fdcd8d730d4
Deleted: sha256:df439d8cd2bd337ac8d8eada136bd86b06873c5eff95e53409baa9a8d3ab448b
Deleted: sha256:6a18247c3c1b65f6f8b3e9a60d4ee00af7923822ddbda6fc85804da2f3fe4cb9
Deleted: sha256:b08556dea6a06f3a5e7a2600c7aafacdc011186f01fe71a25ecfb312515b5ab9
Deleted: sha256:dc5b3145f6e42d6fa1a4198febd8121b9506bff7e4e427f21d4b2cfcb9337e3c
Deleted: sha256:bb2c13edb124737e6925d2a70b4617b342abce62c07b9ccb0f47a1df3ad79b40
Deleted: sha256:c674c1c84cf55681c3ac46e6aca33e39ac9a8adecf6a443abd66e9064d58414e
Deleted: sha256:b425971223ef21a0723c13ec9082a72a4318091b92eaba915e1564460d5202dd
Deleted: sha256:2b3b2022f7e5260d4fb911c643d95843f29de91b0fd3c03dabc11a5f689662e7
Deleted: sha256:b7d0648a7c7410539697c897a84831a8a93ec9480d092a33166032829da63971
Deleted: sha256:635c9ccc0fdf2f99e3082765ff56ea150338ef7786cc8efba3affbd948bd984b
Deleted: sha256:7e689a7b7124070d46a4967a1fc9ee7ef1c0d50bf85b8a134925eb4b3b33d1da
Deleted: sha256:c36b38804d26f775b8f7fc0d5d33994ce958d456b6e575b45d8f491bcc065477
Deleted: sha256:09e222f42f445ce32c0c4791397f2fa1420362296e50f372d14d66c3f51ecd91
Deleted: sha256:13d43f3b1b6a3f12b9fc1c669c2f749a5bf8f27d377bba6cc1c7799c246cabe8
Deleted: sha256:10fbd99fbe7fb142a5e67750e2e623a73dd9f80b5c44d14785c45a7de8f5879d
Deleted: sha256:75342a2d70683e3c28caebf313df8ad36147618b58c3106520a4471e444dfca7
Deleted: sha256:bc4d9835cbbc3c181f391d43f8da5e70eec842315aae003d127f24d67e528ab6
Deleted: sha256:eb5186ac63f39bd79cfb325883cec6453f4c5289d983208680b5298cbb1180f1
Deleted: sha256:acf6fd5a8b3ce154e0c3b565211f5c62cc7563a8bc462248655ebdefc1c111bd
Build step 'Execute shell' marked build as failure
Not sending mail to unregistered user songzihao1990@gmail.com

Mime
View raw message