mesos-builds mailing list archives

Site index · List index
Message view « Date » · « Thread »
Top « Date » · « Thread »
From Apache Jenkins Server <jenk...@builds.apache.org>
Subject Build failed in Jenkins: Mesos-Buildbot » autotools,clang,--verbose,GLOG_v=1 MESOS_VERBOSE=1,ubuntu:14.04,(ubuntu)&&(!ubuntu-us1)&&(!ubuntu-eu2)&&(!qnode3)&&(!H23) #4250
Date Thu, 21 Sep 2017 22:10:15 GMT
See <https://builds.apache.org/job/Mesos-Buildbot/BUILDTOOL=autotools,COMPILER=clang,CONFIGURATION=--verbose,ENVIRONMENT=GLOG_v=1%20MESOS_VERBOSE=1,OS=ubuntu%3A14.04,label_exp=(ubuntu)&&(!ubuntu-us1)&&(!ubuntu-eu2)&&(!qnode3)&&(!H23)/4250/display/redirect?page=changes>

Changes:

[bmahler] Fixed a javascript lint issue related to ellipsis in the webui.

------------------------------------------
[...truncated 31.72 MB...]
I0921 22:10:04.172919  3905 credentials.hpp:37] Loading credentials for authentication from
'/tmp/Endpoint_SlaveEndpointTest_AuthorizedRequest_2_LWGudi/http_credentials'
I0921 22:10:04.173118  3905 http.cpp:1045] Creating default 'basic' HTTP authenticator for
realm 'mesos-agent-readonly'
I0921 22:10:04.173264  3905 http.cpp:1045] Creating default 'basic' HTTP authenticator for
realm 'mesos-agent-readwrite'
I0921 22:10:04.174459  3905 slave.cpp:585] Agent resources: [{"name":"cpus","scalar":{"value":2.0},"type":"SCALAR"},{"name":"mem","scalar":{"value":1024.0},"type":"SCALAR"},{"name":"disk","scalar":{"value":1024.0},"type":"SCALAR"},{"name":"ports","ranges":{"range":[{"begin":31000,"end":32000}]},"type":"RANGES"}]
I0921 22:10:04.174649  3905 slave.cpp:593] Agent attributes: [  ]
I0921 22:10:04.174661  3905 slave.cpp:602] Agent hostname: 8e35ec13d892
I0921 22:10:04.174763  3904 status_update_manager.cpp:177] Pausing sending status updates
I0921 22:10:04.176209  3902 state.cpp:64] Recovering state from '/tmp/Endpoint_SlaveEndpointTest_AuthorizedRequest_2_QO5BbV/meta'
I0921 22:10:04.176606  3901 status_update_manager.cpp:203] Recovering status update manager
I0921 22:10:04.176862  3900 containerizer.cpp:648] Recovering containerizer
I0921 22:10:04.178375  3897 provisioner.cpp:416] Provisioner recovery complete
I0921 22:10:04.178808  3901 slave.cpp:6322] Finished recovery
I0921 22:10:04.179407  3901 slave.cpp:6504] Querying resource estimator for oversubscribable
resources
I0921 22:10:04.179718  3900 slave.cpp:6518] Received oversubscribable resources {} from the
resource estimator
I0921 22:10:04.182384  3897 process.cpp:3929] Handling HTTP event for process 'slave(811)'
with path: '/slave(811)/containers'
I0921 22:10:04.183833  3895 http.cpp:1185] HTTP GET for /slave(811)/containers from 172.17.0.2:46120
I0921 22:10:04.183931  3895 http.cpp:976] Authorizing principal 'test-principal' to GET the
'/containers' endpoint
I0921 22:10:04.187963  3877 slave.cpp:869] Agent terminating
[       OK ] Endpoint/SlaveEndpointTest.AuthorizedRequest/2 (31 ms)
[ RUN      ] Endpoint/SlaveEndpointTest.UnauthorizedRequest/0
I0921 22:10:04.200278  3877 containerizer.cpp:292] Using isolation { environment_secret, posix/cpu,
posix/mem, filesystem/posix, network/cni }
W0921 22:10:04.200819  3877 backend.cpp:76] Failed to create 'aufs' backend: AufsBackend requires
root privileges
W0921 22:10:04.200932  3877 backend.cpp:76] Failed to create 'bind' backend: BindBackend requires
root privileges
I0921 22:10:04.200968  3877 provisioner.cpp:255] Using default backend 'copy'
I0921 22:10:04.204550  3907 slave.cpp:254] Mesos agent started on (812)@172.17.0.2:39675
I0921 22:10:04.204603  3907 slave.cpp:255] Flags at startup: --acls="" --appc_simple_discovery_uri_prefix="http://"
--appc_store_dir="/tmp/Endpoint_SlaveEndpointTest_UnauthorizedRequest_0_PZjpCM/store/appc"
--authenticate_http_readonly="true" --authenticate_http_readwrite="true" --authenticatee="crammd5"
--authentication_backoff_factor="1secs" --authorizer="local" --cgroups_cpu_enable_pids_and_tids_count="false"
--cgroups_enable_cfs="false" --cgroups_hierarchy="/sys/fs/cgroup" --cgroups_limit_swap="false"
--cgroups_root="mesos" --container_disk_watch_interval="15secs" --containerizers="mesos" --credential="/tmp/Endpoint_SlaveEndpointTest_UnauthorizedRequest_0_PZjpCM/credential"
--default_role="*" --disallow_sharing_agent_pid_namespace="false" --disk_watch_interval="1mins"
--docker="docker" --docker_kill_orphans="true" --docker_registry="https://registry-1.docker.io"
--docker_remove_delay="6hrs" --docker_socket="/var/run/docker.sock" --docker_stop_timeout="0ns"
--docker_store_dir="/tmp/Endpoint_SlaveEndpointTest_UnauthorizedRequest_0_PZjpCM/store/docker"
--docker_volume_checkpoint_dir="/var/run/mesos/isolators/docker/volume" --enforce_container_disk_quota="false"
--executor_registration_timeout="1mins" --executor_reregistration_timeout="2secs" --executor_shutdown_grace_period="5secs"
--fetcher_cache_dir="/tmp/Endpoint_SlaveEndpointTest_UnauthorizedRequest_0_PZjpCM/fetch" --fetcher_cache_size="2GB"
--frameworks_home="" --gc_delay="1weeks" --gc_disk_headroom="0.1" --hadoop_home="" --help="false"
--hostname_lookup="true" --http_command_executor="false" --http_credentials="/tmp/Endpoint_SlaveEndpointTest_UnauthorizedRequest_0_PZjpCM/http_credentials"
--http_heartbeat_interval="30secs" --initialize_driver_logging="true" --isolation="posix/cpu,posix/mem"
--launcher="posix" --launcher_dir="/mesos/mesos-1.5.0/_build/src" --logbufsecs="0" --logging_level="INFO"
--max_completed_executors_per_framework="150" --oversubscribed_resources_interval="15secs"
--perf_duration="10secs" --perf_interval="1mins" --port="5051" --qos_correction_interval_min="0ns"
--quiet="false" --recover="reconnect" --recovery_timeout="15mins" --registration_backoff_factor="10ms"
--resources="cpus:2;gpus:0;mem:1024;disk:1024;ports:[31000-32000]" --revocable_cpu_low_priority="true"
--runtime_dir="/tmp/Endpoint_SlaveEndpointTest_UnauthorizedRequest_0_PZjpCM" --sandbox_directory="/mnt/mesos/sandbox"
--strict="true" --switch_user="true" --systemd_enable_support="true" --systemd_runtime_directory="/run/systemd/system"
--version="false" --work_dir="/tmp/Endpoint_SlaveEndpointTest_UnauthorizedRequest_0_kyVkvp"
--zk_session_timeout="10secs"
I0921 22:10:04.205253  3907 credentials.hpp:86] Loading credential for authentication from
'/tmp/Endpoint_SlaveEndpointTest_UnauthorizedRequest_0_PZjpCM/credential'
I0921 22:10:04.205500  3907 slave.cpp:287] Agent using credential for: test-principal
I0921 22:10:04.205529  3907 credentials.hpp:37] Loading credentials for authentication from
'/tmp/Endpoint_SlaveEndpointTest_UnauthorizedRequest_0_PZjpCM/http_credentials'
I0921 22:10:04.205808  3907 http.cpp:1045] Creating default 'basic' HTTP authenticator for
realm 'mesos-agent-readonly'
I0921 22:10:04.205979  3907 http.cpp:1045] Creating default 'basic' HTTP authenticator for
realm 'mesos-agent-readwrite'
I0921 22:10:04.207298  3907 slave.cpp:585] Agent resources: [{"name":"cpus","scalar":{"value":2.0},"type":"SCALAR"},{"name":"mem","scalar":{"value":1024.0},"type":"SCALAR"},{"name":"disk","scalar":{"value":1024.0},"type":"SCALAR"},{"name":"ports","ranges":{"range":[{"begin":31000,"end":32000}]},"type":"RANGES"}]
I0921 22:10:04.207510  3907 slave.cpp:593] Agent attributes: [  ]
I0921 22:10:04.207525  3907 slave.cpp:602] Agent hostname: 8e35ec13d892
I0921 22:10:04.207679  3896 status_update_manager.cpp:177] Pausing sending status updates
I0921 22:10:04.209506  3904 state.cpp:64] Recovering state from '/tmp/Endpoint_SlaveEndpointTest_UnauthorizedRequest_0_kyVkvp/meta'
I0921 22:10:04.209909  3910 status_update_manager.cpp:203] Recovering status update manager
I0921 22:10:04.210149  3899 containerizer.cpp:648] Recovering containerizer
I0921 22:10:04.212091  3900 provisioner.cpp:416] Provisioner recovery complete
I0921 22:10:04.212595  3902 slave.cpp:6322] Finished recovery
I0921 22:10:04.213485  3902 slave.cpp:6504] Querying resource estimator for oversubscribable
resources
I0921 22:10:04.218772  3899 slave.cpp:6518] Received oversubscribable resources {} from the
resource estimator
I0921 22:10:04.222719  3901 process.cpp:3929] Handling HTTP event for process 'slave(812)'
with path: '/slave(812)/monitor/statistics'
I0921 22:10:04.224566  3905 http.cpp:1185] HTTP GET for /slave(812)/monitor/statistics from
172.17.0.2:46121
I0921 22:10:04.224699  3905 http.cpp:976] Authorizing principal 'test-principal' to GET the
'/monitor/statistics' endpoint
I0921 22:10:04.227587  3877 slave.cpp:869] Agent terminating
[       OK ] Endpoint/SlaveEndpointTest.UnauthorizedRequest/0 (43 ms)
[ RUN      ] Endpoint/SlaveEndpointTest.UnauthorizedRequest/1
I0921 22:10:04.244873  3877 containerizer.cpp:292] Using isolation { environment_secret, posix/cpu,
posix/mem, filesystem/posix, network/cni }
W0921 22:10:04.245442  3877 backend.cpp:76] Failed to create 'aufs' backend: AufsBackend requires
root privileges
W0921 22:10:04.245580  3877 backend.cpp:76] Failed to create 'bind' backend: BindBackend requires
root privileges
I0921 22:10:04.245625  3877 provisioner.cpp:255] Using default backend 'copy'
I0921 22:10:04.249697  3902 slave.cpp:254] Mesos agent started on (813)@172.17.0.2:39675
I0921 22:10:04.249858  3902 slave.cpp:255] Flags at startup: --acls="" --appc_simple_discovery_uri_prefix="http://"
--appc_store_dir="/tmp/Endpoint_SlaveEndpointTest_UnauthorizedRequest_1_Hn2bsh/store/appc"
--authenticate_http_readonly="true" --authenticate_http_readwrite="true" --authenticatee="crammd5"
--authentication_backoff_factor="1secs" --authorizer="local" --cgroups_cpu_enable_pids_and_tids_count="false"
--cgroups_enable_cfs="false" --cgroups_hierarchy="/sys/fs/cgroup" --cgroups_limit_swap="false"
--cgroups_root="mesos" --container_disk_watch_interval="15secs" --containerizers="mesos" --credential="/tmp/Endpoint_SlaveEndpointTest_UnauthorizedRequest_1_Hn2bsh/credential"
--default_role="*" --disallow_sharing_agent_pid_namespace="false" --disk_watch_interval="1mins"
--docker="docker" --docker_kill_orphans="true" --docker_registry="https://registry-1.docker.io"
--docker_remove_delay="6hrs" --docker_socket="/var/run/docker.sock" --docker_stop_timeout="0ns"
--docker_store_dir="/tmp/Endpoint_SlaveEndpointTest_UnauthorizedRequest_1_Hn2bsh/store/docker"
--docker_volume_checkpoint_dir="/var/run/mesos/isolators/docker/volume" --enforce_container_disk_quota="false"
--executor_registration_timeout="1mins" --executor_reregistration_timeout="2secs" --executor_shutdown_grace_period="5secs"
--fetcher_cache_dir="/tmp/Endpoint_SlaveEndpointTest_UnauthorizedRequest_1_Hn2bsh/fetch" --fetcher_cache_size="2GB"
--frameworks_home="" --gc_delay="1weeks" --gc_disk_headroom="0.1" --hadoop_home="" --help="false"
--hostname_lookup="true" --http_command_executor="false" --http_credentials="/tmp/Endpoint_SlaveEndpointTest_UnauthorizedRequest_1_Hn2bsh/http_credentials"
--http_heartbeat_interval="30secs" --initialize_driver_logging="true" --isolation="posix/cpu,posix/mem"
--launcher="posix" --launcher_dir="/mesos/mesos-1.5.0/_build/src" --logbufsecs="0" --logging_level="INFO"
--max_completed_executors_per_framework="150" --oversubscribed_resources_interval="15secs"
--perf_duration="10secs" --perf_interval="1mins" --port="5051" --qos_correction_interval_min="0ns"
--quiet="false" --recover="reconnect" --recovery_timeout="15mins" --registration_backoff_factor="10ms"
--resources="cpus:2;gpus:0;mem:1024;disk:1024;ports:[31000-32000]" --revocable_cpu_low_priority="true"
--runtime_dir="/tmp/Endpoint_SlaveEndpointTest_UnauthorizedRequest_1_Hn2bsh" --sandbox_directory="/mnt/mesos/sandbox"
--strict="true" --switch_user="true" --systemd_enable_support="true" --systemd_runtime_directory="/run/systemd/system"
--version="false" --work_dir="/tmp/Endpoint_SlaveEndpointTest_UnauthorizedRequest_1_4BzZdU"
--zk_session_timeout="10secs"
I0921 22:10:04.250535  3902 credentials.hpp:86] Loading credential for authentication from
'/tmp/Endpoint_SlaveEndpointTest_UnauthorizedRequest_1_Hn2bsh/credential'
I0921 22:10:04.250816  3902 slave.cpp:287] Agent using credential for: test-principal
I0921 22:10:04.250888  3902 credentials.hpp:37] Loading credentials for authentication from
'/tmp/Endpoint_SlaveEndpointTest_UnauthorizedRequest_1_Hn2bsh/http_credentials'
I0921 22:10:04.251204  3902 http.cpp:1045] Creating default 'basic' HTTP authenticator for
realm 'mesos-agent-readonly'
I0921 22:10:04.251509  3902 http.cpp:1045] Creating default 'basic' HTTP authenticator for
realm 'mesos-agent-readwrite'
I0921 22:10:04.253520  3902 slave.cpp:585] Agent resources: [{"name":"cpus","scalar":{"value":2.0},"type":"SCALAR"},{"name":"mem","scalar":{"value":1024.0},"type":"SCALAR"},{"name":"disk","scalar":{"value":1024.0},"type":"SCALAR"},{"name":"ports","ranges":{"range":[{"begin":31000,"end":32000}]},"type":"RANGES"}]
I0921 22:10:04.253836  3902 slave.cpp:593] Agent attributes: [  ]
I0921 22:10:04.253862  3902 slave.cpp:602] Agent hostname: 8e35ec13d892
I0921 22:10:04.254120  3895 status_update_manager.cpp:177] Pausing sending status updates
I0921 22:10:04.255565  3907 state.cpp:64] Recovering state from '/tmp/Endpoint_SlaveEndpointTest_UnauthorizedRequest_1_4BzZdU/meta'
I0921 22:10:04.255985  3906 status_update_manager.cpp:203] Recovering status update manager
I0921 22:10:04.256196  3910 containerizer.cpp:648] Recovering containerizer
I0921 22:10:04.260974  3904 provisioner.cpp:416] Provisioner recovery complete
I0921 22:10:04.261854  3907 slave.cpp:6322] Finished recovery
I0921 22:10:04.262594  3907 slave.cpp:6504] Querying resource estimator for oversubscribable
resources
I0921 22:10:04.263072  3909 slave.cpp:6518] Received oversubscribable resources {} from the
resource estimator
I0921 22:10:04.269727  3908 process.cpp:3929] Handling HTTP event for process 'slave(813)'
with path: '/slave(813)/monitor/statistics.json'
I0921 22:10:04.271236  3899 http.cpp:1185] HTTP GET for /slave(813)/monitor/statistics.json
from 172.17.0.2:46122
I0921 22:10:04.271328  3899 http.cpp:976] Authorizing principal 'test-principal' to GET the
'/monitor/statistics.json' endpoint
I0921 22:10:04.273947  3901 slave.cpp:869] Agent terminating
[       OK ] Endpoint/SlaveEndpointTest.UnauthorizedRequest/1 (42 ms)
[ RUN      ] Endpoint/SlaveEndpointTest.UnauthorizedRequest/2
I0921 22:10:04.286948  3877 containerizer.cpp:292] Using isolation { environment_secret, posix/cpu,
posix/mem, filesystem/posix, network/cni }
W0921 22:10:04.287616  3877 backend.cpp:76] Failed to create 'aufs' backend: AufsBackend requires
root privileges
W0921 22:10:04.287771  3877 backend.cpp:76] Failed to create 'bind' backend: BindBackend requires
root privileges
I0921 22:10:04.287825  3877 provisioner.cpp:255] Using default backend 'copy'
I0921 22:10:04.291692  3910 slave.cpp:254] Mesos agent started on (814)@172.17.0.2:39675
I0921 22:10:04.291734  3910 slave.cpp:255] Flags at startup: --acls="" --appc_simple_discovery_uri_prefix="http://"
--appc_store_dir="/tmp/Endpoint_SlaveEndpointTest_UnauthorizedRequest_2_f2woKM/store/appc"
--authenticate_http_readonly="true" --authenticate_http_readwrite="true" --authenticatee="crammd5"
--authentication_backoff_factor="1secs" --authorizer="local" --cgroups_cpu_enable_pids_and_tids_count="false"
--cgroups_enable_cfs="false" --cgroups_hierarchy="/sys/fs/cgroup" --cgroups_limit_swap="false"
--cgroups_root="mesos" --container_disk_watch_interval="15secs" --containerizers="mesos" --credential="/tmp/Endpoint_SlaveEndpointTest_UnauthorizedRequest_2_f2woKM/credential"
--default_role="*" --disallow_sharing_agent_pid_namespace="false" --disk_watch_interval="1mins"
--docker="docker" --docker_kill_orphans="true" --docker_registry="https://registry-1.docker.io"
--docker_remove_delay="6hrs" --docker_socket="/var/run/docker.sock" --docker_stop_timeout="0ns"
--docker_store_dir="/tmp/Endpoint_SlaveEndpointTest_UnauthorizedRequest_2_f2woKM/store/docker"
--docker_volume_checkpoint_dir="/var/run/mesos/isolators/docker/volume" --enforce_container_disk_quota="false"
--executor_registration_timeout="1mins" --executor_reregistration_timeout="2secs" --executor_shutdown_grace_period="5secs"
--fetcher_cache_dir="/tmp/Endpoint_SlaveEndpointTest_UnauthorizedRequest_2_f2woKM/fetch" --fetcher_cache_size="2GB"
--frameworks_home="" --gc_delay="1weeks" --gc_disk_headroom="0.1" --hadoop_home="" --help="false"
--hostname_lookup="true" --http_command_executor="false" --http_credentials="/tmp/Endpoint_SlaveEndpointTest_UnauthorizedRequest_2_f2woKM/http_credentials"
--http_heartbeat_interval="30secs" --initialize_driver_logging="true" --isolation="posix/cpu,posix/mem"
--launcher="posix" --launcher_dir="/mesos/mesos-1.5.0/_build/src" --logbufsecs="0" --logging_level="INFO"
--max_completed_executors_per_framework="150" --oversubscribed_resources_interval="15secs"
--perf_duration="10secs" --perf_interval="1mins" --port="5051" --qos_correction_interval_min="0ns"
--quiet="false" --recover="reconnect" --recovery_timeout="15mins" --registration_backoff_factor="10ms"
--resources="cpus:2;gpus:0;mem:1024;disk:1024;ports:[31000-32000]" --revocable_cpu_low_priority="true"
--runtime_dir="/tmp/Endpoint_SlaveEndpointTest_UnauthorizedRequest_2_f2woKM" --sandbox_directory="/mnt/mesos/sandbox"
--strict="true" --switch_user="true" --systemd_enable_support="true" --systemd_runtime_directory="/run/systemd/system"
--version="false" --work_dir="/tmp/Endpoint_SlaveEndpointTest_UnauthorizedRequest_2_Wn0mpp"
--zk_session_timeout="10secs"
I0921 22:10:04.292119  3910 credentials.hpp:86] Loading credential for authentication from
'/tmp/Endpoint_SlaveEndpointTest_UnauthorizedRequest_2_f2woKM/credential'
I0921 22:10:04.292266  3910 slave.cpp:287] Agent using credential for: test-principal
I0921 22:10:04.292287  3910 credentials.hpp:37] Loading credentials for authentication from
'/tmp/Endpoint_SlaveEndpointTest_UnauthorizedRequest_2_f2woKM/http_credentials'
I0921 22:10:04.292498  3910 http.cpp:1045] Creating default 'basic' HTTP authenticator for
realm 'mesos-agent-readonly'
I0921 22:10:04.292678  3910 http.cpp:1045] Creating default 'basic' HTTP authenticator for
realm 'mesos-agent-readwrite'
I0921 22:10:04.293978  3910 slave.cpp:585] Agent resources: [{"name":"cpus","scalar":{"value":2.0},"type":"SCALAR"},{"name":"mem","scalar":{"value":1024.0},"type":"SCALAR"},{"name":"disk","scalar":{"value":1024.0},"type":"SCALAR"},{"name":"ports","ranges":{"range":[{"begin":31000,"end":32000}]},"type":"RANGES"}]
I0921 22:10:04.294175  3910 slave.cpp:593] Agent attributes: [  ]
I0921 22:10:04.294188  3910 slave.cpp:602] Agent hostname: 8e35ec13d892
I0921 22:10:04.294358  3900 status_update_manager.cpp:177] Pausing sending status updates
I0921 22:10:04.296052  3908 state.cpp:64] Recovering state from '/tmp/Endpoint_SlaveEndpointTest_UnauthorizedRequest_2_Wn0mpp/meta'
I0921 22:10:04.296434  3907 status_update_manager.cpp:203] Recovering status update manager
I0921 22:10:04.296640  3901 containerizer.cpp:648] Recovering containerizer
I0921 22:10:04.297912  3909 provisioner.cpp:416] Provisioner recovery complete
I0921 22:10:04.298184  3902 slave.cpp:6322] Finished recovery
I0921 22:10:04.298589  3902 slave.cpp:6504] Querying resource estimator for oversubscribable
resources
I0921 22:10:04.298804  3903 slave.cpp:6518] Received oversubscribable resources {} from the
resource estimator
I0921 22:10:04.301429  3904 process.cpp:3929] Handling HTTP event for process 'slave(814)'
with path: '/slave(814)/containers'
I0921 22:10:04.302778  3904 http.cpp:1185] HTTP GET for /slave(814)/containers from 172.17.0.2:46123
I0921 22:10:04.302861  3904 http.cpp:976] Authorizing principal 'test-principal' to GET the
'/containers' endpoint
I0921 22:10:04.305145  3910 slave.cpp:869] Agent terminating
[       OK ] Endpoint/SlaveEndpointTest.UnauthorizedRequest/2 (31 ms)
[ RUN      ] Endpoint/SlaveEndpointTest.NoAuthorizer/0
I0921 22:10:04.318913  3877 containerizer.cpp:292] Using isolation { environment_secret, posix/cpu,
posix/mem, filesystem/posix, network/cni }
W0921 22:10:04.319595  3877 backend.cpp:76] Failed to create 'aufs' backend: AufsBackend requires
root privileges
W0921 22:10:04.319730  3877 backend.cpp:76] Failed to create 'bind' backend: BindBackend requires
root privileges
I0921 22:10:04.319787  3877 provisioner.cpp:255] Using default backend 'copy'
I0921 22:10:04.321380  3877 cluster.cpp:448] Creating default 'local' authorizer
I0921 22:10:04.323077  3898 slave.cpp:254] Mesos agent started on (815)@172.17.0.2:39675
I0921 22:10:04.323117  3898 slave.cpp:255] Flags at startup: --acls="" --appc_simple_discovery_uri_prefix="http://"
--appc_store_dir="/tmp/Endpoint_SlaveEndpointTest_NoAuthorizer_0_bNpMni/store/appc" --authenticate_http_readonly="true"
--authenticate_http_readwrite="true" --authenticatee="crammd5" --authentication_backoff_factor="1secs"
--authorizer="local" --cgroups_cpu_enable_pids_and_tids_count="false" --cgroups_enable_cfs="false"
--cgroups_hierarchy="/sys/fs/cgroup" --cgroups_limit_swap="false" --cgroups_root="mesos" --container_disk_watch_interval="15secs"
--containerizers="mesos" --credential="/tmp/Endpoint_SlaveEndpointTest_NoAuthorizer_0_bNpMni/credential"
--default_role="*" --disallow_sharing_agent_pid_namespace="false" --disk_watch_interval="1mins"
--docker="docker" --docker_kill_orphans="true" --docker_registry="https://registry-1.docker.io"
--docker_remove_delay="6hrs" --docker_socket="/var/run/docker.sock" --docker_stop_timeout="0ns"
--docker_store_dir="/tmp/Endpoint_SlaveEndpointTest_NoAuthorizer_0_bNpMni/store/docker" --docker_volume_checkpoint_dir="/var/run/mesos/isolators/docker/volume"
--enforce_container_disk_quota="false" --executor_registration_timeout="1mins" --executor_reregistration_timeout="2secs"
--executor_shutdown_grace_period="5secs" --fetcher_cache_dir="/tmp/Endpoint_SlaveEndpointTest_NoAuthorizer_0_bNpMni/fetch"
--fetcher_cache_size="2GB" --frameworks_home="" --gc_delay="1weeks" --gc_disk_headroom="0.1"
--hadoop_home="" --help="false" --hostname_lookup="true" --http_command_executor="false" --http_credentials="/tmp/Endpoint_SlaveEndpointTest_NoAuthorizer_0_bNpMni/http_credentials"
--http_heartbeat_interval="30secs" --initialize_driver_logging="true" --isolation="posix/cpu,posix/mem"
--launcher="posix" --launcher_dir="/mesos/mesos-1.5.0/_build/src" --logbufsecs="0" --logging_level="INFO"
--max_completed_executors_per_framework="150" --oversubscribed_resources_interval="15secs"
--perf_duration="10secs" --perf_interval="1mins" --port="5051" --qos_correction_interval_min="0ns"
--quiet="false" --recover="reconnect" --recovery_timeout="15mins" --registration_backoff_factor="10ms"
--resources="cpus:2;gpus:0;mem:1024;disk:1024;ports:[31000-32000]" --revocable_cpu_low_priority="true"
--runtime_dir="/tmp/Endpoint_SlaveEndpointTest_NoAuthorizer_0_bNpMni" --sandbox_directory="/mnt/mesos/sandbox"
--strict="true" --switch_user="true" --systemd_enable_support="true" --systemd_runtime_directory="/run/systemd/system"
--version="false" --work_dir="/tmp/Endpoint_SlaveEndpointTest_NoAuthorizer_0_2rLEXU" --zk_session_timeout="10secs"
I0921 22:10:04.323621  3898 credentials.hpp:86] Loading credential for authentication from
'/tmp/Endpoint_SlaveEndpointTest_NoAuthorizer_0_bNpMni/credential'
I0921 22:10:04.323760  3898 slave.cpp:287] Agent using credential for: test-principal
I0921 22:10:04.323783  3898 credentials.hpp:37] Loading credentials for authentication from
'/tmp/Endpoint_SlaveEndpointTest_NoAuthorizer_0_bNpMni/http_credentials'
I0921 22:10:04.324003  3898 http.cpp:1045] Creating default 'basic' HTTP authenticator for
realm 'mesos-agent-readonly'
I0921 22:10:04.324147  3898 http.cpp:1045] Creating default 'basic' HTTP authenticator for
realm 'mesos-agent-readwrite'
I0921 22:10:04.325837  3898 slave.cpp:585] Agent resources: [{"name":"cpus","scalar":{"value":2.0},"type":"SCALAR"},{"name":"mem","scalar":{"value":1024.0},"type":"SCALAR"},{"name":"disk","scalar":{"value":1024.0},"type":"SCALAR"},{"name":"ports","ranges":{"range":[{"begin":31000,"end":32000}]},"type":"RANGES"}]
I0921 22:10:04.326112  3898 slave.cpp:593] Agent attributes: [  ]
I0921 22:10:04.326131  3898 slave.cpp:602] Agent hostname: 8e35ec13d892
I0921 22:10:04.326344  3910 status_update_manager.cpp:177] Pausing sending status updates
I0921 22:10:04.327803  3900 state.cpp:64] Recovering state from '/tmp/Endpoint_SlaveEndpointTest_NoAuthorizer_0_2rLEXU/meta'
I0921 22:10:04.328119  3895 status_update_manager.cpp:203] Recovering status update manager
I0921 22:10:04.328366  3895 containerizer.cpp:648] Recovering containerizer
I0921 22:10:04.329892  3900 provisioner.cpp:416] Provisioner recovery complete
I0921 22:10:04.330265  3903 slave.cpp:6322] Finished recovery
I0921 22:10:04.330816  3903 slave.cpp:6504] Querying resource estimator for oversubscribable
resources
I0921 22:10:04.331063  3895 slave.cpp:6518] Received oversubscribable resources {} from the
resource estimator
I0921 22:10:04.333570  3897 process.cpp:3929] Handling HTTP event for process 'slave(815)'
with path: '/slave(815)/monitor/statistics'
I0921 22:10:04.334972  3899 http.cpp:1185] HTTP GET for /slave(815)/monitor/statistics from
172.17.0.2:46124
I0921 22:10:04.335062  3899 http.cpp:976] Authorizing principal 'test-principal' to GET the
'/monitor/statistics' endpoint
I0921 22:10:04.339205  3877 slave.cpp:869] Agent terminating
[       OK ] Endpoint/SlaveEndpointTest.NoAuthorizer/0 (33 ms)
[ RUN      ] Endpoint/SlaveEndpointTest.NoAuthorizer/1
I0921 22:10:04.352818  3877 containerizer.cpp:292] Using isolation { environment_secret, posix/cpu,
posix/mem, filesystem/posix, network/cni }
W0921 22:10:04.353449  3877 backend.cpp:76] Failed to create 'aufs' backend: AufsBackend requires
root privileges
W0921 22:10:04.353581  3877 backend.cpp:76] Failed to create 'bind' backend: BindBackend requires
root privileges
I0921 22:10:04.353626  3877 provisioner.cpp:255] Using default backend 'copy'
I0921 22:10:04.355675  3877 cluster.cpp:448] Creating default 'local' authorizer
I0921 22:10:04.357419  3895 slave.cpp:254] Mesos agent started on (816)@172.17.0.2:39675
I0921 22:10:04.357455  3895 slave.cpp:255] Flags at startup: --acls="" --appc_simple_discovery_uri_prefix="http://"
--appc_store_dir="/tmp/Endpoint_SlaveEndpointTest_NoAuthorizer_1_RFr3mO/store/appc" --authenticate_http_readonly="true"
--authenticate_http_readwrite="true" --authenticatee="crammd5" --authentication_backoff_factor="1secs"
--authorizer="local" --cgroups_cpu_enable_pids_and_tids_count="false" --cgroups_enable_cfs="false"
--cgroups_hierarchy="/sys/fs/cgroup" --cgroups_limit_swap="false" --cgroups_root="mesos" --container_disk_watch_interval="15secs"
--containerizers="mesos" --credential="/tmp/Endpoint_SlaveEndpointTest_NoAuthorizer_1_RFr3mO/credential"
--default_role="*" --disallow_sharing_agent_pid_namespace="false" --disk_watch_interval="1mins"
--docker="docker" --docker_kill_orphans="true" --docker_registry="https://registry-1.docker.io"
--docker_remove_delay="6hrs" --docker_socket="/var/run/docker.sock" --docker_stop_timeout="0ns"
--docker_store_dir="/tmp/Endpoint_SlaveEndpointTest_NoAuthorizer_1_RFr3mO/store/docker" --docker_volume_checkpoint_dir="/var/run/mesos/isolators/docker/volume"
--enforce_container_disk_quota="false" --executor_registration_timeout="1mins" --executor_reregistration_timeout="2secs"
--executor_shutdown_grace_period="5secs" --fetcher_cache_dir="/tmp/Endpoint_SlaveEndpointTest_NoAuthorizer_1_RFr3mO/fetch"
--fetcher_cache_size="2GB" --frameworks_home="" --gc_delay="1weeks" --gc_disk_headroom="0.1"
--hadoop_home="" --help="false" --hostname_lookup="true" --http_command_executor="false" --http_credentials="/tmp/Endpoint_SlaveEndpointTest_NoAuthorizer_1_RFr3mO/http_credentials"
--http_heartbeat_interval="30secs" --initialize_driver_logging="true" --isolation="posix/cpu,posix/mem"
--launcher="posix" --launcher_dir="/mesos/mesos-1.5.0/_build/src" --logbufsecs="0" --logging_level="INFO"
--max_completed_executors_per_framework="150" --oversubscribed_resources_interval="15secs"
--perf_duration="10secs" --perf_interval="1mins" --port="5051" --qos_correction_interval_min="0ns"
--quiet="false" --recover="reconnect" --recovery_timeout="15mins" --registration_backoff_factor="10ms"
--resources="cpus:2;gpus:0;mem:1024;disk:1024;ports:[31000-32000]" --revocable_cpu_low_priority="true"
--runtime_dir="/tmp/Endpoint_SlaveEndpointTest_NoAuthorizer_1_RFr3mO" --sandbox_directory="/mnt/mesos/sandbox"
--strict="true" --switch_user="true" --systemd_enable_support="true" --systemd_runtime_directory="/run/systemd/system"
--version="false" --work_dir="/tmp/Endpoint_SlaveEndpointTest_NoAuthorizer_1_QfonRq" --zk_session_timeout="10secs"
I0921 22:10:04.357823  3895 credentials.hpp:86] Loading credential for authentication from
'/tmp/Endpoint_SlaveEndpointTest_NoAuthorizer_1_RFr3mO/credential'
I0921 22:10:04.357988  3895 slave.cpp:287] Agent using credential for: test-principal
I0921 22:10:04.358029  3895 credentials.hpp:37] Loading credentials for authentication from
'/tmp/Endpoint_SlaveEndpointTest_NoAuthorizer_1_RFr3mO/http_credentials'
I0921 22:10:04.358374  3895 http.cpp:1045] Creating default 'basic' HTTP authenticator for
realm 'mesos-agent-readonly'
I0921 22:10:04.358572  3895 http.cpp:1045] Creating default 'basic' HTTP authenticator for
realm 'mesos-agent-readwrite'
I0921 22:10:04.360388  3895 slave.cpp:585] Agent resources: [{"name":"cpus","scalar":{"value":2.0},"type":"SCALAR"},{"name":"mem","scalar":{"value":1024.0},"type":"SCALAR"},{"name":"disk","scalar":{"value":1024.0},"type":"SCALAR"},{"name":"ports","ranges":{"range":[{"begin":31000,"end":32000}]},"type":"RANGES"}]
I0921 22:10:04.360667  3895 slave.cpp:593] Agent attributes: [  ]
I0921 22:10:04.360694  3895 slave.cpp:602] Agent hostname: 8e35ec13d892
I0921 22:10:04.360883  3904 status_update_manager.cpp:177] Pausing sending status updates
I0921 22:10:04.362565  3895 state.cpp:64] Recovering state from '/tmp/Endpoint_SlaveEndpointTest_NoAuthorizer_1_QfonRq/meta'
I0921 22:10:04.362884  3899 status_update_manager.cpp:203] Recovering status update manager
I0921 22:10:04.363147  3899 containerizer.cpp:648] Recovering containerizer
I0921 22:10:04.364507  3896 provisioner.cpp:416] Provisioner recovery complete
I0921 22:10:04.364934  3907 slave.cpp:6322] Finished recovery
I0921 22:10:04.365492  3907 slave.cpp:6504] Querying resource estimator for oversubscribable
resources
I0921 22:10:04.365767  3898 slave.cpp:6518] Received oversubscribable resources {} from the
resource estimator
I0921 22:10:04.370640  3895 process.cpp:3929] Handling HTTP event for process 'slave(816)'
with path: '/slave(816)/monitor/statistics.json'
I0921 22:10:04.372294  3905 http.cpp:1185] HTTP GET for /slave(816)/monitor/statistics.json
from 172.17.0.2:46125
I0921 22:10:04.372382  3905 http.cpp:976] Authorizing principal 'test-principal' to GET the
'/monitor/statistics.json' endpoint
I0921 22:10:04.376559  3877 slave.cpp:869] Agent terminating
[       OK ] Endpoint/SlaveEndpointTest.NoAuthorizer/1 (43 ms)
[ RUN      ] Endpoint/SlaveEndpointTest.NoAuthorizer/2
I0921 22:10:04.395014  3877 containerizer.cpp:292] Using isolation { environment_secret, posix/cpu,
posix/mem, filesystem/posix, network/cni }
W0921 22:10:04.395500  3877 backend.cpp:76] Failed to create 'aufs' backend: AufsBackend requires
root privileges
W0921 22:10:04.395613  3877 backend.cpp:76] Failed to create 'bind' backend: BindBackend requires
root privileges
I0921 22:10:04.395649  3877 provisioner.cpp:255] Using default backend 'copy'
I0921 22:10:04.397284  3877 cluster.cpp:448] Creating default 'local' authorizer
I0921 22:10:04.399026  3907 slave.cpp:254] Mesos agent started on (817)@172.17.0.2:39675
I0921 22:10:04.399065  3907 slave.cpp:255] Flags at startup: --acls="" --appc_simple_discovery_uri_prefix="http://"
--appc_store_dir="/tmp/Endpoint_SlaveEndpointTest_NoAuthorizer_2_zUSSMk/store/appc" --authenticate_http_readonly="true"
--authenticate_http_readwrite="true" --authenticatee="crammd5" --authentication_backoff_factor="1secs"
--authorizer="local" --cgroups_cpu_enable_pids_and_tids_count="false" --cgroups_enable_cfs="false"
--cgroups_hierarchy="/sys/fs/cgroup" --cgroups_limit_swap="false" --cgroups_root="mesos" --container_disk_watch_interval="15secs"
--containerizers="mesos" --credential="/tmp/Endpoint_SlaveEndpointTest_NoAuthorizer_2_zUSSMk/credential"
--default_role="*" --disallow_sharing_agent_pid_namespace="false" --disk_watch_interval="1mins"
--docker="docker" --docker_kill_orphans="true" --docker_registry="https://registry-1.docker.io"
--docker_remove_delay="6hrs" --docker_socket="/var/run/docker.sock" --docker_stop_timeout="0ns"
--docker_store_dir="/tmp/Endpoint_SlaveEndpointTest_NoAuthorizer_2_zUSSMk/store/docker" --docker_volume_checkpoint_dir="/var/run/mesos/isolators/docker/volume"
--enforce_container_disk_quota="false" --executor_registration_timeout="1mins" --executor_reregistration_timeout="2secs"
--executor_shutdown_grace_period="5secs" --fetcher_cache_dir="/tmp/Endpoint_SlaveEndpointTest_NoAuthorizer_2_zUSSMk/fetch"
--fetcher_cache_size="2GB" --frameworks_home="" --gc_delay="1weeks" --gc_disk_headroom="0.1"
--hadoop_home="" --help="false" --hostname_lookup="true" --http_command_executor="false" --http_credentials="/tmp/Endpoint_SlaveEndpointTest_NoAuthorizer_2_zUSSMk/http_credentials"
--http_heartbeat_interval="30secs" --initialize_driver_logging="true" --isolation="posix/cpu,posix/mem"
--launcher="posix" --launcher_dir="/mesos/mesos-1.5.0/_build/src" --logbufsecs="0" --logging_level="INFO"
--max_completed_executors_per_framework="150" --oversubscribed_resources_interval="15secs"
--perf_duration="10secs" --perf_interval="1mins" --port="5051" --qos_correction_interval_min="0ns"
--quiet="false" --recover="reconnect" --recovery_timeout="15mins" --registration_backoff_factor="10ms"
--resources="cpus:2;gpus:0;mem:1024;disk:1024;ports:[31000-32000]" --revocable_cpu_low_priority="true"
--runtime_dir="/tmp/Endpoint_SlaveEndpointTest_NoAuthorizer_2_zUSSMk" --sandbox_directory="/mnt/mesos/sandbox"
--strict="true" --switch_user="true" --systemd_enable_support="true" --systemd_runtime_directory="/run/systemd/system"
--version="false" --work_dir="/tmp/Endpoint_SlaveEndpointTest_NoAuthorizer_2_wunfaX" --zk_session_timeout="10secs"
I0921 22:10:04.399431  3907 credentials.hpp:86] Loading credential for authentication from
'/tmp/Endpoint_SlaveEndpointTest_NoAuthorizer_2_zUSSMk/credential'
I0921 22:10:04.399603  3907 slave.cpp:287] Agent using credential for: test-principal
I0921 22:10:04.399629  3907 credentials.hpp:37] Loading credentials for authentication from
'/tmp/Endpoint_SlaveEndpointTest_NoAuthorizer_2_zUSSMk/http_credentials'
I0921 22:10:04.400003  3907 http.cpp:1045] Creating default 'basic' HTTP authenticator for
realm 'mesos-agent-readonly'
I0921 22:10:04.400179  3907 http.cpp:1045] Creating default 'basic' HTTP authenticator for
realm 'mesos-agent-readwrite'
I0921 22:10:04.401752  3907 slave.cpp:585] Agent resources: [{"name":"cpus","scalar":{"value":2.0},"type":"SCALAR"},{"name":"mem","scalar":{"value":1024.0},"type":"SCALAR"},{"name":"disk","scalar":{"value":1024.0},"type":"SCALAR"},{"name":"ports","ranges":{"range":[{"begin":31000,"end":32000}]},"type":"RANGES"}]
I0921 22:10:04.402053  3907 slave.cpp:593] Agent attributes: [  ]
I0921 22:10:04.402068  3907 slave.cpp:602] Agent hostname: 8e35ec13d892
I0921 22:10:04.402200  3900 status_update_manager.cpp:177] Pausing sending status updates
I0921 22:10:04.403511  3898 state.cpp:64] Recovering state from '/tmp/Endpoint_SlaveEndpointTest_NoAuthorizer_2_wunfaX/meta'
I0921 22:10:04.403764  3898 status_update_manager.cpp:203] Recovering status update manager
I0921 22:10:04.403970  3908 containerizer.cpp:648] Recovering containerizer
I0921 22:10:04.405913  3896 provisioner.cpp:416] Provisioner recovery complete
I0921 22:10:04.406584  3905 slave.cpp:6322] Finished recovery
I0921 22:10:04.407058  3905 slave.cpp:6504] Querying resource estimator for oversubscribable
resources
I0921 22:10:04.407325  3897 slave.cpp:6518] Received oversubscribable resources {} from the
resource estimator
I0921 22:10:04.409947  3899 process.cpp:3929] Handling HTTP event for process 'slave(817)'
with path: '/slave(817)/containers'
I0921 22:10:04.411790  3908 http.cpp:1185] HTTP GET for /slave(817)/containers from 172.17.0.2:46126
I0921 22:10:04.411928  3908 http.cpp:976] Authorizing principal 'test-principal' to GET the
'/containers' endpoint
I0921 22:10:04.416618  3877 slave.cpp:869] Agent terminating
[       OK ] Endpoint/SlaveEndpointTest.NoAuthorizer/2 (41 ms)
[----------] 9 tests from Endpoint/SlaveEndpointTest (342 ms total)

[----------] 2 tests from ContainerizerType/DefaultContainerDNSFlagTest
[ RUN      ] ContainerizerType/DefaultContainerDNSFlagTest.ValidateFlag/0
[       OK ] ContainerizerType/DefaultContainerDNSFlagTest.ValidateFlag/0 (13 ms)
[ RUN      ] ContainerizerType/DefaultContainerDNSFlagTest.ValidateFlag/1
[       OK ] ContainerizerType/DefaultContainerDNSFlagTest.ValidateFlag/1 (9 ms)
[----------] 2 tests from ContainerizerType/DefaultContainerDNSFlagTest (22 ms total)

[----------] Global test environment tear-down
[==========] 1676 tests from 184 test cases ran. (497590 ms total)
[  PASSED  ] 1675 tests.
[  FAILED  ] 1 test, listed below:
[  FAILED  ] DiskQuotaTest.SlaveRecovery

 1 FAILED TEST
  YOU HAVE 20 DISABLED TESTS

I0921 22:10:04.513849  3911 process.cpp:1068] Failed to accept socket: future discarded
make[4]: *** [check-local] Error 1
make[4]: Leaving directory `/mesos/mesos-1.5.0/_build/src'
make[3]: *** [check-am] Error 2
make[3]: Leaving directory `/mesos/mesos-1.5.0/_build/src'
make[2]: *** [check] Error 2
make[2]: Leaving directory `/mesos/mesos-1.5.0/_build/src'
make[1]: *** [check-recursive] Error 1
make[1]: Leaving directory `/mesos/mesos-1.5.0/_build'
make: *** [distcheck] Error 1
+ docker rmi mesos-1506028459-10438
Untagged: mesos-1506028459-10438:latest
Deleted: sha256:6e29022d783562902be1af73225c4428ff282481ab9a661b1fab4ac23d8eef9b
Deleted: sha256:76a6d784c79daf032c4632f759e4e3f3d7e69c9303a3bab14564ab2f0f76472c
Deleted: sha256:80f610d74aef471b610238edc6a7baf26ca1ae91cfe6ad9630cec092e71462ed
Deleted: sha256:82932345bb1fa345a641a04ceea85ec9c44fc81a22b90bbe90054d46ff245f19
Deleted: sha256:94154acbc071132632b04399d461f0190770d933a2af728886b383dbd1306ce4
Deleted: sha256:6d8091982afae6dc4f165205b6bd569f274e261d18e0e42cff3d2aaa62e60276
Deleted: sha256:81ab805365c3eab598d70665e8873ae16024c9d627c694fbe816c772d890ba5e
Deleted: sha256:d72ee90bff37f1ad7d5b46a421137c1e79e95ee570b708389345c484f76f4af8
Deleted: sha256:5b12272985fb2558adac9c9374b8b5018ace8e6606b931c2ade9ae2f44cb4a7c
Deleted: sha256:f574ee47dc3763f275313104037ca6ea006c762cbbfef55df21a4709d0aacf37
Deleted: sha256:f4ff6ab8deccaab939f96dd4f43aca33bf1575a80828fc899b5a636ee403a1af
Deleted: sha256:52803998752a7b734cc708115100b67009e6e331d4358e72405d611765c80b9c
Deleted: sha256:952cb8aa3e9734f37eeb3e08e6d704c1a817a9c1628d9d266f6ad852ea3af3f8
Deleted: sha256:73ba67c38dac94120ccd406ef5226ffd4cf8d3457f07fad78d7146f7bc65b2a8
Deleted: sha256:4ebdc7579b5a4a39c7045e3584dbf9bf9fce1399529bf66c2c5fb44a29d48c16
Deleted: sha256:88a4d176594ac14f485f119331cb12307280b8a234a0e597e8269aefb0547f75
Deleted: sha256:aadc52551968a5a519b6b4fb88b51209e9410d9dbb7e943e39915302b87fb6f5
Deleted: sha256:7d2df839234936455a012e00a259fd69dd7b39e1705794023edb05ae3b2edfb3
Deleted: sha256:8cf0c309f9c2cc5cdd3aec2f5d191f07102a959f2fb8b87ce73229e3aaa8fe47
Deleted: sha256:fa571742727c5bba126e3cc0876ca0195d97c26cf8998acde6825ce76ca288dd
Deleted: sha256:ed5393a04bbbd4fefcca2f846288d27479b75eab67c217610ac305e68072cb2d
Deleted: sha256:3e09ec7ff837198823fed5cf00501179055d174bcb377fb82f632dfee3f04fb9
Deleted: sha256:c47f4d9caddf8aefa04b65b4f54fa9314bb84af927738425239d2c852aad23bf
Deleted: sha256:bcb1b46ba0d16dce198203f50a2734d86726e7c9b830c6e8a3620bb123c6e6d8
Deleted: sha256:8c3d0d9561e0fae048f6fd6c50a81955840c71a98ae3ac5efbcfe5fb15c8e34b
Deleted: sha256:a5788de042d66894f4b62457416d763f83eb24f61b08c6542ba18b5a9bfc1aa0
Deleted: sha256:0ad75c185931184a7110ca193d23fe5073c5f3a42594b9762a5e61d25011c073
Deleted: sha256:6a0d715c8547160e40019bcef616d65580469340b31c29f09b7d2cb7e12485b4
Build step 'Execute shell' marked build as failure

Mime
View raw message