mesos-builds mailing list archives

Site index · List index
Message view « Date » · « Thread »
Top « Date » · « Thread »
From Apache Jenkins Server <jenk...@builds.apache.org>
Subject Build failed in Jenkins: Mesos-Buildbot » autotools,clang,--verbose --enable-libevent --enable-ssl,GLOG_v=1 MESOS_VERBOSE=1,ubuntu:14.04,(ubuntu)&&(!ubuntu-us1)&&(!ubuntu-eu2)&&(!qnode3)&&(!H23) #4214
Date Sat, 09 Sep 2017 11:07:31 GMT
See <https://builds.apache.org/job/Mesos-Buildbot/BUILDTOOL=autotools,COMPILER=clang,CONFIGURATION=--verbose%20--enable-libevent%20--enable-ssl,ENVIRONMENT=GLOG_v=1%20MESOS_VERBOSE=1,OS=ubuntu%3A14.04,label_exp=(ubuntu)&&(!ubuntu-us1)&&(!ubuntu-eu2)&&(!qnode3)&&(!H23)/4214/display/redirect>

------------------------------------------
[...truncated 32.71 MB...]
I0909 11:07:21.929018 22278 http.cpp:1045] Creating default 'basic' HTTP authenticator for
realm 'mesos-agent-executor'
I0909 11:07:21.929808 22278 http.cpp:1066] Creating default 'jwt' HTTP authenticator for realm
'mesos-agent-executor'
I0909 11:07:21.930732 22278 http.cpp:1045] Creating default 'basic' HTTP authenticator for
realm 'mesos-agent-readonly'
I0909 11:07:21.931404 22278 http.cpp:1066] Creating default 'jwt' HTTP authenticator for realm
'mesos-agent-readonly'
I0909 11:07:21.931890 22278 http.cpp:1045] Creating default 'basic' HTTP authenticator for
realm 'mesos-agent-readwrite'
I0909 11:07:21.932545 22278 http.cpp:1066] Creating default 'jwt' HTTP authenticator for realm
'mesos-agent-readwrite'
I0909 11:07:21.935801 22278 slave.cpp:583] Agent resources: [{"name":"cpus","scalar":{"value":2.0},"type":"SCALAR"},{"name":"mem","scalar":{"value":1024.0},"type":"SCALAR"},{"name":"disk","scalar":{"value":1024.0},"type":"SCALAR"},{"name":"ports","ranges":{"range":[{"begin":31000,"end":32000}]},"type":"RANGES"}]
I0909 11:07:21.936491 22278 slave.cpp:591] Agent attributes: [  ]
I0909 11:07:21.936837 22278 slave.cpp:600] Agent hostname: 1416cfeb31a2
I0909 11:07:21.938369 22274 status_update_manager.cpp:177] Pausing sending status updates
I0909 11:07:21.940788 22275 state.cpp:64] Recovering state from '/tmp/Endpoint_SlaveEndpointTest_UnauthorizedRequest_0_NdLuwW/meta'
I0909 11:07:21.941313 22273 status_update_manager.cpp:203] Recovering status update manager
I0909 11:07:21.941627 22277 containerizer.cpp:648] Recovering containerizer
I0909 11:07:21.943945 22277 provisioner.cpp:416] Provisioner recovery complete
I0909 11:07:21.944571 22273 slave.cpp:6298] Finished recovery
I0909 11:07:21.945248 22273 slave.cpp:6480] Querying resource estimator for oversubscribable
resources
I0909 11:07:21.945739 22277 slave.cpp:6494] Received oversubscribable resources {} from the
resource estimator
I0909 11:07:21.949390 22274 process.cpp:3929] Handling HTTP event for process 'slave(817)'
with path: '/slave(817)/monitor/statistics'
I0909 11:07:21.952864 22277 http.cpp:1185] HTTP GET for /slave(817)/monitor/statistics from
172.17.0.2:48020
I0909 11:07:21.953007 22277 http.cpp:976] Authorizing principal 'test-principal' to GET the
'/monitor/statistics' endpoint
I0909 11:07:21.956845  5252 slave.cpp:861] Agent terminating
[       OK ] Endpoint/SlaveEndpointTest.UnauthorizedRequest/0 (60 ms)
[ RUN      ] Endpoint/SlaveEndpointTest.UnauthorizedRequest/1
I0909 11:07:21.978761  5252 containerizer.cpp:292] Using isolation { environment_secret, posix/cpu,
posix/mem, filesystem/posix, network/cni }
W0909 11:07:21.979547  5252 backend.cpp:76] Failed to create 'overlay' backend: OverlayBackend
requires root privileges
W0909 11:07:21.979777  5252 backend.cpp:76] Failed to create 'bind' backend: BindBackend requires
root privileges
I0909 11:07:21.979828  5252 provisioner.cpp:255] Using default backend 'copy'
I0909 11:07:21.985525 22277 slave.cpp:252] Mesos agent started on (818)@172.17.0.2:46013
I0909 11:07:21.985621 22277 slave.cpp:253] Flags at startup: --acls="" --appc_simple_discovery_uri_prefix="http://"
--appc_store_dir="/tmp/Endpoint_SlaveEndpointTest_UnauthorizedRequest_1_pxeKAD/store/appc"
--authenticate_http_executors="true" --authenticate_http_readonly="true" --authenticate_http_readwrite="true"
--authenticatee="crammd5" --authentication_backoff_factor="1secs" --authorizer="local" --cgroups_cpu_enable_pids_and_tids_count="false"
--cgroups_enable_cfs="false" --cgroups_hierarchy="/sys/fs/cgroup" --cgroups_limit_swap="false"
--cgroups_root="mesos" --container_disk_watch_interval="15secs" --containerizers="mesos" --credential="/tmp/Endpoint_SlaveEndpointTest_UnauthorizedRequest_1_pxeKAD/credential"
--default_role="*" --disallow_sharing_agent_pid_namespace="false" --disk_watch_interval="1mins"
--docker="docker" --docker_kill_orphans="true" --docker_registry="https://registry-1.docker.io"
--docker_remove_delay="6hrs" --docker_socket="/var/run/docker.sock" --docker_stop_timeout="0ns"
--docker_store_dir="/tmp/Endpoint_SlaveEndpointTest_UnauthorizedRequest_1_pxeKAD/store/docker"
--docker_volume_checkpoint_dir="/var/run/mesos/isolators/docker/volume" --enforce_container_disk_quota="false"
--executor_registration_timeout="1mins" --executor_reregistration_timeout="2secs" --executor_secret_key="/tmp/Endpoint_SlaveEndpointTest_UnauthorizedRequest_1_pxeKAD/executor_secret_key"
--executor_shutdown_grace_period="5secs" --fetcher_cache_dir="/tmp/Endpoint_SlaveEndpointTest_UnauthorizedRequest_1_pxeKAD/fetch"
--fetcher_cache_size="2GB" --frameworks_home="" --gc_delay="1weeks" --gc_disk_headroom="0.1"
--hadoop_home="" --help="false" --hostname_lookup="true" --http_command_executor="false" --http_credentials="/tmp/Endpoint_SlaveEndpointTest_UnauthorizedRequest_1_pxeKAD/http_credentials"
--http_heartbeat_interval="30secs" --initialize_driver_logging="true" --isolation="posix/cpu,posix/mem"
--launcher="posix" --launcher_dir="/mesos/mesos-1.5.0/_build/src" --logbufsecs="0" --logging_level="INFO"
--max_completed_executors_per_framework="150" --oversubscribed_resources_interval="15secs"
--perf_duration="10secs" --perf_interval="1mins" --port="5051" --qos_correction_interval_min="0ns"
--quiet="false" --recover="reconnect" --recovery_timeout="15mins" --registration_backoff_factor="10ms"
--resources="cpus:2;gpus:0;mem:1024;disk:1024;ports:[31000-32000]" --revocable_cpu_low_priority="true"
--runtime_dir="/tmp/Endpoint_SlaveEndpointTest_UnauthorizedRequest_1_pxeKAD" --sandbox_directory="/mnt/mesos/sandbox"
--strict="true" --switch_user="true" --systemd_enable_support="true" --systemd_runtime_directory="/run/systemd/system"
--version="false" --work_dir="/tmp/Endpoint_SlaveEndpointTest_UnauthorizedRequest_1_rcYtkH"
--zk_session_timeout="10secs"
I0909 11:07:21.986500 22277 credentials.hpp:86] Loading credential for authentication from
'/tmp/Endpoint_SlaveEndpointTest_UnauthorizedRequest_1_pxeKAD/credential'
I0909 11:07:21.986801 22277 slave.cpp:285] Agent using credential for: test-principal
I0909 11:07:21.986829 22277 credentials.hpp:37] Loading credentials for authentication from
'/tmp/Endpoint_SlaveEndpointTest_UnauthorizedRequest_1_pxeKAD/http_credentials'
I0909 11:07:21.987294 22277 http.cpp:1045] Creating default 'basic' HTTP authenticator for
realm 'mesos-agent-executor'
I0909 11:07:21.987573 22277 http.cpp:1066] Creating default 'jwt' HTTP authenticator for realm
'mesos-agent-executor'
I0909 11:07:21.988036 22277 http.cpp:1045] Creating default 'basic' HTTP authenticator for
realm 'mesos-agent-readonly'
I0909 11:07:21.988234 22277 http.cpp:1066] Creating default 'jwt' HTTP authenticator for realm
'mesos-agent-readonly'
I0909 11:07:21.988499 22277 http.cpp:1045] Creating default 'basic' HTTP authenticator for
realm 'mesos-agent-readwrite'
I0909 11:07:21.988756 22277 http.cpp:1066] Creating default 'jwt' HTTP authenticator for realm
'mesos-agent-readwrite'
I0909 11:07:21.991401 22277 slave.cpp:583] Agent resources: [{"name":"cpus","scalar":{"value":2.0},"type":"SCALAR"},{"name":"mem","scalar":{"value":1024.0},"type":"SCALAR"},{"name":"disk","scalar":{"value":1024.0},"type":"SCALAR"},{"name":"ports","ranges":{"range":[{"begin":31000,"end":32000}]},"type":"RANGES"}]
I0909 11:07:21.991838 22277 slave.cpp:591] Agent attributes: [  ]
I0909 11:07:21.991863 22277 slave.cpp:600] Agent hostname: 1416cfeb31a2
I0909 11:07:21.992166 22276 status_update_manager.cpp:177] Pausing sending status updates
I0909 11:07:21.995512 22276 state.cpp:64] Recovering state from '/tmp/Endpoint_SlaveEndpointTest_UnauthorizedRequest_1_rcYtkH/meta'
I0909 11:07:21.996242 22272 status_update_manager.cpp:203] Recovering status update manager
I0909 11:07:21.996646 22273 containerizer.cpp:648] Recovering containerizer
I0909 11:07:21.998512 22276 provisioner.cpp:416] Provisioner recovery complete
I0909 11:07:21.999501 22275 slave.cpp:6298] Finished recovery
I0909 11:07:22.000584 22275 slave.cpp:6480] Querying resource estimator for oversubscribable
resources
I0909 11:07:22.001082 22274 slave.cpp:6494] Received oversubscribable resources {} from the
resource estimator
I0909 11:07:22.004976 22272 process.cpp:3929] Handling HTTP event for process 'slave(818)'
with path: '/slave(818)/monitor/statistics.json'
I0909 11:07:22.008407 22276 http.cpp:1185] HTTP GET for /slave(818)/monitor/statistics.json
from 172.17.0.2:48024
I0909 11:07:22.008553 22276 http.cpp:976] Authorizing principal 'test-principal' to GET the
'/monitor/statistics.json' endpoint
I0909 11:07:22.011452  5252 slave.cpp:861] Agent terminating
[       OK ] Endpoint/SlaveEndpointTest.UnauthorizedRequest/1 (58 ms)
[ RUN      ] Endpoint/SlaveEndpointTest.UnauthorizedRequest/2
I0909 11:07:22.037636  5252 containerizer.cpp:292] Using isolation { environment_secret, posix/cpu,
posix/mem, filesystem/posix, network/cni }
W0909 11:07:22.038432  5252 backend.cpp:76] Failed to create 'overlay' backend: OverlayBackend
requires root privileges
W0909 11:07:22.038666  5252 backend.cpp:76] Failed to create 'bind' backend: BindBackend requires
root privileges
I0909 11:07:22.038717  5252 provisioner.cpp:255] Using default backend 'copy'
I0909 11:07:22.045842 22278 slave.cpp:252] Mesos agent started on (819)@172.17.0.2:46013
I0909 11:07:22.046092 22278 slave.cpp:253] Flags at startup: --acls="" --appc_simple_discovery_uri_prefix="http://"
--appc_store_dir="/tmp/Endpoint_SlaveEndpointTest_UnauthorizedRequest_2_dVf09o/store/appc"
--authenticate_http_executors="true" --authenticate_http_readonly="true" --authenticate_http_readwrite="true"
--authenticatee="crammd5" --authentication_backoff_factor="1secs" --authorizer="local" --cgroups_cpu_enable_pids_and_tids_count="false"
--cgroups_enable_cfs="false" --cgroups_hierarchy="/sys/fs/cgroup" --cgroups_limit_swap="false"
--cgroups_root="mesos" --container_disk_watch_interval="15secs" --containerizers="mesos" --credential="/tmp/Endpoint_SlaveEndpointTest_UnauthorizedRequest_2_dVf09o/credential"
--default_role="*" --disallow_sharing_agent_pid_namespace="false" --disk_watch_interval="1mins"
--docker="docker" --docker_kill_orphans="true" --docker_registry="https://registry-1.docker.io"
--docker_remove_delay="6hrs" --docker_socket="/var/run/docker.sock" --docker_stop_timeout="0ns"
--docker_store_dir="/tmp/Endpoint_SlaveEndpointTest_UnauthorizedRequest_2_dVf09o/store/docker"
--docker_volume_checkpoint_dir="/var/run/mesos/isolators/docker/volume" --enforce_container_disk_quota="false"
--executor_registration_timeout="1mins" --executor_reregistration_timeout="2secs" --executor_secret_key="/tmp/Endpoint_SlaveEndpointTest_UnauthorizedRequest_2_dVf09o/executor_secret_key"
--executor_shutdown_grace_period="5secs" --fetcher_cache_dir="/tmp/Endpoint_SlaveEndpointTest_UnauthorizedRequest_2_dVf09o/fetch"
--fetcher_cache_size="2GB" --frameworks_home="" --gc_delay="1weeks" --gc_disk_headroom="0.1"
--hadoop_home="" --help="false" --hostname_lookup="true" --http_command_executor="false" --http_credentials="/tmp/Endpoint_SlaveEndpointTest_UnauthorizedRequest_2_dVf09o/http_credentials"
--http_heartbeat_interval="30secs" --initialize_driver_logging="true" --isolation="posix/cpu,posix/mem"
--launcher="posix" --launcher_dir="/mesos/mesos-1.5.0/_build/src" --logbufsecs="0" --logging_level="INFO"
--max_completed_executors_per_framework="150" --oversubscribed_resources_interval="15secs"
--perf_duration="10secs" --perf_interval="1mins" --port="5051" --qos_correction_interval_min="0ns"
--quiet="false" --recover="reconnect" --recovery_timeout="15mins" --registration_backoff_factor="10ms"
--resources="cpus:2;gpus:0;mem:1024;disk:1024;ports:[31000-32000]" --revocable_cpu_low_priority="true"
--runtime_dir="/tmp/Endpoint_SlaveEndpointTest_UnauthorizedRequest_2_dVf09o" --sandbox_directory="/mnt/mesos/sandbox"
--strict="true" --switch_user="true" --systemd_enable_support="true" --systemd_runtime_directory="/run/systemd/system"
--version="false" --work_dir="/tmp/Endpoint_SlaveEndpointTest_UnauthorizedRequest_2_vCidKs"
--zk_session_timeout="10secs"
I0909 11:07:22.047637 22278 credentials.hpp:86] Loading credential for authentication from
'/tmp/Endpoint_SlaveEndpointTest_UnauthorizedRequest_2_dVf09o/credential'
I0909 11:07:22.048372 22278 slave.cpp:285] Agent using credential for: test-principal
I0909 11:07:22.048713 22278 credentials.hpp:37] Loading credentials for authentication from
'/tmp/Endpoint_SlaveEndpointTest_UnauthorizedRequest_2_dVf09o/http_credentials'
I0909 11:07:22.049599 22278 http.cpp:1045] Creating default 'basic' HTTP authenticator for
realm 'mesos-agent-executor'
I0909 11:07:22.050176 22278 http.cpp:1066] Creating default 'jwt' HTTP authenticator for realm
'mesos-agent-executor'
I0909 11:07:22.051151 22278 http.cpp:1045] Creating default 'basic' HTTP authenticator for
realm 'mesos-agent-readonly'
I0909 11:07:22.052095 22278 http.cpp:1066] Creating default 'jwt' HTTP authenticator for realm
'mesos-agent-readonly'
I0909 11:07:22.053303 22278 http.cpp:1045] Creating default 'basic' HTTP authenticator for
realm 'mesos-agent-readwrite'
I0909 11:07:22.054306 22278 http.cpp:1066] Creating default 'jwt' HTTP authenticator for realm
'mesos-agent-readwrite'
I0909 11:07:22.057283 22278 slave.cpp:583] Agent resources: [{"name":"cpus","scalar":{"value":2.0},"type":"SCALAR"},{"name":"mem","scalar":{"value":1024.0},"type":"SCALAR"},{"name":"disk","scalar":{"value":1024.0},"type":"SCALAR"},{"name":"ports","ranges":{"range":[{"begin":31000,"end":32000}]},"type":"RANGES"}]
I0909 11:07:22.058552 22278 slave.cpp:591] Agent attributes: [  ]
I0909 11:07:22.058691 22278 slave.cpp:600] Agent hostname: 1416cfeb31a2
I0909 11:07:22.059520 22272 status_update_manager.cpp:177] Pausing sending status updates
I0909 11:07:22.061874 22276 state.cpp:64] Recovering state from '/tmp/Endpoint_SlaveEndpointTest_UnauthorizedRequest_2_vCidKs/meta'
I0909 11:07:22.062469 22273 status_update_manager.cpp:203] Recovering status update manager
I0909 11:07:22.062767 22272 containerizer.cpp:648] Recovering containerizer
I0909 11:07:22.065290 22272 provisioner.cpp:416] Provisioner recovery complete
I0909 11:07:22.066278 22272 slave.cpp:6298] Finished recovery
I0909 11:07:22.067090 22272 slave.cpp:6480] Querying resource estimator for oversubscribable
resources
I0909 11:07:22.067448 22272 slave.cpp:6494] Received oversubscribable resources {} from the
resource estimator
I0909 11:07:22.071198 22277 process.cpp:3929] Handling HTTP event for process 'slave(819)'
with path: '/slave(819)/containers'
I0909 11:07:22.074904 22272 http.cpp:1185] HTTP GET for /slave(819)/containers from 172.17.0.2:48026
I0909 11:07:22.075062 22272 http.cpp:976] Authorizing principal 'test-principal' to GET the
'/containers' endpoint
I0909 11:07:22.091791 22275 slave.cpp:861] Agent terminating
[       OK ] Endpoint/SlaveEndpointTest.UnauthorizedRequest/2 (84 ms)
[ RUN      ] Endpoint/SlaveEndpointTest.NoAuthorizer/0
I0909 11:07:22.122822  5252 containerizer.cpp:292] Using isolation { environment_secret, posix/cpu,
posix/mem, filesystem/posix, network/cni }
W0909 11:07:22.123615  5252 backend.cpp:76] Failed to create 'overlay' backend: OverlayBackend
requires root privileges
W0909 11:07:22.123849  5252 backend.cpp:76] Failed to create 'bind' backend: BindBackend requires
root privileges
I0909 11:07:22.123905  5252 provisioner.cpp:255] Using default backend 'copy'
I0909 11:07:22.126660  5252 cluster.cpp:448] Creating default 'local' authorizer
I0909 11:07:22.129925 22274 slave.cpp:252] Mesos agent started on (820)@172.17.0.2:46013
I0909 11:07:22.129993 22274 slave.cpp:253] Flags at startup: --acls="" --appc_simple_discovery_uri_prefix="http://"
--appc_store_dir="/tmp/Endpoint_SlaveEndpointTest_NoAuthorizer_0_PIl6yb/store/appc" --authenticate_http_executors="true"
--authenticate_http_readonly="true" --authenticate_http_readwrite="true" --authenticatee="crammd5"
--authentication_backoff_factor="1secs" --authorizer="local" --cgroups_cpu_enable_pids_and_tids_count="false"
--cgroups_enable_cfs="false" --cgroups_hierarchy="/sys/fs/cgroup" --cgroups_limit_swap="false"
--cgroups_root="mesos" --container_disk_watch_interval="15secs" --containerizers="mesos" --credential="/tmp/Endpoint_SlaveEndpointTest_NoAuthorizer_0_PIl6yb/credential"
--default_role="*" --disallow_sharing_agent_pid_namespace="false" --disk_watch_interval="1mins"
--docker="docker" --docker_kill_orphans="true" --docker_registry="https://registry-1.docker.io"
--docker_remove_delay="6hrs" --docker_socket="/var/run/docker.sock" --docker_stop_timeout="0ns"
--docker_store_dir="/tmp/Endpoint_SlaveEndpointTest_NoAuthorizer_0_PIl6yb/store/docker" --docker_volume_checkpoint_dir="/var/run/mesos/isolators/docker/volume"
--enforce_container_disk_quota="false" --executor_registration_timeout="1mins" --executor_reregistration_timeout="2secs"
--executor_secret_key="/tmp/Endpoint_SlaveEndpointTest_NoAuthorizer_0_PIl6yb/executor_secret_key"
--executor_shutdown_grace_period="5secs" --fetcher_cache_dir="/tmp/Endpoint_SlaveEndpointTest_NoAuthorizer_0_PIl6yb/fetch"
--fetcher_cache_size="2GB" --frameworks_home="" --gc_delay="1weeks" --gc_disk_headroom="0.1"
--hadoop_home="" --help="false" --hostname_lookup="true" --http_command_executor="false" --http_credentials="/tmp/Endpoint_SlaveEndpointTest_NoAuthorizer_0_PIl6yb/http_credentials"
--http_heartbeat_interval="30secs" --initialize_driver_logging="true" --isolation="posix/cpu,posix/mem"
--launcher="posix" --launcher_dir="/mesos/mesos-1.5.0/_build/src" --logbufsecs="0" --logging_level="INFO"
--max_completed_executors_per_framework="150" --oversubscribed_resources_interval="15secs"
--perf_duration="10secs" --perf_interval="1mins" --port="5051" --qos_correction_interval_min="0ns"
--quiet="false" --recover="reconnect" --recovery_timeout="15mins" --registration_backoff_factor="10ms"
--resources="cpus:2;gpus:0;mem:1024;disk:1024;ports:[31000-32000]" --revocable_cpu_low_priority="true"
--runtime_dir="/tmp/Endpoint_SlaveEndpointTest_NoAuthorizer_0_PIl6yb" --sandbox_directory="/mnt/mesos/sandbox"
--strict="true" --switch_user="true" --systemd_enable_support="true" --systemd_runtime_directory="/run/systemd/system"
--version="false" --work_dir="/tmp/Endpoint_SlaveEndpointTest_NoAuthorizer_0_NjICVe" --zk_session_timeout="10secs"
I0909 11:07:22.130743 22274 credentials.hpp:86] Loading credential for authentication from
'/tmp/Endpoint_SlaveEndpointTest_NoAuthorizer_0_PIl6yb/credential'
I0909 11:07:22.130990 22274 slave.cpp:285] Agent using credential for: test-principal
I0909 11:07:22.131013 22274 credentials.hpp:37] Loading credentials for authentication from
'/tmp/Endpoint_SlaveEndpointTest_NoAuthorizer_0_PIl6yb/http_credentials'
I0909 11:07:22.131752 22274 http.cpp:1045] Creating default 'basic' HTTP authenticator for
realm 'mesos-agent-executor'
I0909 11:07:22.132035 22274 http.cpp:1066] Creating default 'jwt' HTTP authenticator for realm
'mesos-agent-executor'
I0909 11:07:22.132287 22274 http.cpp:1045] Creating default 'basic' HTTP authenticator for
realm 'mesos-agent-readonly'
I0909 11:07:22.132395 22274 http.cpp:1066] Creating default 'jwt' HTTP authenticator for realm
'mesos-agent-readonly'
I0909 11:07:22.132608 22274 http.cpp:1045] Creating default 'basic' HTTP authenticator for
realm 'mesos-agent-readwrite'
I0909 11:07:22.132714 22274 http.cpp:1066] Creating default 'jwt' HTTP authenticator for realm
'mesos-agent-readwrite'
I0909 11:07:22.135489 22274 slave.cpp:583] Agent resources: [{"name":"cpus","scalar":{"value":2.0},"type":"SCALAR"},{"name":"mem","scalar":{"value":1024.0},"type":"SCALAR"},{"name":"disk","scalar":{"value":1024.0},"type":"SCALAR"},{"name":"ports","ranges":{"range":[{"begin":31000,"end":32000}]},"type":"RANGES"}]
I0909 11:07:22.136255 22274 slave.cpp:591] Agent attributes: [  ]
I0909 11:07:22.136286 22274 slave.cpp:600] Agent hostname: 1416cfeb31a2
I0909 11:07:22.136664 22277 status_update_manager.cpp:177] Pausing sending status updates
I0909 11:07:22.138972 22278 state.cpp:64] Recovering state from '/tmp/Endpoint_SlaveEndpointTest_NoAuthorizer_0_NjICVe/meta'
I0909 11:07:22.139488 22275 status_update_manager.cpp:203] Recovering status update manager
I0909 11:07:22.139902 22277 containerizer.cpp:648] Recovering containerizer
I0909 11:07:22.142076 22277 provisioner.cpp:416] Provisioner recovery complete
I0909 11:07:22.142688 22278 slave.cpp:6298] Finished recovery
I0909 11:07:22.143990 22278 slave.cpp:6480] Querying resource estimator for oversubscribable
resources
I0909 11:07:22.144811 22276 slave.cpp:6494] Received oversubscribable resources {} from the
resource estimator
I0909 11:07:22.149390 22274 process.cpp:3929] Handling HTTP event for process 'slave(820)'
with path: '/slave(820)/monitor/statistics'
I0909 11:07:22.152767 22279 http.cpp:1185] HTTP GET for /slave(820)/monitor/statistics from
172.17.0.2:48030
I0909 11:07:22.152926 22279 http.cpp:976] Authorizing principal 'test-principal' to GET the
'/monitor/statistics' endpoint
I0909 11:07:22.160501  5252 slave.cpp:861] Agent terminating
[       OK ] Endpoint/SlaveEndpointTest.NoAuthorizer/0 (56 ms)
[ RUN      ] Endpoint/SlaveEndpointTest.NoAuthorizer/1
I0909 11:07:22.181649  5252 containerizer.cpp:292] Using isolation { environment_secret, posix/cpu,
posix/mem, filesystem/posix, network/cni }
W0909 11:07:22.182435  5252 backend.cpp:76] Failed to create 'overlay' backend: OverlayBackend
requires root privileges
W0909 11:07:22.182669  5252 backend.cpp:76] Failed to create 'bind' backend: BindBackend requires
root privileges
I0909 11:07:22.182723  5252 provisioner.cpp:255] Using default backend 'copy'
I0909 11:07:22.188271  5252 cluster.cpp:448] Creating default 'local' authorizer
I0909 11:07:22.193816 22279 slave.cpp:252] Mesos agent started on (821)@172.17.0.2:46013
I0909 11:07:22.193917 22279 slave.cpp:253] Flags at startup: --acls="" --appc_simple_discovery_uri_prefix="http://"
--appc_store_dir="/tmp/Endpoint_SlaveEndpointTest_NoAuthorizer_1_LqHTCY/store/appc" --authenticate_http_executors="true"
--authenticate_http_readonly="true" --authenticate_http_readwrite="true" --authenticatee="crammd5"
--authentication_backoff_factor="1secs" --authorizer="local" --cgroups_cpu_enable_pids_and_tids_count="false"
--cgroups_enable_cfs="false" --cgroups_hierarchy="/sys/fs/cgroup" --cgroups_limit_swap="false"
--cgroups_root="mesos" --container_disk_watch_interval="15secs" --containerizers="mesos" --credential="/tmp/Endpoint_SlaveEndpointTest_NoAuthorizer_1_LqHTCY/credential"
--default_role="*" --disallow_sharing_agent_pid_namespace="false" --disk_watch_interval="1mins"
--docker="docker" --docker_kill_orphans="true" --docker_registry="https://registry-1.docker.io"
--docker_remove_delay="6hrs" --docker_socket="/var/run/docker.sock" --docker_stop_timeout="0ns"
--docker_store_dir="/tmp/Endpoint_SlaveEndpointTest_NoAuthorizer_1_LqHTCY/store/docker" --docker_volume_checkpoint_dir="/var/run/mesos/isolators/docker/volume"
--enforce_container_disk_quota="false" --executor_registration_timeout="1mins" --executor_reregistration_timeout="2secs"
--executor_secret_key="/tmp/Endpoint_SlaveEndpointTest_NoAuthorizer_1_LqHTCY/executor_secret_key"
--executor_shutdown_grace_period="5secs" --fetcher_cache_dir="/tmp/Endpoint_SlaveEndpointTest_NoAuthorizer_1_LqHTCY/fetch"
--fetcher_cache_size="2GB" --frameworks_home="" --gc_delay="1weeks" --gc_disk_headroom="0.1"
--hadoop_home="" --help="false" --hostname_lookup="true" --http_command_executor="false" --http_credentials="/tmp/Endpoint_SlaveEndpointTest_NoAuthorizer_1_LqHTCY/http_credentials"
--http_heartbeat_interval="30secs" --initialize_driver_logging="true" --isolation="posix/cpu,posix/mem"
--launcher="posix" --launcher_dir="/mesos/mesos-1.5.0/_build/src" --logbufsecs="0" --logging_level="INFO"
--max_completed_executors_per_framework="150" --oversubscribed_resources_interval="15secs"
--perf_duration="10secs" --perf_interval="1mins" --port="5051" --qos_correction_interval_min="0ns"
--quiet="false" --recover="reconnect" --recovery_timeout="15mins" --registration_backoff_factor="10ms"
--resources="cpus:2;gpus:0;mem:1024;disk:1024;ports:[31000-32000]" --revocable_cpu_low_priority="true"
--runtime_dir="/tmp/Endpoint_SlaveEndpointTest_NoAuthorizer_1_LqHTCY" --sandbox_directory="/mnt/mesos/sandbox"
--strict="true" --switch_user="true" --systemd_enable_support="true" --systemd_runtime_directory="/run/systemd/system"
--version="false" --work_dir="/tmp/Endpoint_SlaveEndpointTest_NoAuthorizer_1_fqmSP1" --zk_session_timeout="10secs"
I0909 11:07:22.194808 22279 credentials.hpp:86] Loading credential for authentication from
'/tmp/Endpoint_SlaveEndpointTest_NoAuthorizer_1_LqHTCY/credential'
I0909 11:07:22.195089 22279 slave.cpp:285] Agent using credential for: test-principal
I0909 11:07:22.195118 22279 credentials.hpp:37] Loading credentials for authentication from
'/tmp/Endpoint_SlaveEndpointTest_NoAuthorizer_1_LqHTCY/http_credentials'
I0909 11:07:22.195591 22279 http.cpp:1045] Creating default 'basic' HTTP authenticator for
realm 'mesos-agent-executor'
I0909 11:07:22.195858 22279 http.cpp:1066] Creating default 'jwt' HTTP authenticator for realm
'mesos-agent-executor'
I0909 11:07:22.196213 22279 http.cpp:1045] Creating default 'basic' HTTP authenticator for
realm 'mesos-agent-readonly'
I0909 11:07:22.196398 22279 http.cpp:1066] Creating default 'jwt' HTTP authenticator for realm
'mesos-agent-readonly'
I0909 11:07:22.196671 22279 http.cpp:1045] Creating default 'basic' HTTP authenticator for
realm 'mesos-agent-readwrite'
I0909 11:07:22.196816 22279 http.cpp:1066] Creating default 'jwt' HTTP authenticator for realm
'mesos-agent-readwrite'
I0909 11:07:22.199333 22279 slave.cpp:583] Agent resources: [{"name":"cpus","scalar":{"value":2.0},"type":"SCALAR"},{"name":"mem","scalar":{"value":1024.0},"type":"SCALAR"},{"name":"disk","scalar":{"value":1024.0},"type":"SCALAR"},{"name":"ports","ranges":{"range":[{"begin":31000,"end":32000}]},"type":"RANGES"}]
I0909 11:07:22.199772 22279 slave.cpp:591] Agent attributes: [  ]
I0909 11:07:22.199797 22279 slave.cpp:600] Agent hostname: 1416cfeb31a2
I0909 11:07:22.200103 22273 status_update_manager.cpp:177] Pausing sending status updates
I0909 11:07:22.202306 22273 state.cpp:64] Recovering state from '/tmp/Endpoint_SlaveEndpointTest_NoAuthorizer_1_fqmSP1/meta'
I0909 11:07:22.202847 22277 status_update_manager.cpp:203] Recovering status update manager
I0909 11:07:22.203119 22277 containerizer.cpp:648] Recovering containerizer
I0909 11:07:22.205132 22274 provisioner.cpp:416] Provisioner recovery complete
I0909 11:07:22.205938 22277 slave.cpp:6298] Finished recovery
I0909 11:07:22.206586 22277 slave.cpp:6480] Querying resource estimator for oversubscribable
resources
I0909 11:07:22.207047 22277 slave.cpp:6494] Received oversubscribable resources {} from the
resource estimator
I0909 11:07:22.211820 22276 process.cpp:3929] Handling HTTP event for process 'slave(821)'
with path: '/slave(821)/monitor/statistics.json'
I0909 11:07:22.214855 22272 http.cpp:1185] HTTP GET for /slave(821)/monitor/statistics.json
from 172.17.0.2:48040
I0909 11:07:22.215631 22272 http.cpp:976] Authorizing principal 'test-principal' to GET the
'/monitor/statistics.json' endpoint
I0909 11:07:22.220947 22274 slave.cpp:861] Agent terminating
[       OK ] Endpoint/SlaveEndpointTest.NoAuthorizer/1 (60 ms)
[ RUN      ] Endpoint/SlaveEndpointTest.NoAuthorizer/2
I0909 11:07:22.239855  5252 containerizer.cpp:292] Using isolation { environment_secret, posix/cpu,
posix/mem, filesystem/posix, network/cni }
W0909 11:07:22.240620  5252 backend.cpp:76] Failed to create 'overlay' backend: OverlayBackend
requires root privileges
W0909 11:07:22.240859  5252 backend.cpp:76] Failed to create 'bind' backend: BindBackend requires
root privileges
I0909 11:07:22.240913  5252 provisioner.cpp:255] Using default backend 'copy'
I0909 11:07:22.243618  5252 cluster.cpp:448] Creating default 'local' authorizer
I0909 11:07:22.246906 22276 slave.cpp:252] Mesos agent started on (822)@172.17.0.2:46013
I0909 11:07:22.246978 22276 slave.cpp:253] Flags at startup: --acls="" --appc_simple_discovery_uri_prefix="http://"
--appc_store_dir="/tmp/Endpoint_SlaveEndpointTest_NoAuthorizer_2_Xu4zjM/store/appc" --authenticate_http_executors="true"
--authenticate_http_readonly="true" --authenticate_http_readwrite="true" --authenticatee="crammd5"
--authentication_backoff_factor="1secs" --authorizer="local" --cgroups_cpu_enable_pids_and_tids_count="false"
--cgroups_enable_cfs="false" --cgroups_hierarchy="/sys/fs/cgroup" --cgroups_limit_swap="false"
--cgroups_root="mesos" --container_disk_watch_interval="15secs" --containerizers="mesos" --credential="/tmp/Endpoint_SlaveEndpointTest_NoAuthorizer_2_Xu4zjM/credential"
--default_role="*" --disallow_sharing_agent_pid_namespace="false" --disk_watch_interval="1mins"
--docker="docker" --docker_kill_orphans="true" --docker_registry="https://registry-1.docker.io"
--docker_remove_delay="6hrs" --docker_socket="/var/run/docker.sock" --docker_stop_timeout="0ns"
--docker_store_dir="/tmp/Endpoint_SlaveEndpointTest_NoAuthorizer_2_Xu4zjM/store/docker" --docker_volume_checkpoint_dir="/var/run/mesos/isolators/docker/volume"
--enforce_container_disk_quota="false" --executor_registration_timeout="1mins" --executor_reregistration_timeout="2secs"
--executor_secret_key="/tmp/Endpoint_SlaveEndpointTest_NoAuthorizer_2_Xu4zjM/executor_secret_key"
--executor_shutdown_grace_period="5secs" --fetcher_cache_dir="/tmp/Endpoint_SlaveEndpointTest_NoAuthorizer_2_Xu4zjM/fetch"
--fetcher_cache_size="2GB" --frameworks_home="" --gc_delay="1weeks" --gc_disk_headroom="0.1"
--hadoop_home="" --help="false" --hostname_lookup="true" --http_command_executor="false" --http_credentials="/tmp/Endpoint_SlaveEndpointTest_NoAuthorizer_2_Xu4zjM/http_credentials"
--http_heartbeat_interval="30secs" --initialize_driver_logging="true" --isolation="posix/cpu,posix/mem"
--launcher="posix" --launcher_dir="/mesos/mesos-1.5.0/_build/src" --logbufsecs="0" --logging_level="INFO"
--max_completed_executors_per_framework="150" --oversubscribed_resources_interval="15secs"
--perf_duration="10secs" --perf_interval="1mins" --port="5051" --qos_correction_interval_min="0ns"
--quiet="false" --recover="reconnect" --recovery_timeout="15mins" --registration_backoff_factor="10ms"
--resources="cpus:2;gpus:0;mem:1024;disk:1024;ports:[31000-32000]" --revocable_cpu_low_priority="true"
--runtime_dir="/tmp/Endpoint_SlaveEndpointTest_NoAuthorizer_2_Xu4zjM" --sandbox_directory="/mnt/mesos/sandbox"
--strict="true" --switch_user="true" --systemd_enable_support="true" --systemd_runtime_directory="/run/systemd/system"
--version="false" --work_dir="/tmp/Endpoint_SlaveEndpointTest_NoAuthorizer_2_x3j7mP" --zk_session_timeout="10secs"
I0909 11:07:22.247774 22276 credentials.hpp:86] Loading credential for authentication from
'/tmp/Endpoint_SlaveEndpointTest_NoAuthorizer_2_Xu4zjM/credential'
I0909 11:07:22.248034 22276 slave.cpp:285] Agent using credential for: test-principal
I0909 11:07:22.248061 22276 credentials.hpp:37] Loading credentials for authentication from
'/tmp/Endpoint_SlaveEndpointTest_NoAuthorizer_2_Xu4zjM/http_credentials'
I0909 11:07:22.248507 22276 http.cpp:1045] Creating default 'basic' HTTP authenticator for
realm 'mesos-agent-executor'
I0909 11:07:22.248756 22276 http.cpp:1066] Creating default 'jwt' HTTP authenticator for realm
'mesos-agent-executor'
I0909 11:07:22.249037 22276 http.cpp:1045] Creating default 'basic' HTTP authenticator for
realm 'mesos-agent-readonly'
I0909 11:07:22.249166 22276 http.cpp:1066] Creating default 'jwt' HTTP authenticator for realm
'mesos-agent-readonly'
I0909 11:07:22.249397 22276 http.cpp:1045] Creating default 'basic' HTTP authenticator for
realm 'mesos-agent-readwrite'
I0909 11:07:22.249594 22276 http.cpp:1066] Creating default 'jwt' HTTP authenticator for realm
'mesos-agent-readwrite'
I0909 11:07:22.251974 22276 slave.cpp:583] Agent resources: [{"name":"cpus","scalar":{"value":2.0},"type":"SCALAR"},{"name":"mem","scalar":{"value":1024.0},"type":"SCALAR"},{"name":"disk","scalar":{"value":1024.0},"type":"SCALAR"},{"name":"ports","ranges":{"range":[{"begin":31000,"end":32000}]},"type":"RANGES"}]
I0909 11:07:22.252403 22276 slave.cpp:591] Agent attributes: [  ]
I0909 11:07:22.252425 22276 slave.cpp:600] Agent hostname: 1416cfeb31a2
I0909 11:07:22.252763 22274 status_update_manager.cpp:177] Pausing sending status updates
I0909 11:07:22.254896 22272 state.cpp:64] Recovering state from '/tmp/Endpoint_SlaveEndpointTest_NoAuthorizer_2_x3j7mP/meta'
I0909 11:07:22.256125 22273 status_update_manager.cpp:203] Recovering status update manager
I0909 11:07:22.256512 22279 containerizer.cpp:648] Recovering containerizer
I0909 11:07:22.258708 22277 provisioner.cpp:416] Provisioner recovery complete
I0909 11:07:22.259477 22279 slave.cpp:6298] Finished recovery
I0909 11:07:22.260278 22279 slave.cpp:6480] Querying resource estimator for oversubscribable
resources
I0909 11:07:22.260664 22272 slave.cpp:6494] Received oversubscribable resources {} from the
resource estimator
I0909 11:07:22.264595 22274 process.cpp:3929] Handling HTTP event for process 'slave(822)'
with path: '/slave(822)/containers'
I0909 11:07:22.267727 22272 http.cpp:1185] HTTP GET for /slave(822)/containers from 172.17.0.2:48042
I0909 11:07:22.268314 22272 http.cpp:976] Authorizing principal 'test-principal' to GET the
'/containers' endpoint
I0909 11:07:22.274475 22277 slave.cpp:861] Agent terminating
[       OK ] Endpoint/SlaveEndpointTest.NoAuthorizer/2 (53 ms)
[----------] 9 tests from Endpoint/SlaveEndpointTest (589 ms total)

[----------] 2 tests from ContainerizerType/DefaultContainerDNSFlagTest
[ RUN      ] ContainerizerType/DefaultContainerDNSFlagTest.ValidateFlag/0
[       OK ] ContainerizerType/DefaultContainerDNSFlagTest.ValidateFlag/0 (19 ms)
[ RUN      ] ContainerizerType/DefaultContainerDNSFlagTest.ValidateFlag/1
[       OK ] ContainerizerType/DefaultContainerDNSFlagTest.ValidateFlag/1 (20 ms)
[----------] 2 tests from ContainerizerType/DefaultContainerDNSFlagTest (39 ms total)

[----------] Global test environment tear-down
[==========] 1675 tests from 185 test cases ran. (816775 ms total)
[  PASSED  ] 1669 tests.
[  FAILED  ] 6 tests, listed below:
[  FAILED  ] DefaultExecutorCheckTest.CommandCheckDeliveredAndReconciled
[  FAILED  ] DefaultExecutorCheckTest.CommandCheckStatusChange
[  FAILED  ] DefaultExecutorCheckTest.CommandCheckSeesParentsEnv
[  FAILED  ] DefaultExecutorCheckTest.CommandCheckSharesWorkDirWithTask
[  FAILED  ] MasterTest.IgnoreOldAgentReregistration
[  FAILED  ] bool/MasterTestPrePostReservationRefinement.StateEndpointPendingTasks/1, where
GetParam() = false

 6 FAILED TESTS
  YOU HAVE 20 DISABLED TESTS

I0909 11:07:22.479609 22280 process.cpp:1068] Failed to accept socket: future discarded
make[4]: *** [check-local] Error 1
make[4]: Leaving directory `/mesos/mesos-1.5.0/_build/src'
make[3]: *** [check-am] Error 2
make[3]: Leaving directory `/mesos/mesos-1.5.0/_build/src'
make[2]: *** [check] Error 2
make[2]: Leaving directory `/mesos/mesos-1.5.0/_build/src'
make[1]: *** [check-recursive] Error 1
make[1]: Leaving directory `/mesos/mesos-1.5.0/_build'
make: *** [distcheck] Error 1
+ docker rmi mesos-1504948454-27268
Untagged: mesos-1504948454-27268:latest
Deleted: sha256:a860ff7dedd44ff8058fed25d20156bc859f031aac4f8686932b4099c5ffbad1
Deleted: sha256:ee121330ead2b985d9ea46790076dd807f11419428fb5d0d1cbdb7cb5fb107a0
Deleted: sha256:1a72f6a5dfe38345e4e7c144b7608c1d0baad80304b5e42d676050d684b3db8c
Deleted: sha256:77ed8d65b036a3514190fe893f0f877ae66e3f1ea50adc5c075ad2d851e60d6c
Deleted: sha256:6a5f3cc57223a949cc5b5f6f3d173e5ccf3becf545924f99f8dbda1d021809e5
Deleted: sha256:375184e4269111546b6cd2725492a5301115d7a1f3b86bb7eba9b347412fcc70
Deleted: sha256:df655ebecca137a849501de17fccf129fe8465803302d0ea9b0754ffe25ba16d
Deleted: sha256:3ff1d36e01a97d6fedc5f9a64ee1f5f3b120abe5ad064416b4940af2b0e3fcd5
Deleted: sha256:a12c4e0c25b76744de8301c378f429880b03ef5bf219bb32df1bb20d1cacf117
Deleted: sha256:5476cf3f9c2f4d21e7f7a44df248b736cc1076385e6777bc142b7af393ce6bee
Deleted: sha256:3a95ef21c07bbc74abdd9894174aec8c09cf69c915ace539f3a8296c78cc3ef1
Deleted: sha256:b342f941010fb72876e6dbd8c951b572dd3715b77244e346c7b911436c60fdb0
Deleted: sha256:c612d2329b787bd30dba637184691b986041cde2f35efc996927745e38a937a6
Deleted: sha256:832ee03bd9839ebda714d58670fb8b68b6c66da3e15c2f99d2cb195719405d58
Deleted: sha256:2634e6018ffcc0e245406ba8a7aa594eb0bb734560a6e7c7cb487a579af2418c
Deleted: sha256:b518e44455b390d4abc0b1b2b70719f0756e75054710f2b6af47e1215f177103
Deleted: sha256:0b0871cd80f0554566e2c27a8ac8d6cd04e677755532151400f23fff181f5d99
Deleted: sha256:2eb88c91f634f5d2f794b46647ce485039b8682afbd08d56e162745e11475fca
Deleted: sha256:b1760b761568bfedd0da8328c0cd5edde6ece422e5991906444efd8d285b851d
Deleted: sha256:2b80a6fb7b27d13662d69f9248b11cf0bbeb1d0e47aa80eb0654b017d1abad91
Deleted: sha256:bd8f759dcc182e99a332cec64ded3ed3c977302c03bfa61285f2f00745129feb
Deleted: sha256:c547d9f6658280000331698e72bc31d1f7c0a2ecee6a69d597163c53839db405
Deleted: sha256:9ac85e8a2690144df831906adb703a0775a70cb3a7432a4a674132e7ab206b4b
Deleted: sha256:0e15c222a51c919fef0d5f7339fbd91fb3c266db52483aa05e8aa41d1ffd78dc
Deleted: sha256:7014b5b2392f8cb9a5f941b206a32453380574f1fcb99c8fde46d1a0c0fab896
Deleted: sha256:6c93ab68c35107aa864a397d39da0014d0581e6ebe0864f18089197d826d8e7b
Deleted: sha256:2e523352fd193ad8fb1dd9c22bfccf1b427a9a09e219c5429f345d381399cfd8
Deleted: sha256:9aaad05fb69cf6fba4ce38ecc8f946590738551f6bb67d3a2e5636cd8d53aec5
Build step 'Execute shell' marked build as failure

Mime
View raw message