mesos-builds mailing list archives

Site index · List index
Message view « Date » · « Thread »
Top « Date » · « Thread »
From Apache Jenkins Server <jenk...@builds.apache.org>
Subject Build failed in Jenkins: Mesos-Buildbot » autotools,gcc,--verbose --enable-libevent --enable-ssl,GLOG_v=1 MESOS_VERBOSE=1,ubuntu:14.04,(ubuntu)&&(!ubuntu-us1)&&(!ubuntu-eu2) #4206
Date Thu, 07 Sep 2017 11:14:13 GMT
See <https://builds.apache.org/job/Mesos-Buildbot/BUILDTOOL=autotools,COMPILER=gcc,CONFIGURATION=--verbose%20--enable-libevent%20--enable-ssl,ENVIRONMENT=GLOG_v=1%20MESOS_VERBOSE=1,OS=ubuntu%3A14.04,label_exp=(ubuntu)&&(!ubuntu-us1)&&(!ubuntu-eu2)/4206/display/redirect?page=changes>

Changes:

[jpeach] Added async-signal safe implementation of `write` function in stout.

[jpeach] Added SAFE_EXIT as alternative to ABORT.

[jpeach] Replaced ABORT with SAFE_EXIT in childhook in `subprocess_posix.hpp`.

[jpeach] Enhanced async-signal safety of `signalSafeWriteStatus` function.

[jpeach] Used SAFE_EXIT macro in `CgroupsAnyHierarchyTest.ROOT_CGROUPS_Write`.

[jpeach] Revert "Removed core file during distclean.".

[alexr] Log task status updates' error messages in docker executor.

[alexr] Excluded invalid offers from abnormal termination metrics.

------------------------------------------
[...truncated 2.68 MB...]
as: BFD (GNU Binutils for Ubuntu) 2.24 assertion fail ../../bfd/elf.c:2636
as: BFD (GNU Binutils for Ubuntu) 2.24 assertion fail ../../bfd/elf.c:2636
as: BFD (GNU Binutils for Ubuntu) 2.24 assertion fail ../../bfd/elf.c:2636
as: BFD (GNU Binutils for Ubuntu) 2.24 assertion fail ../../bfd/elf.c:2636
as: BFD (GNU Binutils for Ubuntu) 2.24 assertion fail ../../bfd/elf.c:2636
as: BFD (GNU Binutils for Ubuntu) 2.24 assertion fail ../../bfd/elf.c:2636
as: BFD (GNU Binutils for Ubuntu) 2.24 assertion fail ../../bfd/elf.c:2636
as: BFD (GNU Binutils for Ubuntu) 2.24 assertion fail ../../bfd/elf.c:2636
as: BFD (GNU Binutils for Ubuntu) 2.24 assertion fail ../../bfd/elf.c:2636
as: BFD (GNU Binutils for Ubuntu) 2.24 assertion fail ../../bfd/elf.c:2636
as: BFD (GNU Binutils for Ubuntu) 2.24 assertion fail ../../bfd/elf.c:2636
as: BFD (GNU Binutils for Ubuntu) 2.24 assertion fail ../../bfd/elf.c:2636
as: BFD (GNU Binutils for Ubuntu) 2.24 assertion fail ../../bfd/elf.c:2636
as: BFD (GNU Binutils for Ubuntu) 2.24 assertion fail ../../bfd/elf.c:2636
as: BFD (GNU Binutils for Ubuntu) 2.24 assertion fail ../../bfd/elf.c:2636
as: BFD (GNU Binutils for Ubuntu) 2.24 assertion fail ../../bfd/elf.c:2636
as: BFD (GNU Binutils for Ubuntu) 2.24 assertion fail ../../bfd/elf.c:2636
as: BFD (GNU Binutils for Ubuntu) 2.24 assertion fail ../../bfd/elf.c:2636
as: BFD (GNU Binutils for Ubuntu) 2.24 assertion fail ../../bfd/elf.c:2636
as: BFD (GNU Binutils for Ubuntu) 2.24 assertion fail ../../bfd/elf.c:2636
as: BFD (GNU Binutils for Ubuntu) 2.24 assertion fail ../../bfd/elf.c:2636
as: BFD (GNU Binutils for Ubuntu) 2.24 assertion fail ../../bfd/elf.c:2636
as: BFD (GNU Binutils for Ubuntu) 2.24 assertion fail ../../bfd/elf.c:2636
as: BFD (GNU Binutils for Ubuntu) 2.24 assertion fail ../../bfd/elf.c:2636
as: BFD (GNU Binutils for Ubuntu) 2.24 assertion fail ../../bfd/elf.c:2636
as: BFD (GNU Binutils for Ubuntu) 2.24 assertion fail ../../bfd/elf.c:2636
as: BFD (GNU Binutils for Ubuntu) 2.24 assertion fail ../../bfd/elf.c:2636
as: BFD (GNU Binutils for Ubuntu) 2.24 assertion fail ../../bfd/elf.c:2636
as: BFD (GNU Binutils for Ubuntu) 2.24 assertion fail ../../bfd/elf.c:2636
as: BFD (GNU Binutils for Ubuntu) 2.24 assertion fail ../../bfd/elf.c:2636
as: BFD (GNU Binutils for Ubuntu) 2.24 assertion fail ../../bfd/elf.c:2636
as: BFD (GNU Binutils for Ubuntu) 2.24 assertion fail ../../bfd/elf.c:2636
as: BFD (GNU Binutils for Ubuntu) 2.24 assertion fail ../../bfd/elf.c:2636
as: BFD (GNU Binutils for Ubuntu) 2.24 assertion fail ../../bfd/elf.c:2636
as: BFD (GNU Binutils for Ubuntu) 2.24 assertion fail ../../bfd/elf.c:2636
as: BFD (GNU Binutils for Ubuntu) 2.24 assertion fail ../../bfd/elf.c:2636
as: BFD (GNU Binutils for Ubuntu) 2.24 assertion fail ../../bfd/elf.c:2636
as: BFD (GNU Binutils for Ubuntu) 2.24 assertion fail ../../bfd/elf.c:2636
as: BFD (GNU Binutils for Ubuntu) 2.24 assertion fail ../../bfd/elf.c:2636
as: BFD (GNU Binutils for Ubuntu) 2.24 assertion fail ../../bfd/elf.c:2636
as: BFD (GNU Binutils for Ubuntu) 2.24 assertion fail ../../bfd/elf.c:2636
as: BFD (GNU Binutils for Ubuntu) 2.24 assertion fail ../../bfd/elf.c:2636
as: BFD (GNU Binutils for Ubuntu) 2.24 assertion fail ../../bfd/elf.c:2636
as: BFD (GNU Binutils for Ubuntu) 2.24 assertion fail ../../bfd/elf.c:2636
as: BFD (GNU Binutils for Ubuntu) 2.24 assertion fail ../../bfd/elf.c:2636
as: BFD (GNU Binutils for Ubuntu) 2.24 assertion fail ../../bfd/elf.c:2636
as: BFD (GNU Binutils for Ubuntu) 2.24 assertion fail ../../bfd/elf.c:2636
as: BFD (GNU Binutils for Ubuntu) 2.24 assertion fail ../../bfd/elf.c:2636
as: BFD (GNU Binutils for Ubuntu) 2.24 assertion fail ../../bfd/elf.c:2636
as: BFD (GNU Binutils for Ubuntu) 2.24 assertion fail ../../bfd/elf.c:2636
as: BFD (GNU Binutils for Ubuntu) 2.24 assertion fail ../../bfd/elf.c:2636
as: BFD (GNU Binutils for Ubuntu) 2.24 assertion fail ../../bfd/elf.c:2636
as: BFD (GNU Binutils for Ubuntu) 2.24 assertion fail ../../bfd/elf.c:2636
as: BFD (GNU Binutils for Ubuntu) 2.24 assertion fail ../../bfd/elf.c:2636
as: BFD (GNU Binutils for Ubuntu) 2.24 assertion fail ../../bfd/elf.c:2636
as: BFD (GNU Binutils for Ubuntu) 2.24 assertion fail ../../bfd/elf.c:2636
as: BFD (GNU Binutils for Ubuntu) 2.24 assertion fail ../../bfd/elf.c:2636
as: BFD (GNU Binutils for Ubuntu) 2.24 assertion fail ../../bfd/elf.c:2636
as: BFD (GNU Binutils for Ubuntu) 2.24 assertion fail ../../bfd/elf.c:2636
as: BFD (GNU Binutils for Ubuntu) 2.24 assertion fail ../../bfd/elf.c:2636
as: BFD (GNU Binutils for Ubuntu) 2.24 assertion fail ../../bfd/elf.c:2636
as: BFD (GNU Binutils for Ubuntu) 2.24 assertion fail ../../bfd/elf.c:2636
as: BFD (GNU Binutils for Ubuntu) 2.24 assertion fail ../../bfd/elf.c:2636
as: BFD (GNU Binutils for Ubuntu) 2.24 assertion fail ../../bfd/elf.c:2636
as: BFD (GNU Binutils for Ubuntu) 2.24 assertion fail ../../bfd/elf.c:2636
as: BFD (GNU Binutils for Ubuntu) 2.24 assertion fail ../../bfd/elf.c:2636
as: BFD (GNU Binutils for Ubuntu) 2.24 assertion fail ../../bfd/elf.c:2636
as: BFD (GNU Binutils for Ubuntu) 2.24 assertion fail ../../bfd/elf.c:2636
as: BFD (GNU Binutils for Ubuntu) 2.24 assertion fail ../../bfd/elf.c:2636
as: BFD (GNU Binutils for Ubuntu) 2.24 assertion fail ../../bfd/elf.c:2636
as: BFD (GNU Binutils for Ubuntu) 2.24 assertion fail ../../bfd/elf.c:2636
as: BFD (GNU Binutils for Ubuntu) 2.24 assertion fail ../../bfd/elf.c:2636
as: BFD (GNU Binutils for Ubuntu) 2.24 assertion fail ../../bfd/elf.c:2636
as: BFD (GNU Binutils for Ubuntu) 2.24 assertion fail ../../bfd/elf.c:2636
as: BFD (GNU Binutils for Ubuntu) 2.24 assertion fail ../../bfd/elf.c:2636
as: BFD (GNU Binutils for Ubuntu) 2.24 assertion fail ../../bfd/elf.c:2636
as: BFD (GNU Binutils for Ubuntu) 2.24 assertion fail ../../bfd/elf.c:2636
as: BFD (GNU Binutils for Ubuntu) 2.24 assertion fail ../../bfd/elf.c:2636
as: BFD (GNU Binutils for Ubuntu) 2.24 assertion fail ../../bfd/elf.c:2636
as: BFD (GNU Binutils for Ubuntu) 2.24 assertion fail ../../bfd/elf.c:2636
as: BFD (GNU Binutils for Ubuntu) 2.24 assertion fail ../../bfd/elf.c:2636
as: BFD (GNU Binutils for Ubuntu) 2.24 assertion fail ../../bfd/elf.c:2636
as: BFD (GNU Binutils for Ubuntu) 2.24 assertion fail ../../bfd/elf.c:2636
as: BFD (GNU Binutils for Ubuntu) 2.24 assertion fail ../../bfd/elf.c:2636
as: BFD (GNU Binutils for Ubuntu) 2.24 assertion fail ../../bfd/elf.c:2636
as: BFD (GNU Binutils for Ubuntu) 2.24 assertion fail ../../bfd/elf.c:2636
as: BFD (GNU Binutils for Ubuntu) 2.24 assertion fail ../../bfd/elf.c:2636
as: BFD (GNU Binutils for Ubuntu) 2.24 assertion fail ../../bfd/elf.c:2636
as: BFD (GNU Binutils for Ubuntu) 2.24 assertion fail ../../bfd/elf.c:2636
as: BFD (GNU Binutils for Ubuntu) 2.24 assertion fail ../../bfd/elf.c:2636
as: BFD (GNU Binutils for Ubuntu) 2.24 assertion fail ../../bfd/elf.c:2636
as: BFD (GNU Binutils for Ubuntu) 2.24 assertion fail ../../bfd/elf.c:2636
as: BFD (GNU Binutils for Ubuntu) 2.24 assertion fail ../../bfd/elf.c:2636
as: BFD (GNU Binutils for Ubuntu) 2.24 assertion fail ../../bfd/elf.c:2636
as: BFD (GNU Binutils for Ubuntu) 2.24 assertion fail ../../bfd/elf.c:2636
as: BFD (GNU Binutils for Ubuntu) 2.24 assertion fail ../../bfd/elf.c:2636
as: BFD (GNU Binutils for Ubuntu) 2.24 assertion fail ../../bfd/elf.c:2636
as: BFD (GNU Binutils for Ubuntu) 2.24 assertion fail ../../bfd/elf.c:2636
as: BFD (GNU Binutils for Ubuntu) 2.24 assertion fail ../../bfd/elf.c:2636
as: BFD (GNU Binutils for Ubuntu) 2.24 assertion fail ../../bfd/elf.c:2636
as: BFD (GNU Binutils for Ubuntu) 2.24 assertion fail ../../bfd/elf.c:2636
as: BFD (GNU Binutils for Ubuntu) 2.24 assertion fail ../../bfd/elf.c:2636
as: BFD (GNU Binutils for Ubuntu) 2.24 assertion fail ../../bfd/elf.c:2636
as: BFD (GNU Binutils for Ubuntu) 2.24 assertion fail ../../bfd/elf.c:2636
as: BFD (GNU Binutils for Ubuntu) 2.24 assertion fail ../../bfd/elf.c:2636
as: BFD (GNU Binutils for Ubuntu) 2.24 assertion fail ../../bfd/elf.c:2636
as: BFD (GNU Binutils for Ubuntu) 2.24 assertion fail ../../bfd/elf.c:2636
as: BFD (GNU Binutils for Ubuntu) 2.24 assertion fail ../../bfd/elf.c:2636
as: BFD (GNU Binutils for Ubuntu) 2.24 assertion fail ../../bfd/elf.c:2636
as: BFD (GNU Binutils for Ubuntu) 2.24 assertion fail ../../bfd/elf.c:2636
as: BFD (GNU Binutils for Ubuntu) 2.24 assertion fail ../../bfd/elf.c:2636
as: BFD (GNU Binutils for Ubuntu) 2.24 assertion fail ../../bfd/elf.c:2636
as: BFD (GNU Binutils for Ubuntu) 2.24 assertion fail ../../bfd/elf.c:2636
as: BFD (GNU Binutils for Ubuntu) 2.24 assertion fail ../../bfd/elf.c:2636
as: BFD (GNU Binutils for Ubuntu) 2.24 assertion fail ../../bfd/elf.c:2636
as: BFD (GNU Binutils for Ubuntu) 2.24 assertion fail ../../bfd/elf.c:2636
as: BFD (GNU Binutils for Ubuntu) 2.24 assertion fail ../../bfd/elf.c:2636
as: BFD (GNU Binutils for Ubuntu) 2.24 assertion fail ../../bfd/elf.c:2636
as: BFD (GNU Binutils for Ubuntu) 2.24 assertion fail ../../bfd/elf.c:2636
as: BFD (GNU Binutils for Ubuntu) 2.24 assertion fail ../../bfd/elf.c:2636
as: BFD (GNU Binutils for Ubuntu) 2.24 assertion fail ../../bfd/elf.c:2636
as: BFD (GNU Binutils for Ubuntu) 2.24 assertion fail ../../bfd/elf.c:2636
as: BFD (GNU Binutils for Ubuntu) 2.24 assertion fail ../../bfd/elf.c:2636
as: BFD (GNU Binutils for Ubuntu) 2.24 assertion fail ../../bfd/elf.c:2636
as: BFD (GNU Binutils for Ubuntu) 2.24 assertion fail ../../bfd/elf.c:2636
as: BFD (GNU Binutils for Ubuntu) 2.24 assertion fail ../../bfd/elf.c:2636
as: BFD (GNU Binutils for Ubuntu) 2.24 assertion fail ../../bfd/elf.c:2636
as: BFD (GNU Binutils for Ubuntu) 2.24 assertion fail ../../bfd/elf.c:2636
as: BFD (GNU Binutils for Ubuntu) 2.24 assertion fail ../../bfd/elf.c:2636
as: BFD (GNU Binutils for Ubuntu) 2.24 assertion fail ../../bfd/elf.c:2636
as: BFD (GNU Binutils for Ubuntu) 2.24 assertion fail ../../bfd/elf.c:2636
as: BFD (GNU Binutils for Ubuntu) 2.24 assertion fail ../../bfd/elf.c:2636
as: BFD (GNU Binutils for Ubuntu) 2.24 assertion fail ../../bfd/elf.c:2636
as: BFD (GNU Binutils for Ubuntu) 2.24 assertion fail ../../bfd/elf.c:2636
as: BFD (GNU Binutils for Ubuntu) 2.24 assertion fail ../../bfd/elf.c:2636
as: BFD (GNU Binutils for Ubuntu) 2.24 assertion fail ../../bfd/elf.c:2636
as: BFD (GNU Binutils for Ubuntu) 2.24 assertion fail ../../bfd/elf.c:2636
as: BFD (GNU Binutils for Ubuntu) 2.24 assertion fail ../../bfd/elf.c:2636
as: BFD (GNU Binutils for Ubuntu) 2.24 assertion fail ../../bfd/elf.c:2636
as: BFD (GNU Binutils for Ubuntu) 2.24 assertion fail ../../bfd/elf.c:2636
as: BFD (GNU Binutils for Ubuntu) 2.24 assertion fail ../../bfd/elf.c:2636
as: BFD (GNU Binutils for Ubuntu) 2.24 assertion fail ../../bfd/elf.c:2636
as: BFD (GNU Binutils for Ubuntu) 2.24 assertion fail ../../bfd/elf.c:2636
as: BFD (GNU Binutils for Ubuntu) 2.24 assertion fail ../../bfd/elf.c:2636
as: BFD (GNU Binutils for Ubuntu) 2.24 assertion fail ../../bfd/elf.c:2636
as: BFD (GNU Binutils for Ubuntu) 2.24 assertion fail ../../bfd/elf.c:2636
as: BFD (GNU Binutils for Ubuntu) 2.24 assertion fail ../../bfd/elf.c:2636
as: BFD (GNU Binutils for Ubuntu) 2.24 assertion fail ../../bfd/elf.c:2636
as: BFD (GNU Binutils for Ubuntu) 2.24 assertion fail ../../bfd/elf.c:2636
as: BFD (GNU Binutils for Ubuntu) 2.24 assertion fail ../../bfd/elf.c:2636
as: BFD (GNU Binutils for Ubuntu) 2.24 assertion fail ../../bfd/elf.c:2636
as: BFD (GNU Binutils for Ubuntu) 2.24 assertion fail ../../bfd/elf.c:2636
as: BFD (GNU Binutils for Ubuntu) 2.24 assertion fail ../../bfd/elf.c:2636
as: BFD (GNU Binutils for Ubuntu) 2.24 assertion fail ../../bfd/elf.c:2636
as: BFD (GNU Binutils for Ubuntu) 2.24 assertion fail ../../bfd/elf.c:2636
as: BFD (GNU Binutils for Ubuntu) 2.24 assertion fail ../../bfd/elf.c:2636
as: BFD (GNU Binutils for Ubuntu) 2.24 assertion fail ../../bfd/elf.c:2636
as: BFD (GNU Binutils for Ubuntu) 2.24 assertion fail ../../bfd/elf.c:2636
as: BFD (GNU Binutils for Ubuntu) 2.24 assertion fail ../../bfd/elf.c:2636
as: BFD (GNU Binutils for Ubuntu) 2.24 assertion fail ../../bfd/elf.c:2636
as: BFD (GNU Binutils for Ubuntu) 2.24 assertion fail ../../bfd/elf.c:2636
as: BFD (GNU Binutils for Ubuntu) 2.24 assertion fail ../../bfd/elf.c:2636
as: BFD (GNU Binutils for Ubuntu) 2.24 assertion fail ../../bfd/elf.c:2636
as: BFD (GNU Binutils for Ubuntu) 2.24 assertion fail ../../bfd/elf.c:2636
as: BFD (GNU Binutils for Ubuntu) 2.24 assertion fail ../../bfd/elf.c:2636
as: BFD (GNU Binutils for Ubuntu) 2.24 assertion fail ../../bfd/elf.c:2636
as: BFD (GNU Binutils for Ubuntu) 2.24 assertion fail ../../bfd/elf.c:2636
as: BFD (GNU Binutils for Ubuntu) 2.24 assertion fail ../../bfd/elf.c:2636
as: BFD (GNU Binutils for Ubuntu) 2.24 assertion fail ../../bfd/elf.c:2636
as: BFD (GNU Binutils for Ubuntu) 2.24 assertion fail ../../bfd/elf.c:2636
as: BFD (GNU Binutils for Ubuntu) 2.24 assertion fail ../../bfd/elf.c:2636
as: BFD (GNU Binutils for Ubuntu) 2.24 assertion fail ../../bfd/elf.c:2636
as: BFD (GNU Binutils for Ubuntu) 2.24 assertion fail ../../bfd/elf.c:2636
as: BFD (GNU Binutils for Ubuntu) 2.24 assertion fail ../../bfd/elf.c:2636
as: BFD (GNU Binutils for Ubuntu) 2.24 assertion fail ../../bfd/elf.c:2636
as: BFD (GNU Binutils for Ubuntu) 2.24 assertion fail ../../bfd/elf.c:2636
as: BFD (GNU Binutils for Ubuntu) 2.24 assertion fail ../../bfd/elf.c:2636
as: BFD (GNU Binutils for Ubuntu) 2.24 assertion fail ../../bfd/elf.c:2636
as: BFD (GNU Binutils for Ubuntu) 2.24 assertion fail ../../bfd/elf.c:2636
as: BFD (GNU Binutils for Ubuntu) 2.24 assertion fail ../../bfd/elf.c:2636
as: BFD (GNU Binutils for Ubuntu) 2.24 assertion fail ../../bfd/elf.c:2636
as: BFD (GNU Binutils for Ubuntu) 2.24 assertion fail ../../bfd/elf.c:2636
as: BFD (GNU Binutils for Ubuntu) 2.24 assertion fail ../../bfd/elf.c:2636
/tmp/ccW58I2y.s: Fatal error: can't close master/.libs/libmesos_no_3rdparty_la-http.o: No
space left on device
make[3]: *** [master/libmesos_no_3rdparty_la-http.lo] Error 1
../../src/master/allocator/mesos/metrics.cpp:208:1: fatal error: error writing to /tmp/ccuAdHQx.s:
No space left on device
 } // namespace mesos {
 ^
compilation terminated.
../../src/master/allocator/mesos/hierarchical.cpp:2443:1: fatal error: error writing to /tmp/ccuKVDWs.s:
No space left on device
 } // namespace mesos {
 ^
compilation terminated.
../../src/master/master.cpp:10104:1: fatal error: error writing to /tmp/ccYI7wu5.s: No space
left on device
 } // namespace mesos {
 ^
compilation terminated.
../../src/master/weights_handler.cpp:391:1: fatal error: error writing to /tmp/ccMPU07q.s:
No space left on device
 } // namespace mesos {
 ^
compilation terminated.
The bug is not reproducible, so it is likely a hardware or OS problem.
make[3]: *** [master/allocator/mesos/libmesos_no_3rdparty_la-metrics.lo] Error 1
The bug is not reproducible, so it is likely a hardware or OS problem.
make[3]: *** [master/libmesos_no_3rdparty_la-weights_handler.lo] Error 1
The bug is not reproducible, so it is likely a hardware or OS problem.
make[3]: *** [master/allocator/mesos/libmesos_no_3rdparty_la-hierarchical.lo] Error 1
The bug is not reproducible, so it is likely a hardware or OS problem.
make[3]: *** [master/libmesos_no_3rdparty_la-master.lo] Error 1
make[3]: Leaving directory `/mesos/mesos-1.5.0/_build/src'
make[2]: *** [all] Error 2
make[2]: Leaving directory `/mesos/mesos-1.5.0/_build/src'
make[1]: *** [all-recursive] Error 1
make[1]: Leaving directory `/mesos/mesos-1.5.0/_build'
make: *** [distcheck] Error 1
+ docker rmi mesos-1504779829-498
Untagged: mesos-1504779829-498:latest
Deleted: sha256:a1e2016cafd511493d2274b1ea2ac39bfa7990fe87cdeec43a93f14fd3d07e72
Deleted: sha256:0b91455344d57099dd2da5226d680939927b49b8ac1723744e682f1e2e9396a8
Deleted: sha256:d998e5e127f472712b12ea7e78ede38278fc222108900b2522a4126f9474f2bf
Deleted: sha256:e4183da21e03899e26bc9728f5cc7106c518ece947d4a7d3db611c6665e7dbac
Deleted: sha256:b9d47300be5cfbb4479f341cc4812bd9cb83ccfa47c27fe5ce4c746b1f706050
Deleted: sha256:3bd78e6c436a3c6c7fa0c46d09ba9bebf8c0ba351e586b3ea1ad4e63c98a562e
Deleted: sha256:a62c93d86ca2ee557f32e64854e356640190be8794d265cb5d5b027016a1420a
Deleted: sha256:8f8dd2f32bfedb62071c86db28d31fd7cd123b07743459014f8fa22634c019da
Deleted: sha256:6012c1da375f26b1e976e51c8b4d231d02a335fb7a4f0c9e35bd7a22126f29c2
Deleted: sha256:ef428f35ea9d4e7178d69791f722ee9ee7f7c0fb0faef2db14c87d830f490b4c
Deleted: sha256:4bfd66b4c3cbc3cdfe3cc0eab025883420013e6e2bbd9c7beec5a4a0603083a3
Deleted: sha256:1bec659e2332587b4f1ed52170377ecf7d52de93004f553092868a48f192eaa1
Deleted: sha256:b9605b00968a2b2de6c32f4b71f84f6acf06acce5617d1232b4fec0ff00f6d38
Deleted: sha256:2a77952cccfbd7fcb9ae0e3803e4b842e53246dc4e4a529c1b377e9d1704cd0c
Deleted: sha256:fabf0e450e8dc72bc78ff9e822f184d83b52d658a77d95414e13c9c71111b8d6
Deleted: sha256:1363217b167f23fa5a64a4ac51c602b6218f38f4fd89f2eb840e8e9fcefb70a9
Deleted: sha256:b46f6491d4af79eb7f27a3f257fee692abd723cd1f2faa8bc1bc07bcbf3bf4eb
Deleted: sha256:feede234a09fe6d83910e17aba2973eae7b45e82788be490e36e766a720235fa
Deleted: sha256:165701f4b8e49d3d3117d444b293161a69729ddc1305d569a3a52fefc195f96d
Deleted: sha256:0086dd3e66acf76f424ae43731cd3b191ee825cfd7428e2d05086ac83b3a3345
Deleted: sha256:5cf648f63ea4168818bd5957e2e2c16779426ecedecc908c94a60530ce88f0ee
Deleted: sha256:1d71e1e9f2c5ff02c3e9b084f0e5cc4c241b0ed03f2b912ef7c3d06c9d73b5b5
Deleted: sha256:c450f95917089b00a9d678c8477acc4417d93a3e6a86f04b08742a01e9e9a436
Deleted: sha256:1563cca21a9c7276dbb2d45934ea885fba254dc435711abad5f5c1f5e4ae738e
Deleted: sha256:977e3685b929a0a8439731d8fe4b7cd793733d90d081bdfed4cc49e425ea25d8
Deleted: sha256:eb09743e6dd5cf93203d46a5ac828e37e8e3007dbd0902ba8506e89657f85221
Deleted: sha256:0fd37962f55a576a75fd42339e04ecfce1f2d8eb3873ad885124b5d5b088fe69
Deleted: sha256:9739c546d600d269f12d616dfc3b1c49ba561bab73c30d658da8c97c4796a99d
Build step 'Execute shell' marked build as failure
Not sending mail to unregistered user yujie.jay@gmail.com
Not sending mail to unregistered user benjamin.hindman@gmail.com
Not sending mail to unregistered user zhq527725@gmail.com

Mime
View raw message