mesos-builds mailing list archives

Site index · List index
Message view « Date » · « Thread »
Top « Date » · « Thread »
From Apache Jenkins Server <jenk...@builds.apache.org>
Subject Build failed in Jenkins: Mesos-Buildbot » autotools,clang,--verbose --enable-libevent --enable-ssl,GLOG_v=1 MESOS_VERBOSE=1,ubuntu:14.04,(ubuntu)&&(!ubuntu-us1)&&(!ubuntu-eu2) #4198
Date Tue, 05 Sep 2017 21:46:12 GMT
See <https://builds.apache.org/job/Mesos-Buildbot/BUILDTOOL=autotools,COMPILER=clang,CONFIGURATION=--verbose%20--enable-libevent%20--enable-ssl,ENVIRONMENT=GLOG_v=1%20MESOS_VERBOSE=1,OS=ubuntu%3A14.04,label_exp=(ubuntu)&&(!ubuntu-us1)&&(!ubuntu-eu2)/4198/display/redirect?page=changes>

Changes:

[josephwu] CMake: Harden Mesos build.

[josephwu] CMake: Fixed two instances of list appending style.

------------------------------------------
[...truncated 32.77 MB...]
I0905 21:46:00.942303  6899 provisioner.cpp:255] Using default backend 'copy'
I0905 21:46:00.946099 28419 slave.cpp:252] Mesos agent started on (817)@172.17.0.3:36453
I0905 21:46:00.946137 28419 slave.cpp:253] Flags at startup: --acls="" --appc_simple_discovery_uri_prefix="http://"
--appc_store_dir="/tmp/Endpoint_SlaveEndpointTest_UnauthorizedRequest_0_BGggaK/store/appc"
--authenticate_http_executors="true" --authenticate_http_readonly="true" --authenticate_http_readwrite="true"
--authenticatee="crammd5" --authentication_backoff_factor="1secs" --authorizer="local" --cgroups_cpu_enable_pids_and_tids_count="false"
--cgroups_enable_cfs="false" --cgroups_hierarchy="/sys/fs/cgroup" --cgroups_limit_swap="false"
--cgroups_root="mesos" --container_disk_watch_interval="15secs" --containerizers="mesos" --credential="/tmp/Endpoint_SlaveEndpointTest_UnauthorizedRequest_0_BGggaK/credential"
--default_role="*" --disallow_sharing_agent_pid_namespace="false" --disk_watch_interval="1mins"
--docker="docker" --docker_kill_orphans="true" --docker_registry="https://registry-1.docker.io"
--docker_remove_delay="6hrs" --docker_socket="/var/run/docker.sock" --docker_stop_timeout="0ns"
--docker_store_dir="/tmp/Endpoint_SlaveEndpointTest_UnauthorizedRequest_0_BGggaK/store/docker"
--docker_volume_checkpoint_dir="/var/run/mesos/isolators/docker/volume" --enforce_container_disk_quota="false"
--executor_registration_timeout="1mins" --executor_reregistration_timeout="2secs" --executor_secret_key="/tmp/Endpoint_SlaveEndpointTest_UnauthorizedRequest_0_BGggaK/executor_secret_key"
--executor_shutdown_grace_period="5secs" --fetcher_cache_dir="/tmp/Endpoint_SlaveEndpointTest_UnauthorizedRequest_0_BGggaK/fetch"
--fetcher_cache_size="2GB" --frameworks_home="" --gc_delay="1weeks" --gc_disk_headroom="0.1"
--hadoop_home="" --help="false" --hostname_lookup="true" --http_command_executor="false" --http_credentials="/tmp/Endpoint_SlaveEndpointTest_UnauthorizedRequest_0_BGggaK/http_credentials"
--http_heartbeat_interval="30secs" --initialize_driver_logging="true" --isolation="posix/cpu,posix/mem"
--launcher="posix" --launcher_dir="/mesos/mesos-1.5.0/_build/src" --logbufsecs="0" --logging_level="INFO"
--max_completed_executors_per_framework="150" --oversubscribed_resources_interval="15secs"
--perf_duration="10secs" --perf_interval="1mins" --port="5051" --qos_correction_interval_min="0ns"
--quiet="false" --recover="reconnect" --recovery_timeout="15mins" --registration_backoff_factor="10ms"
--resources="cpus:2;gpus:0;mem:1024;disk:1024;ports:[31000-32000]" --revocable_cpu_low_priority="true"
--runtime_dir="/tmp/Endpoint_SlaveEndpointTest_UnauthorizedRequest_0_BGggaK" --sandbox_directory="/mnt/mesos/sandbox"
--strict="true" --switch_user="true" --systemd_enable_support="true" --systemd_runtime_directory="/run/systemd/system"
--version="false" --work_dir="/tmp/Endpoint_SlaveEndpointTest_UnauthorizedRequest_0_CA44jp"
--zk_session_timeout="10secs"
I0905 21:46:00.946496 28419 credentials.hpp:86] Loading credential for authentication from
'/tmp/Endpoint_SlaveEndpointTest_UnauthorizedRequest_0_BGggaK/credential'
I0905 21:46:00.946647 28419 slave.cpp:285] Agent using credential for: test-principal
I0905 21:46:00.946668 28419 credentials.hpp:37] Loading credentials for authentication from
'/tmp/Endpoint_SlaveEndpointTest_UnauthorizedRequest_0_BGggaK/http_credentials'
I0905 21:46:00.946943 28419 http.cpp:1045] Creating default 'basic' HTTP authenticator for
realm 'mesos-agent-executor'
I0905 21:46:00.947067 28419 http.cpp:1066] Creating default 'jwt' HTTP authenticator for realm
'mesos-agent-executor'
I0905 21:46:00.947258 28419 http.cpp:1045] Creating default 'basic' HTTP authenticator for
realm 'mesos-agent-readonly'
I0905 21:46:00.947363 28419 http.cpp:1066] Creating default 'jwt' HTTP authenticator for realm
'mesos-agent-readonly'
I0905 21:46:00.947543 28419 http.cpp:1045] Creating default 'basic' HTTP authenticator for
realm 'mesos-agent-readwrite'
I0905 21:46:00.947643 28419 http.cpp:1066] Creating default 'jwt' HTTP authenticator for realm
'mesos-agent-readwrite'
I0905 21:46:00.949054 28419 slave.cpp:581] Agent resources: [{"name":"cpus","scalar":{"value":2.0},"type":"SCALAR"},{"name":"mem","scalar":{"value":1024.0},"type":"SCALAR"},{"name":"disk","scalar":{"value":1024.0},"type":"SCALAR"},{"name":"ports","ranges":{"range":[{"begin":31000,"end":32000}]},"type":"RANGES"}]
I0905 21:46:00.949271 28419 slave.cpp:589] Agent attributes: [  ]
I0905 21:46:00.949285 28419 slave.cpp:598] Agent hostname: cb3c7444cbf2
I0905 21:46:00.949412 28423 status_update_manager.cpp:177] Pausing sending status updates
I0905 21:46:00.950815 28432 state.cpp:64] Recovering state from '/tmp/Endpoint_SlaveEndpointTest_UnauthorizedRequest_0_CA44jp/meta'
I0905 21:46:00.951074 28433 status_update_manager.cpp:203] Recovering status update manager
I0905 21:46:00.951306 28425 containerizer.cpp:646] Recovering containerizer
I0905 21:46:00.953037 28438 provisioner.cpp:416] Provisioner recovery complete
I0905 21:46:00.953686 28439 slave.cpp:6296] Finished recovery
I0905 21:46:00.954165 28439 slave.cpp:6478] Querying resource estimator for oversubscribable
resources
I0905 21:46:00.954401 28424 slave.cpp:6492] Received oversubscribable resources {} from the
resource estimator
I0905 21:46:00.957010 28417 process.cpp:3954] Handling HTTP event for process 'slave(817)'
with path: '/slave(817)/monitor/statistics'
I0905 21:46:00.959204 28427 http.cpp:1185] HTTP GET for /slave(817)/monitor/statistics from
172.17.0.3:35456
I0905 21:46:00.959270 28427 http.cpp:976] Authorizing principal 'test-principal' to GET the
'/monitor/statistics' endpoint
I0905 21:46:00.961284 28435 slave.cpp:859] Agent terminating
[       OK ] Endpoint/SlaveEndpointTest.UnauthorizedRequest/0 (34 ms)
[ RUN      ] Endpoint/SlaveEndpointTest.UnauthorizedRequest/1
I0905 21:46:00.976395  6899 containerizer.cpp:290] Using isolation { environment_secret, posix/cpu,
posix/mem, filesystem/posix, network/cni }
W0905 21:46:00.976924  6899 backend.cpp:76] Failed to create 'aufs' backend: AufsBackend requires
root privileges
W0905 21:46:00.977037  6899 backend.cpp:76] Failed to create 'bind' backend: BindBackend requires
root privileges
I0905 21:46:00.977073  6899 provisioner.cpp:255] Using default backend 'copy'
I0905 21:46:00.981355 28434 slave.cpp:252] Mesos agent started on (818)@172.17.0.3:36453
I0905 21:46:00.981437 28434 slave.cpp:253] Flags at startup: --acls="" --appc_simple_discovery_uri_prefix="http://"
--appc_store_dir="/tmp/Endpoint_SlaveEndpointTest_UnauthorizedRequest_1_b7sjO5/store/appc"
--authenticate_http_executors="true" --authenticate_http_readonly="true" --authenticate_http_readwrite="true"
--authenticatee="crammd5" --authentication_backoff_factor="1secs" --authorizer="local" --cgroups_cpu_enable_pids_and_tids_count="false"
--cgroups_enable_cfs="false" --cgroups_hierarchy="/sys/fs/cgroup" --cgroups_limit_swap="false"
--cgroups_root="mesos" --container_disk_watch_interval="15secs" --containerizers="mesos" --credential="/tmp/Endpoint_SlaveEndpointTest_UnauthorizedRequest_1_b7sjO5/credential"
--default_role="*" --disallow_sharing_agent_pid_namespace="false" --disk_watch_interval="1mins"
--docker="docker" --docker_kill_orphans="true" --docker_registry="https://registry-1.docker.io"
--docker_remove_delay="6hrs" --docker_socket="/var/run/docker.sock" --docker_stop_timeout="0ns"
--docker_store_dir="/tmp/Endpoint_SlaveEndpointTest_UnauthorizedRequest_1_b7sjO5/store/docker"
--docker_volume_checkpoint_dir="/var/run/mesos/isolators/docker/volume" --enforce_container_disk_quota="false"
--executor_registration_timeout="1mins" --executor_reregistration_timeout="2secs" --executor_secret_key="/tmp/Endpoint_SlaveEndpointTest_UnauthorizedRequest_1_b7sjO5/executor_secret_key"
--executor_shutdown_grace_period="5secs" --fetcher_cache_dir="/tmp/Endpoint_SlaveEndpointTest_UnauthorizedRequest_1_b7sjO5/fetch"
--fetcher_cache_size="2GB" --frameworks_home="" --gc_delay="1weeks" --gc_disk_headroom="0.1"
--hadoop_home="" --help="false" --hostname_lookup="true" --http_command_executor="false" --http_credentials="/tmp/Endpoint_SlaveEndpointTest_UnauthorizedRequest_1_b7sjO5/http_credentials"
--http_heartbeat_interval="30secs" --initialize_driver_logging="true" --isolation="posix/cpu,posix/mem"
--launcher="posix" --launcher_dir="/mesos/mesos-1.5.0/_build/src" --logbufsecs="0" --logging_level="INFO"
--max_completed_executors_per_framework="150" --oversubscribed_resources_interval="15secs"
--perf_duration="10secs" --perf_interval="1mins" --port="5051" --qos_correction_interval_min="0ns"
--quiet="false" --recover="reconnect" --recovery_timeout="15mins" --registration_backoff_factor="10ms"
--resources="cpus:2;gpus:0;mem:1024;disk:1024;ports:[31000-32000]" --revocable_cpu_low_priority="true"
--runtime_dir="/tmp/Endpoint_SlaveEndpointTest_UnauthorizedRequest_1_b7sjO5" --sandbox_directory="/mnt/mesos/sandbox"
--strict="true" --switch_user="true" --systemd_enable_support="true" --systemd_runtime_directory="/run/systemd/system"
--version="false" --work_dir="/tmp/Endpoint_SlaveEndpointTest_UnauthorizedRequest_1_w8nZSK"
--zk_session_timeout="10secs"
I0905 21:46:00.982081 28434 credentials.hpp:86] Loading credential for authentication from
'/tmp/Endpoint_SlaveEndpointTest_UnauthorizedRequest_1_b7sjO5/credential'
I0905 21:46:00.982306 28434 slave.cpp:285] Agent using credential for: test-principal
I0905 21:46:00.982333 28434 credentials.hpp:37] Loading credentials for authentication from
'/tmp/Endpoint_SlaveEndpointTest_UnauthorizedRequest_1_b7sjO5/http_credentials'
I0905 21:46:00.982687 28434 http.cpp:1045] Creating default 'basic' HTTP authenticator for
realm 'mesos-agent-executor'
I0905 21:46:00.982851 28434 http.cpp:1066] Creating default 'jwt' HTTP authenticator for realm
'mesos-agent-executor'
I0905 21:46:00.983183 28434 http.cpp:1045] Creating default 'basic' HTTP authenticator for
realm 'mesos-agent-readonly'
I0905 21:46:00.983337 28434 http.cpp:1066] Creating default 'jwt' HTTP authenticator for realm
'mesos-agent-readonly'
I0905 21:46:00.983655 28434 http.cpp:1045] Creating default 'basic' HTTP authenticator for
realm 'mesos-agent-readwrite'
I0905 21:46:00.983829 28434 http.cpp:1066] Creating default 'jwt' HTTP authenticator for realm
'mesos-agent-readwrite'
I0905 21:46:00.985949 28434 slave.cpp:581] Agent resources: [{"name":"cpus","scalar":{"value":2.0},"type":"SCALAR"},{"name":"mem","scalar":{"value":1024.0},"type":"SCALAR"},{"name":"disk","scalar":{"value":1024.0},"type":"SCALAR"},{"name":"ports","ranges":{"range":[{"begin":31000,"end":32000}]},"type":"RANGES"}]
I0905 21:46:00.986230 28434 slave.cpp:589] Agent attributes: [  ]
I0905 21:46:00.986250 28434 slave.cpp:598] Agent hostname: cb3c7444cbf2
I0905 21:46:00.986450 28436 status_update_manager.cpp:177] Pausing sending status updates
I0905 21:46:00.988363 28437 state.cpp:64] Recovering state from '/tmp/Endpoint_SlaveEndpointTest_UnauthorizedRequest_1_w8nZSK/meta'
I0905 21:46:00.988850 28429 status_update_manager.cpp:203] Recovering status update manager
I0905 21:46:00.989095 28426 containerizer.cpp:646] Recovering containerizer
I0905 21:46:00.991034 28431 provisioner.cpp:416] Provisioner recovery complete
I0905 21:46:00.991436 28434 slave.cpp:6296] Finished recovery
I0905 21:46:00.992033 28434 slave.cpp:6478] Querying resource estimator for oversubscribable
resources
I0905 21:46:00.992357 28439 slave.cpp:6492] Received oversubscribable resources {} from the
resource estimator
I0905 21:46:00.995859 28428 process.cpp:3954] Handling HTTP event for process 'slave(818)'
with path: '/slave(818)/monitor/statistics.json'
I0905 21:46:00.998082 28435 http.cpp:1185] HTTP GET for /slave(818)/monitor/statistics.json
from 172.17.0.3:35460
I0905 21:46:00.998184 28435 http.cpp:976] Authorizing principal 'test-principal' to GET the
'/monitor/statistics.json' endpoint
I0905 21:46:01.000707 28416 slave.cpp:859] Agent terminating
[       OK ] Endpoint/SlaveEndpointTest.UnauthorizedRequest/1 (38 ms)
[ RUN      ] Endpoint/SlaveEndpointTest.UnauthorizedRequest/2
I0905 21:46:01.015400  6899 containerizer.cpp:290] Using isolation { environment_secret, posix/cpu,
posix/mem, filesystem/posix, network/cni }
W0905 21:46:01.015995  6899 backend.cpp:76] Failed to create 'aufs' backend: AufsBackend requires
root privileges
W0905 21:46:01.016132  6899 backend.cpp:76] Failed to create 'bind' backend: BindBackend requires
root privileges
I0905 21:46:01.016180  6899 provisioner.cpp:255] Using default backend 'copy'
I0905 21:46:01.021045 28426 slave.cpp:252] Mesos agent started on (819)@172.17.0.3:36453
I0905 21:46:01.021092 28426 slave.cpp:253] Flags at startup: --acls="" --appc_simple_discovery_uri_prefix="http://"
--appc_store_dir="/tmp/Endpoint_SlaveEndpointTest_UnauthorizedRequest_2_ogDgPr/store/appc"
--authenticate_http_executors="true" --authenticate_http_readonly="true" --authenticate_http_readwrite="true"
--authenticatee="crammd5" --authentication_backoff_factor="1secs" --authorizer="local" --cgroups_cpu_enable_pids_and_tids_count="false"
--cgroups_enable_cfs="false" --cgroups_hierarchy="/sys/fs/cgroup" --cgroups_limit_swap="false"
--cgroups_root="mesos" --container_disk_watch_interval="15secs" --containerizers="mesos" --credential="/tmp/Endpoint_SlaveEndpointTest_UnauthorizedRequest_2_ogDgPr/credential"
--default_role="*" --disallow_sharing_agent_pid_namespace="false" --disk_watch_interval="1mins"
--docker="docker" --docker_kill_orphans="true" --docker_registry="https://registry-1.docker.io"
--docker_remove_delay="6hrs" --docker_socket="/var/run/docker.sock" --docker_stop_timeout="0ns"
--docker_store_dir="/tmp/Endpoint_SlaveEndpointTest_UnauthorizedRequest_2_ogDgPr/store/docker"
--docker_volume_checkpoint_dir="/var/run/mesos/isolators/docker/volume" --enforce_container_disk_quota="false"
--executor_registration_timeout="1mins" --executor_reregistration_timeout="2secs" --executor_secret_key="/tmp/Endpoint_SlaveEndpointTest_UnauthorizedRequest_2_ogDgPr/executor_secret_key"
--executor_shutdown_grace_period="5secs" --fetcher_cache_dir="/tmp/Endpoint_SlaveEndpointTest_UnauthorizedRequest_2_ogDgPr/fetch"
--fetcher_cache_size="2GB" --frameworks_home="" --gc_delay="1weeks" --gc_disk_headroom="0.1"
--hadoop_home="" --help="false" --hostname_lookup="true" --http_command_executor="false" --http_credentials="/tmp/Endpoint_SlaveEndpointTest_UnauthorizedRequest_2_ogDgPr/http_credentials"
--http_heartbeat_interval="30secs" --initialize_driver_logging="true" --isolation="posix/cpu,posix/mem"
--launcher="posix" --launcher_dir="/mesos/mesos-1.5.0/_build/src" --logbufsecs="0" --logging_level="INFO"
--max_completed_executors_per_framework="150" --oversubscribed_resources_interval="15secs"
--perf_duration="10secs" --perf_interval="1mins" --port="5051" --qos_correction_interval_min="0ns"
--quiet="false" --recover="reconnect" --recovery_timeout="15mins" --registration_backoff_factor="10ms"
--resources="cpus:2;gpus:0;mem:1024;disk:1024;ports:[31000-32000]" --revocable_cpu_low_priority="true"
--runtime_dir="/tmp/Endpoint_SlaveEndpointTest_UnauthorizedRequest_2_ogDgPr" --sandbox_directory="/mnt/mesos/sandbox"
--strict="true" --switch_user="true" --systemd_enable_support="true" --systemd_runtime_directory="/run/systemd/system"
--version="false" --work_dir="/tmp/Endpoint_SlaveEndpointTest_UnauthorizedRequest_2_5CZ9N6"
--zk_session_timeout="10secs"
I0905 21:46:01.021560 28426 credentials.hpp:86] Loading credential for authentication from
'/tmp/Endpoint_SlaveEndpointTest_UnauthorizedRequest_2_ogDgPr/credential'
I0905 21:46:01.021770 28426 slave.cpp:285] Agent using credential for: test-principal
I0905 21:46:01.021811 28426 credentials.hpp:37] Loading credentials for authentication from
'/tmp/Endpoint_SlaveEndpointTest_UnauthorizedRequest_2_ogDgPr/http_credentials'
I0905 21:46:01.022163 28426 http.cpp:1045] Creating default 'basic' HTTP authenticator for
realm 'mesos-agent-executor'
I0905 21:46:01.022334 28426 http.cpp:1066] Creating default 'jwt' HTTP authenticator for realm
'mesos-agent-executor'
I0905 21:46:01.022589 28426 http.cpp:1045] Creating default 'basic' HTTP authenticator for
realm 'mesos-agent-readonly'
I0905 21:46:01.022698 28426 http.cpp:1066] Creating default 'jwt' HTTP authenticator for realm
'mesos-agent-readonly'
I0905 21:46:01.022902 28426 http.cpp:1045] Creating default 'basic' HTTP authenticator for
realm 'mesos-agent-readwrite'
I0905 21:46:01.023011 28426 http.cpp:1066] Creating default 'jwt' HTTP authenticator for realm
'mesos-agent-readwrite'
I0905 21:46:01.024529 28426 slave.cpp:581] Agent resources: [{"name":"cpus","scalar":{"value":2.0},"type":"SCALAR"},{"name":"mem","scalar":{"value":1024.0},"type":"SCALAR"},{"name":"disk","scalar":{"value":1024.0},"type":"SCALAR"},{"name":"ports","ranges":{"range":[{"begin":31000,"end":32000}]},"type":"RANGES"}]
I0905 21:46:01.024803 28426 slave.cpp:589] Agent attributes: [  ]
I0905 21:46:01.024819 28426 slave.cpp:598] Agent hostname: cb3c7444cbf2
I0905 21:46:01.024963 28424 status_update_manager.cpp:177] Pausing sending status updates
I0905 21:46:01.026660 28423 state.cpp:64] Recovering state from '/tmp/Endpoint_SlaveEndpointTest_UnauthorizedRequest_2_5CZ9N6/meta'
I0905 21:46:01.027006 28417 status_update_manager.cpp:203] Recovering status update manager
I0905 21:46:01.027261 28428 containerizer.cpp:646] Recovering containerizer
I0905 21:46:01.029167 28416 provisioner.cpp:416] Provisioner recovery complete
I0905 21:46:01.029531 28426 slave.cpp:6296] Finished recovery
I0905 21:46:01.030094 28426 slave.cpp:6478] Querying resource estimator for oversubscribable
resources
I0905 21:46:01.030414 28437 slave.cpp:6492] Received oversubscribable resources {} from the
resource estimator
I0905 21:46:01.033087 28433 process.cpp:3954] Handling HTTP event for process 'slave(819)'
with path: '/slave(819)/containers'
I0905 21:46:01.035315 28421 http.cpp:1185] HTTP GET for /slave(819)/containers from 172.17.0.3:35462
I0905 21:46:01.035419 28421 http.cpp:976] Authorizing principal 'test-principal' to GET the
'/containers' endpoint
I0905 21:46:01.038561 28431 slave.cpp:859] Agent terminating
[       OK ] Endpoint/SlaveEndpointTest.UnauthorizedRequest/2 (36 ms)
[ RUN      ] Endpoint/SlaveEndpointTest.NoAuthorizer/0
I0905 21:46:01.051766  6899 containerizer.cpp:290] Using isolation { environment_secret, posix/cpu,
posix/mem, filesystem/posix, network/cni }
W0905 21:46:01.052297  6899 backend.cpp:76] Failed to create 'aufs' backend: AufsBackend requires
root privileges
W0905 21:46:01.052428  6899 backend.cpp:76] Failed to create 'bind' backend: BindBackend requires
root privileges
I0905 21:46:01.052470  6899 provisioner.cpp:255] Using default backend 'copy'
I0905 21:46:01.054227  6899 cluster.cpp:448] Creating default 'local' authorizer
I0905 21:46:01.056227 28425 slave.cpp:252] Mesos agent started on (820)@172.17.0.3:36453
I0905 21:46:01.056262 28425 slave.cpp:253] Flags at startup: --acls="" --appc_simple_discovery_uri_prefix="http://"
--appc_store_dir="/tmp/Endpoint_SlaveEndpointTest_NoAuthorizer_0_Y7vacO/store/appc" --authenticate_http_executors="true"
--authenticate_http_readonly="true" --authenticate_http_readwrite="true" --authenticatee="crammd5"
--authentication_backoff_factor="1secs" --authorizer="local" --cgroups_cpu_enable_pids_and_tids_count="false"
--cgroups_enable_cfs="false" --cgroups_hierarchy="/sys/fs/cgroup" --cgroups_limit_swap="false"
--cgroups_root="mesos" --container_disk_watch_interval="15secs" --containerizers="mesos" --credential="/tmp/Endpoint_SlaveEndpointTest_NoAuthorizer_0_Y7vacO/credential"
--default_role="*" --disallow_sharing_agent_pid_namespace="false" --disk_watch_interval="1mins"
--docker="docker" --docker_kill_orphans="true" --docker_registry="https://registry-1.docker.io"
--docker_remove_delay="6hrs" --docker_socket="/var/run/docker.sock" --docker_stop_timeout="0ns"
--docker_store_dir="/tmp/Endpoint_SlaveEndpointTest_NoAuthorizer_0_Y7vacO/store/docker" --docker_volume_checkpoint_dir="/var/run/mesos/isolators/docker/volume"
--enforce_container_disk_quota="false" --executor_registration_timeout="1mins" --executor_reregistration_timeout="2secs"
--executor_secret_key="/tmp/Endpoint_SlaveEndpointTest_NoAuthorizer_0_Y7vacO/executor_secret_key"
--executor_shutdown_grace_period="5secs" --fetcher_cache_dir="/tmp/Endpoint_SlaveEndpointTest_NoAuthorizer_0_Y7vacO/fetch"
--fetcher_cache_size="2GB" --frameworks_home="" --gc_delay="1weeks" --gc_disk_headroom="0.1"
--hadoop_home="" --help="false" --hostname_lookup="true" --http_command_executor="false" --http_credentials="/tmp/Endpoint_SlaveEndpointTest_NoAuthorizer_0_Y7vacO/http_credentials"
--http_heartbeat_interval="30secs" --initialize_driver_logging="true" --isolation="posix/cpu,posix/mem"
--launcher="posix" --launcher_dir="/mesos/mesos-1.5.0/_build/src" --logbufsecs="0" --logging_level="INFO"
--max_completed_executors_per_framework="150" --oversubscribed_resources_interval="15secs"
--perf_duration="10secs" --perf_interval="1mins" --port="5051" --qos_correction_interval_min="0ns"
--quiet="false" --recover="reconnect" --recovery_timeout="15mins" --registration_backoff_factor="10ms"
--resources="cpus:2;gpus:0;mem:1024;disk:1024;ports:[31000-32000]" --revocable_cpu_low_priority="true"
--runtime_dir="/tmp/Endpoint_SlaveEndpointTest_NoAuthorizer_0_Y7vacO" --sandbox_directory="/mnt/mesos/sandbox"
--strict="true" --switch_user="true" --systemd_enable_support="true" --systemd_runtime_directory="/run/systemd/system"
--version="false" --work_dir="/tmp/Endpoint_SlaveEndpointTest_NoAuthorizer_0_FsFE5s" --zk_session_timeout="10secs"
I0905 21:46:01.056689 28425 credentials.hpp:86] Loading credential for authentication from
'/tmp/Endpoint_SlaveEndpointTest_NoAuthorizer_0_Y7vacO/credential'
I0905 21:46:01.056864 28425 slave.cpp:285] Agent using credential for: test-principal
I0905 21:46:01.056887 28425 credentials.hpp:37] Loading credentials for authentication from
'/tmp/Endpoint_SlaveEndpointTest_NoAuthorizer_0_Y7vacO/http_credentials'
I0905 21:46:01.057180 28425 http.cpp:1045] Creating default 'basic' HTTP authenticator for
realm 'mesos-agent-executor'
I0905 21:46:01.057312 28425 http.cpp:1066] Creating default 'jwt' HTTP authenticator for realm
'mesos-agent-executor'
I0905 21:46:01.057529 28425 http.cpp:1045] Creating default 'basic' HTTP authenticator for
realm 'mesos-agent-readonly'
I0905 21:46:01.057627 28425 http.cpp:1066] Creating default 'jwt' HTTP authenticator for realm
'mesos-agent-readonly'
I0905 21:46:01.057806 28425 http.cpp:1045] Creating default 'basic' HTTP authenticator for
realm 'mesos-agent-readwrite'
I0905 21:46:01.057905 28425 http.cpp:1066] Creating default 'jwt' HTTP authenticator for realm
'mesos-agent-readwrite'
I0905 21:46:01.059386 28425 slave.cpp:581] Agent resources: [{"name":"cpus","scalar":{"value":2.0},"type":"SCALAR"},{"name":"mem","scalar":{"value":1024.0},"type":"SCALAR"},{"name":"disk","scalar":{"value":1024.0},"type":"SCALAR"},{"name":"ports","ranges":{"range":[{"begin":31000,"end":32000}]},"type":"RANGES"}]
I0905 21:46:01.059609 28425 slave.cpp:589] Agent attributes: [  ]
I0905 21:46:01.059626 28425 slave.cpp:598] Agent hostname: cb3c7444cbf2
I0905 21:46:01.059764 28417 status_update_manager.cpp:177] Pausing sending status updates
I0905 21:46:01.061425 28437 state.cpp:64] Recovering state from '/tmp/Endpoint_SlaveEndpointTest_NoAuthorizer_0_FsFE5s/meta'
I0905 21:46:01.061888 28426 status_update_manager.cpp:203] Recovering status update manager
I0905 21:46:01.062099 28418 containerizer.cpp:646] Recovering containerizer
I0905 21:46:01.063334 28430 provisioner.cpp:416] Provisioner recovery complete
I0905 21:46:01.063630 28419 slave.cpp:6296] Finished recovery
I0905 21:46:01.064070 28419 slave.cpp:6478] Querying resource estimator for oversubscribable
resources
I0905 21:46:01.064365 28433 slave.cpp:6492] Received oversubscribable resources {} from the
resource estimator
I0905 21:46:01.066987 28417 process.cpp:3954] Handling HTTP event for process 'slave(820)'
with path: '/slave(820)/monitor/statistics'
I0905 21:46:01.069278 28436 http.cpp:1185] HTTP GET for /slave(820)/monitor/statistics from
172.17.0.3:35464
I0905 21:46:01.069383 28436 http.cpp:976] Authorizing principal 'test-principal' to GET the
'/monitor/statistics' endpoint
I0905 21:46:01.073258  6899 slave.cpp:859] Agent terminating
[       OK ] Endpoint/SlaveEndpointTest.NoAuthorizer/0 (34 ms)
[ RUN      ] Endpoint/SlaveEndpointTest.NoAuthorizer/1
I0905 21:46:01.085899  6899 containerizer.cpp:290] Using isolation { environment_secret, posix/cpu,
posix/mem, filesystem/posix, network/cni }
W0905 21:46:01.086403  6899 backend.cpp:76] Failed to create 'aufs' backend: AufsBackend requires
root privileges
W0905 21:46:01.086525  6899 backend.cpp:76] Failed to create 'bind' backend: BindBackend requires
root privileges
I0905 21:46:01.086560  6899 provisioner.cpp:255] Using default backend 'copy'
I0905 21:46:01.088285  6899 cluster.cpp:448] Creating default 'local' authorizer
I0905 21:46:01.090230 28433 slave.cpp:252] Mesos agent started on (821)@172.17.0.3:36453
I0905 21:46:01.090265 28433 slave.cpp:253] Flags at startup: --acls="" --appc_simple_discovery_uri_prefix="http://"
--appc_store_dir="/tmp/Endpoint_SlaveEndpointTest_NoAuthorizer_1_YZWhN9/store/appc" --authenticate_http_executors="true"
--authenticate_http_readonly="true" --authenticate_http_readwrite="true" --authenticatee="crammd5"
--authentication_backoff_factor="1secs" --authorizer="local" --cgroups_cpu_enable_pids_and_tids_count="false"
--cgroups_enable_cfs="false" --cgroups_hierarchy="/sys/fs/cgroup" --cgroups_limit_swap="false"
--cgroups_root="mesos" --container_disk_watch_interval="15secs" --containerizers="mesos" --credential="/tmp/Endpoint_SlaveEndpointTest_NoAuthorizer_1_YZWhN9/credential"
--default_role="*" --disallow_sharing_agent_pid_namespace="false" --disk_watch_interval="1mins"
--docker="docker" --docker_kill_orphans="true" --docker_registry="https://registry-1.docker.io"
--docker_remove_delay="6hrs" --docker_socket="/var/run/docker.sock" --docker_stop_timeout="0ns"
--docker_store_dir="/tmp/Endpoint_SlaveEndpointTest_NoAuthorizer_1_YZWhN9/store/docker" --docker_volume_checkpoint_dir="/var/run/mesos/isolators/docker/volume"
--enforce_container_disk_quota="false" --executor_registration_timeout="1mins" --executor_reregistration_timeout="2secs"
--executor_secret_key="/tmp/Endpoint_SlaveEndpointTest_NoAuthorizer_1_YZWhN9/executor_secret_key"
--executor_shutdown_grace_period="5secs" --fetcher_cache_dir="/tmp/Endpoint_SlaveEndpointTest_NoAuthorizer_1_YZWhN9/fetch"
--fetcher_cache_size="2GB" --frameworks_home="" --gc_delay="1weeks" --gc_disk_headroom="0.1"
--hadoop_home="" --help="false" --hostname_lookup="true" --http_command_executor="false" --http_credentials="/tmp/Endpoint_SlaveEndpointTest_NoAuthorizer_1_YZWhN9/http_credentials"
--http_heartbeat_interval="30secs" --initialize_driver_logging="true" --isolation="posix/cpu,posix/mem"
--launcher="posix" --launcher_dir="/mesos/mesos-1.5.0/_build/src" --logbufsecs="0" --logging_level="INFO"
--max_completed_executors_per_framework="150" --oversubscribed_resources_interval="15secs"
--perf_duration="10secs" --perf_interval="1mins" --port="5051" --qos_correction_interval_min="0ns"
--quiet="false" --recover="reconnect" --recovery_timeout="15mins" --registration_backoff_factor="10ms"
--resources="cpus:2;gpus:0;mem:1024;disk:1024;ports:[31000-32000]" --revocable_cpu_low_priority="true"
--runtime_dir="/tmp/Endpoint_SlaveEndpointTest_NoAuthorizer_1_YZWhN9" --sandbox_directory="/mnt/mesos/sandbox"
--strict="true" --switch_user="true" --systemd_enable_support="true" --systemd_runtime_directory="/run/systemd/system"
--version="false" --work_dir="/tmp/Endpoint_SlaveEndpointTest_NoAuthorizer_1_talGBO" --zk_session_timeout="10secs"
I0905 21:46:01.090692 28433 credentials.hpp:86] Loading credential for authentication from
'/tmp/Endpoint_SlaveEndpointTest_NoAuthorizer_1_YZWhN9/credential'
I0905 21:46:01.090845 28433 slave.cpp:285] Agent using credential for: test-principal
I0905 21:46:01.090883 28433 credentials.hpp:37] Loading credentials for authentication from
'/tmp/Endpoint_SlaveEndpointTest_NoAuthorizer_1_YZWhN9/http_credentials'
I0905 21:46:01.091245 28433 http.cpp:1045] Creating default 'basic' HTTP authenticator for
realm 'mesos-agent-executor'
I0905 21:46:01.091364 28433 http.cpp:1066] Creating default 'jwt' HTTP authenticator for realm
'mesos-agent-executor'
I0905 21:46:01.091666 28433 http.cpp:1045] Creating default 'basic' HTTP authenticator for
realm 'mesos-agent-readonly'
I0905 21:46:01.091806 28433 http.cpp:1066] Creating default 'jwt' HTTP authenticator for realm
'mesos-agent-readonly'
I0905 21:46:01.092041 28433 http.cpp:1045] Creating default 'basic' HTTP authenticator for
realm 'mesos-agent-readwrite'
I0905 21:46:01.092167 28433 http.cpp:1066] Creating default 'jwt' HTTP authenticator for realm
'mesos-agent-readwrite'
I0905 21:46:01.093639 28433 slave.cpp:581] Agent resources: [{"name":"cpus","scalar":{"value":2.0},"type":"SCALAR"},{"name":"mem","scalar":{"value":1024.0},"type":"SCALAR"},{"name":"disk","scalar":{"value":1024.0},"type":"SCALAR"},{"name":"ports","ranges":{"range":[{"begin":31000,"end":32000}]},"type":"RANGES"}]
I0905 21:46:01.093878 28433 slave.cpp:589] Agent attributes: [  ]
I0905 21:46:01.093900 28433 slave.cpp:598] Agent hostname: cb3c7444cbf2
I0905 21:46:01.094049 28438 status_update_manager.cpp:177] Pausing sending status updates
I0905 21:46:01.095471 28432 state.cpp:64] Recovering state from '/tmp/Endpoint_SlaveEndpointTest_NoAuthorizer_1_talGBO/meta'
I0905 21:46:01.095865 28422 status_update_manager.cpp:203] Recovering status update manager
I0905 21:46:01.096247 28439 containerizer.cpp:646] Recovering containerizer
I0905 21:46:01.098182 28428 provisioner.cpp:416] Provisioner recovery complete
I0905 21:46:01.098606 28433 slave.cpp:6296] Finished recovery
I0905 21:46:01.099004 28433 slave.cpp:6478] Querying resource estimator for oversubscribable
resources
I0905 21:46:01.099267 28426 slave.cpp:6492] Received oversubscribable resources {} from the
resource estimator
I0905 21:46:01.101186 28438 process.cpp:3954] Handling HTTP event for process 'slave(821)'
with path: '/slave(821)/monitor/statistics.json'
I0905 21:46:01.102766 28422 http.cpp:1185] HTTP GET for /slave(821)/monitor/statistics.json
from 172.17.0.3:35468
I0905 21:46:01.102835 28422 http.cpp:976] Authorizing principal 'test-principal' to GET the
'/monitor/statistics.json' endpoint
I0905 21:46:01.106570 28432 slave.cpp:859] Agent terminating
[       OK ] Endpoint/SlaveEndpointTest.NoAuthorizer/1 (35 ms)
[ RUN      ] Endpoint/SlaveEndpointTest.NoAuthorizer/2
I0905 21:46:01.121392  6899 containerizer.cpp:290] Using isolation { environment_secret, posix/cpu,
posix/mem, filesystem/posix, network/cni }
W0905 21:46:01.121950  6899 backend.cpp:76] Failed to create 'aufs' backend: AufsBackend requires
root privileges
W0905 21:46:01.122058  6899 backend.cpp:76] Failed to create 'bind' backend: BindBackend requires
root privileges
I0905 21:46:01.122089  6899 provisioner.cpp:255] Using default backend 'copy'
I0905 21:46:01.123950  6899 cluster.cpp:448] Creating default 'local' authorizer
I0905 21:46:01.126075 28426 slave.cpp:252] Mesos agent started on (822)@172.17.0.3:36453
I0905 21:46:01.126109 28426 slave.cpp:253] Flags at startup: --acls="" --appc_simple_discovery_uri_prefix="http://"
--appc_store_dir="/tmp/Endpoint_SlaveEndpointTest_NoAuthorizer_2_sTsxPw/store/appc" --authenticate_http_executors="true"
--authenticate_http_readonly="true" --authenticate_http_readwrite="true" --authenticatee="crammd5"
--authentication_backoff_factor="1secs" --authorizer="local" --cgroups_cpu_enable_pids_and_tids_count="false"
--cgroups_enable_cfs="false" --cgroups_hierarchy="/sys/fs/cgroup" --cgroups_limit_swap="false"
--cgroups_root="mesos" --container_disk_watch_interval="15secs" --containerizers="mesos" --credential="/tmp/Endpoint_SlaveEndpointTest_NoAuthorizer_2_sTsxPw/credential"
--default_role="*" --disallow_sharing_agent_pid_namespace="false" --disk_watch_interval="1mins"
--docker="docker" --docker_kill_orphans="true" --docker_registry="https://registry-1.docker.io"
--docker_remove_delay="6hrs" --docker_socket="/var/run/docker.sock" --docker_stop_timeout="0ns"
--docker_store_dir="/tmp/Endpoint_SlaveEndpointTest_NoAuthorizer_2_sTsxPw/store/docker" --docker_volume_checkpoint_dir="/var/run/mesos/isolators/docker/volume"
--enforce_container_disk_quota="false" --executor_registration_timeout="1mins" --executor_reregistration_timeout="2secs"
--executor_secret_key="/tmp/Endpoint_SlaveEndpointTest_NoAuthorizer_2_sTsxPw/executor_secret_key"
--executor_shutdown_grace_period="5secs" --fetcher_cache_dir="/tmp/Endpoint_SlaveEndpointTest_NoAuthorizer_2_sTsxPw/fetch"
--fetcher_cache_size="2GB" --frameworks_home="" --gc_delay="1weeks" --gc_disk_headroom="0.1"
--hadoop_home="" --help="false" --hostname_lookup="true" --http_command_executor="false" --http_credentials="/tmp/Endpoint_SlaveEndpointTest_NoAuthorizer_2_sTsxPw/http_credentials"
--http_heartbeat_interval="30secs" --initialize_driver_logging="true" --isolation="posix/cpu,posix/mem"
--launcher="posix" --launcher_dir="/mesos/mesos-1.5.0/_build/src" --logbufsecs="0" --logging_level="INFO"
--max_completed_executors_per_framework="150" --oversubscribed_resources_interval="15secs"
--perf_duration="10secs" --perf_interval="1mins" --port="5051" --qos_correction_interval_min="0ns"
--quiet="false" --recover="reconnect" --recovery_timeout="15mins" --registration_backoff_factor="10ms"
--resources="cpus:2;gpus:0;mem:1024;disk:1024;ports:[31000-32000]" --revocable_cpu_low_priority="true"
--runtime_dir="/tmp/Endpoint_SlaveEndpointTest_NoAuthorizer_2_sTsxPw" --sandbox_directory="/mnt/mesos/sandbox"
--strict="true" --switch_user="true" --systemd_enable_support="true" --systemd_runtime_directory="/run/systemd/system"
--version="false" --work_dir="/tmp/Endpoint_SlaveEndpointTest_NoAuthorizer_2_7aWFyb" --zk_session_timeout="10secs"
I0905 21:46:01.126484 28426 credentials.hpp:86] Loading credential for authentication from
'/tmp/Endpoint_SlaveEndpointTest_NoAuthorizer_2_sTsxPw/credential'
I0905 21:46:01.126642 28426 slave.cpp:285] Agent using credential for: test-principal
I0905 21:46:01.126664 28426 credentials.hpp:37] Loading credentials for authentication from
'/tmp/Endpoint_SlaveEndpointTest_NoAuthorizer_2_sTsxPw/http_credentials'
I0905 21:46:01.126945 28426 http.cpp:1045] Creating default 'basic' HTTP authenticator for
realm 'mesos-agent-executor'
I0905 21:46:01.127073 28426 http.cpp:1066] Creating default 'jwt' HTTP authenticator for realm
'mesos-agent-executor'
I0905 21:46:01.127277 28426 http.cpp:1045] Creating default 'basic' HTTP authenticator for
realm 'mesos-agent-readonly'
I0905 21:46:01.127400 28426 http.cpp:1066] Creating default 'jwt' HTTP authenticator for realm
'mesos-agent-readonly'
I0905 21:46:01.127591 28426 http.cpp:1045] Creating default 'basic' HTTP authenticator for
realm 'mesos-agent-readwrite'
I0905 21:46:01.127706 28426 http.cpp:1066] Creating default 'jwt' HTTP authenticator for realm
'mesos-agent-readwrite'
I0905 21:46:01.129655 28426 slave.cpp:581] Agent resources: [{"name":"cpus","scalar":{"value":2.0},"type":"SCALAR"},{"name":"mem","scalar":{"value":1024.0},"type":"SCALAR"},{"name":"disk","scalar":{"value":1024.0},"type":"SCALAR"},{"name":"ports","ranges":{"range":[{"begin":31000,"end":32000}]},"type":"RANGES"}]
I0905 21:46:01.129963 28426 slave.cpp:589] Agent attributes: [  ]
I0905 21:46:01.129984 28426 slave.cpp:598] Agent hostname: cb3c7444cbf2
I0905 21:46:01.130158 28418 status_update_manager.cpp:177] Pausing sending status updates
I0905 21:46:01.131956 28439 state.cpp:64] Recovering state from '/tmp/Endpoint_SlaveEndpointTest_NoAuthorizer_2_7aWFyb/meta'
I0905 21:46:01.132315 28423 status_update_manager.cpp:203] Recovering status update manager
I0905 21:46:01.132536 28423 containerizer.cpp:646] Recovering containerizer
I0905 21:46:01.134570 28420 provisioner.cpp:416] Provisioner recovery complete
I0905 21:46:01.134897 28435 slave.cpp:6296] Finished recovery
I0905 21:46:01.135289 28435 slave.cpp:6478] Querying resource estimator for oversubscribable
resources
I0905 21:46:01.135500 28437 slave.cpp:6492] Received oversubscribable resources {} from the
resource estimator
I0905 21:46:01.137311 28430 process.cpp:3954] Handling HTTP event for process 'slave(822)'
with path: '/slave(822)/containers'
I0905 21:46:01.139147 28439 http.cpp:1185] HTTP GET for /slave(822)/containers from 172.17.0.3:35470
I0905 21:46:01.139269 28439 http.cpp:976] Authorizing principal 'test-principal' to GET the
'/containers' endpoint
I0905 21:46:01.143496  6899 slave.cpp:859] Agent terminating
[       OK ] Endpoint/SlaveEndpointTest.NoAuthorizer/2 (37 ms)
[----------] 9 tests from Endpoint/SlaveEndpointTest (327 ms total)

[----------] 2 tests from ContainerizerType/DefaultContainerDNSFlagTest
[ RUN      ] ContainerizerType/DefaultContainerDNSFlagTest.ValidateFlag/0
[       OK ] ContainerizerType/DefaultContainerDNSFlagTest.ValidateFlag/0 (14 ms)
[ RUN      ] ContainerizerType/DefaultContainerDNSFlagTest.ValidateFlag/1
[       OK ] ContainerizerType/DefaultContainerDNSFlagTest.ValidateFlag/1 (12 ms)
[----------] 2 tests from ContainerizerType/DefaultContainerDNSFlagTest (26 ms total)

[----------] Global test environment tear-down
[==========] 1675 tests from 185 test cases ran. (630356 ms total)
[  PASSED  ] 1671 tests.
[  FAILED  ] 4 tests, listed below:
[  FAILED  ] DefaultExecutorCheckTest.CommandCheckDeliveredAndReconciled
[  FAILED  ] DefaultExecutorCheckTest.CommandCheckStatusChange
[  FAILED  ] DefaultExecutorCheckTest.CommandCheckSeesParentsEnv
[  FAILED  ] DefaultExecutorCheckTest.CommandCheckSharesWorkDirWithTask

 4 FAILED TESTS
  YOU HAVE 20 DISABLED TESTS

I0905 21:46:01.266739 28440 process.cpp:1072] Failed to accept socket: future discarded
make[4]: *** [check-local] Error 1
make[4]: Leaving directory `/mesos/mesos-1.5.0/_build/src'
make[3]: *** [check-am] Error 2
make[3]: Leaving directory `/mesos/mesos-1.5.0/_build/src'
make[2]: *** [check] Error 2
make[2]: Leaving directory `/mesos/mesos-1.5.0/_build/src'
make[1]: *** [check-recursive] Error 1
make[1]: Leaving directory `/mesos/mesos-1.5.0/_build'
make: *** [distcheck] Error 1
+ docker rmi mesos-1504644972-5940
Untagged: mesos-1504644972-5940:latest
Deleted: sha256:55e9eb8c1d0894cb3ebc7f8ac112addde2cd5885a65b90c99fae9ec75d7e4257
Deleted: sha256:2a052a6a6532b3e05a5515545aa3656669fe80d0d3a782b9a4071ddc79f4dd28
Deleted: sha256:bd7bfc24f65cc4461c63c89d53c756bfa7e5fa90e94e7518aec70020c19001ec
Deleted: sha256:01972de0e2a4a28903f329e2d836faf5ecdb0562cefee030a678b201114092ec
Deleted: sha256:8d329697f816cb4d0b76d781dbbf038bffc86d7b52f70ded366b9a9bb4b3d592
Deleted: sha256:15f34db42b73811274580730df2f2924c1de22793866acb9910a95cc378b909d
Deleted: sha256:0537196ab2543be80482023ee8f24b9a5555a1d5bee363cab91f3e93e01a2bec
Deleted: sha256:26cba944006e88254d555acacede9748bd8617c866bb649898d3e847e859b0f9
Deleted: sha256:257c199fb2bbde876cd87517c7c526aa5ff2d8e58cb2acb89a378bde7933d050
Deleted: sha256:ff37785354c6793f1b12662fadfaf2949acfa3465f575a52a8c18af58e3287dc
Deleted: sha256:9260f332cbf3de108ed1066fb4204385dbcf0bd72101f555ff0e94bff4d33f04
Deleted: sha256:385655628d07e541bb90b7d5511b4d9af2b11e6383c2f7b75d680cfe56119ff6
Deleted: sha256:ce989c35f2b7da2ee5ebc281adb65f455af84afbd0c9bb404722d8f75f83e7c0
Deleted: sha256:eff63c11ace74a612319d9825b0e8330d40ee9b48c967711526d165672a762a5
Deleted: sha256:a411bf3499651bf0f93e0d771627e8e6f0cb2ffdcea61317214124cc0e3f8f95
Deleted: sha256:927d23ac00ff85e789f331a937c40fe506ca4646587f3c5f82ce2861cbbe5ea2
Deleted: sha256:e46cadc85328902b7b90155aedf32f1f270b415a74c833ab7681a6983db0ee58
Deleted: sha256:2e5f9f7b8766e2d2bef09a8d3bc39a9804b418429aea3c00518914d0d8e8092d
Deleted: sha256:aefe261aae4358e9fc6247bca8239bf34cbed0faf1c50ac8cd15e5e932016dc6
Deleted: sha256:45f697d6c1e994770205538ce0d65c9db523a7237b4112ebd83d13720e4f7a0e
Deleted: sha256:63727822e19425d5f1d7132f9f791c122c379831400a006bae967b13ffe42a1e
Deleted: sha256:db30c2bb6cb2751e650b2c72e576b864102eebede65b378036a731a2a51e7f89
Deleted: sha256:eda9dcbeea220e11d4c5a33486684fea3ad5bbd59c3598e6f5f876180a10419d
Deleted: sha256:37de67303b3880a95f3a9f7bbc5f97ae70223b2c04b64cac23b7fc6db8083690
Build step 'Execute shell' marked build as failure

Mime
View raw message