mesos-builds mailing list archives

Site index · List index
Message view « Date » · « Thread »
Top « Date » · « Thread »
From Apache Jenkins Server <jenk...@builds.apache.org>
Subject Build failed in Jenkins: Mesos-Buildbot » cmake,gcc,--verbose --enable-libevent --enable-ssl,GLOG_v=1 MESOS_VERBOSE=1,ubuntu:14.04,(ubuntu)&&(!ubuntu-us1)&&(!ubuntu-eu2)&&(!qnode3)&&(!H23) #4253
Date Fri, 22 Sep 2017 02:01:32 GMT
See <https://builds.apache.org/job/Mesos-Buildbot/BUILDTOOL=cmake,COMPILER=gcc,CONFIGURATION=--verbose%20--enable-libevent%20--enable-ssl,ENVIRONMENT=GLOG_v=1%20MESOS_VERBOSE=1,OS=ubuntu%3A14.04,label_exp=(ubuntu)&&(!ubuntu-us1)&&(!ubuntu-eu2)&&(!qnode3)&&(!H23)/4253/display/redirect>

------------------------------------------
[...truncated 1.03 MB...]
make[3]: Leaving directory `/mesos/build'
make -f src/slave/containerizer/mesos/CMakeFiles/mesos-containerizer.dir/build.make src/slave/containerizer/mesos/CMakeFiles/mesos-containerizer.dir/build
make[3]: Entering directory `/mesos/build'
[ 77%] Building CXX object src/slave/containerizer/mesos/CMakeFiles/mesos-containerizer.dir/main.cpp.o
cd /mesos/build/src/slave/containerizer/mesos && /usr/bin/g++  -DBUILD_FLAGS=\"\" -DBUILD_JAVA_JVM_LIBRARY=\"\" -DHAS_AUTHENTICATION=1 -DHAVE_LIBZ -DLIBDIR=\"/usr/local/libmesos\" -DPICOJSON_USE_INT64 -DPKGDATADIR=\"/usr/local/share/mesos\" -DPKGLIBEXECDIR=\"/usr/local/libexec/mesos\" -DUSE_CMAKE_BUILD_CONFIG -DUSE_SSL_SOCKET=1 -DUSE_STATIC_LIB -DVERSION=\"1.5.0\" -DZOOKEEPER_VERSION=\"3.4.8\" -D__STDC_FORMAT_MACROS -I/mesos/include -I/mesos/build/include -I/mesos/build/include/mesos -I/mesos/build/src -I/mesos/src -I/mesos/3rdparty/libprocess/src/../include -I/mesos/3rdparty/stout/include -isystem /usr/include/apr-1.0 -isystem /mesos/build/3rdparty/boost-1.53.0/src/boost-1.53.0 -isystem /mesos/build/3rdparty/elfio-3.2/src/elfio-3.2 -isystem /mesos/build/3rdparty/glog-0.3.3/src/glog-0.3.3-build/include -isystem /mesos/build/3rdparty/picojson-1.3.0/src/picojson-1.3.0 -isystem /mesos/build/3rdparty/protobuf-3.3.0/src/protobuf-3.3.0/src -isystem /usr/include/subversion-1 -isystem /mesos/build/3rdparty/http_parser-2.6.2/src/http_parser-2.6.2 -isystem /mesos/build/3rdparty/zookeeper-3.4.8/src/zookeeper-3.4.8/src/c/include -isystem /mesos/build/3rdparty/zookeeper-3.4.8/src/zookeeper-3.4.8/src/c/generated -isystem /mesos/build/3rdparty/nvml-352.79/src/nvml-352.79 -isystem /mesos/build/3rdparty/leveldb-1.19/src/leveldb-1.19/include  -std=c++11 -Wformat-security -fstack-protector -fPIE   -o CMakeFiles/mesos-containerizer.dir/main.cpp.o -c /mesos/src/slave/containerizer/mesos/main.cpp
[ 78%] Linking CXX executable ../mesos-local
cd /mesos/build/src/local && /usr/local/bin/cmake -E cmake_link_script CMakeFiles/mesos-local.dir/link.txt --verbose=1
/usr/bin/g++   -std=c++11 -Wformat-security -fstack-protector   CMakeFiles/mesos-local.dir/main.cpp.o  -o ../mesos-local -Wl,-rpath,/mesos/build/src/.libs:/mesos/build/3rdparty/libprocess/src:/mesos/build/3rdparty/glog-0.3.3/src/glog-0.3.3-build/lib:/mesos/build/3rdparty/libevent-2.1.5-beta/src/libevent-2.1.5-beta-build/lib:/mesos/build/src:/mesos/build/3rdparty/protobuf-3.3.0/src/protobuf-3.3.0-build ../.libs/libmesos.so.1.5.0 ../../3rdparty/libprocess/src/libprocess.so /usr/lib/x86_64-linux-gnu/libapr-1.so /usr/lib/x86_64-linux-gnu/libcurl.so ../../3rdparty/glog-0.3.3/src/glog-0.3.3-build/lib/libglog.so -lpthread /usr/lib/x86_64-linux-gnu/libz.so -lrt -ldl /usr/lib/x86_64-linux-gnu/libsvn_delta-1.so /usr/lib/x86_64-linux-gnu/libsvn_diff-1.so /usr/lib/x86_64-linux-gnu/libsvn_subr-1.so ../../3rdparty/http_parser-2.6.2/src/http_parser-2.6.2-build/libhttp_parser.a /usr/lib/x86_64-linux-gnu/libssl.so /usr/lib/x86_64-linux-gnu/libcrypto.so ../../3rdparty/zookeeper-3.4.8/src/zookeeper-3.4.8-build/libzookeeper.a ../../3rdparty/zookeeper-3.4.8/src/zookeeper-3.4.8-build/libhashtable.a ../libmesos-protobufs.so ../../3rdparty/protobuf-3.3.0/src/protobuf-3.3.0-build/libprotobuf.so ../../3rdparty/leveldb-1.19/src/leveldb-1.19/out-static/libleveldb.a -lsasl2 -Wl,-rpath-link,/mesos/build/3rdparty/libevent-2.1.5-beta/src/libevent-2.1.5-beta-build/lib 
[ 78%] Linking CXX executable ../mesos-default-executor
cd /mesos/build/src/launcher && /usr/local/bin/cmake -E cmake_link_script CMakeFiles/mesos-default-executor.dir/link.txt --verbose=1
/usr/bin/g++   -std=c++11 -Wformat-security -fstack-protector   CMakeFiles/mesos-default-executor.dir/default_executor.cpp.o  -o ../mesos-default-executor -Wl,-rpath,/mesos/build/src/.libs:/mesos/build/3rdparty/libprocess/src:/mesos/build/3rdparty/glog-0.3.3/src/glog-0.3.3-build/lib:/mesos/build/3rdparty/libevent-2.1.5-beta/src/libevent-2.1.5-beta-build/lib:/mesos/build/src:/mesos/build/3rdparty/protobuf-3.3.0/src/protobuf-3.3.0-build ../.libs/libmesos.so.1.5.0 ../../3rdparty/libprocess/src/libprocess.so /usr/lib/x86_64-linux-gnu/libapr-1.so /usr/lib/x86_64-linux-gnu/libcurl.so ../../3rdparty/glog-0.3.3/src/glog-0.3.3-build/lib/libglog.so -lpthread /usr/lib/x86_64-linux-gnu/libz.so -lrt -ldl /usr/lib/x86_64-linux-gnu/libsvn_delta-1.so /usr/lib/x86_64-linux-gnu/libsvn_diff-1.so /usr/lib/x86_64-linux-gnu/libsvn_subr-1.so ../../3rdparty/http_parser-2.6.2/src/http_parser-2.6.2-build/libhttp_parser.a /usr/lib/x86_64-linux-gnu/libssl.so /usr/lib/x86_64-linux-gnu/libcrypto.so ../../3rdparty/zookeeper-3.4.8/src/zookeeper-3.4.8-build/libzookeeper.a ../../3rdparty/zookeeper-3.4.8/src/zookeeper-3.4.8-build/libhashtable.a ../libmesos-protobufs.so ../../3rdparty/protobuf-3.3.0/src/protobuf-3.3.0-build/libprotobuf.so ../../3rdparty/leveldb-1.19/src/leveldb-1.19/out-static/libleveldb.a -lsasl2 -Wl,-rpath-link,/mesos/build/3rdparty/libevent-2.1.5-beta/src/libevent-2.1.5-beta-build/lib 
make[3]: Leaving directory `/mesos/build'
[ 78%] Built target mesos-executor
make -f src/slave/containerizer/mesos/CMakeFiles/mesos-cni-port-mapper.dir/build.make src/slave/containerizer/mesos/CMakeFiles/mesos-cni-port-mapper.dir/depend
make[3]: Entering directory `/mesos/build'
cd /mesos/build && /usr/local/bin/cmake -E cmake_depends "Unix Makefiles" /mesos /mesos/src/slave/containerizer/mesos /mesos/build /mesos/build/src/slave/containerizer/mesos /mesos/build/src/slave/containerizer/mesos/CMakeFiles/mesos-cni-port-mapper.dir/DependInfo.cmake --color=
Scanning dependencies of target mesos-cni-port-mapper
make[3]: Leaving directory `/mesos/build'
make -f src/slave/containerizer/mesos/CMakeFiles/mesos-cni-port-mapper.dir/build.make src/slave/containerizer/mesos/CMakeFiles/mesos-cni-port-mapper.dir/build
make[3]: Entering directory `/mesos/build'
[ 78%] Building CXX object src/slave/containerizer/mesos/CMakeFiles/mesos-cni-port-mapper.dir/isolators/network/cni/plugins/port_mapper/main.cpp.o
cd /mesos/build/src/slave/containerizer/mesos && /usr/bin/g++  -DBUILD_FLAGS=\"\" -DBUILD_JAVA_JVM_LIBRARY=\"\" -DHAS_AUTHENTICATION=1 -DHAVE_LIBZ -DLIBDIR=\"/usr/local/libmesos\" -DPICOJSON_USE_INT64 -DPKGDATADIR=\"/usr/local/share/mesos\" -DPKGLIBEXECDIR=\"/usr/local/libexec/mesos\" -DUSE_CMAKE_BUILD_CONFIG -DUSE_SSL_SOCKET=1 -DUSE_STATIC_LIB -DVERSION=\"1.5.0\" -DZOOKEEPER_VERSION=\"3.4.8\" -D__STDC_FORMAT_MACROS -I/mesos/include -I/mesos/build/include -I/mesos/build/include/mesos -I/mesos/build/src -I/mesos/src -I/mesos/3rdparty/libprocess/src/../include -I/mesos/3rdparty/stout/include -isystem /usr/include/apr-1.0 -isystem /mesos/build/3rdparty/boost-1.53.0/src/boost-1.53.0 -isystem /mesos/build/3rdparty/elfio-3.2/src/elfio-3.2 -isystem /mesos/build/3rdparty/glog-0.3.3/src/glog-0.3.3-build/include -isystem /mesos/build/3rdparty/picojson-1.3.0/src/picojson-1.3.0 -isystem /mesos/build/3rdparty/protobuf-3.3.0/src/protobuf-3.3.0/src -isystem /usr/include/subversion-1 -isystem /mesos/build/3rdparty/http_parser-2.6.2/src/http_parser-2.6.2 -isystem /mesos/build/3rdparty/zookeeper-3.4.8/src/zookeeper-3.4.8/src/c/include -isystem /mesos/build/3rdparty/zookeeper-3.4.8/src/zookeeper-3.4.8/src/c/generated -isystem /mesos/build/3rdparty/nvml-352.79/src/nvml-352.79 -isystem /mesos/build/3rdparty/leveldb-1.19/src/leveldb-1.19/include  -std=c++11 -Wformat-security -fstack-protector -fPIE   -o CMakeFiles/mesos-cni-port-mapper.dir/isolators/network/cni/plugins/port_mapper/main.cpp.o -c /mesos/src/slave/containerizer/mesos/isolators/network/cni/plugins/port_mapper/main.cpp
make[3]: Leaving directory `/mesos/build'
[ 78%] Built target mesos-local
make -f src/slave/containerizer/mesos/CMakeFiles/mesos-io-switchboard.dir/build.make src/slave/containerizer/mesos/CMakeFiles/mesos-io-switchboard.dir/depend
make[3]: Entering directory `/mesos/build'
cd /mesos/build && /usr/local/bin/cmake -E cmake_depends "Unix Makefiles" /mesos /mesos/src/slave/containerizer/mesos /mesos/build /mesos/build/src/slave/containerizer/mesos /mesos/build/src/slave/containerizer/mesos/CMakeFiles/mesos-io-switchboard.dir/DependInfo.cmake --color=
Scanning dependencies of target mesos-io-switchboard
make[3]: Leaving directory `/mesos/build'
make -f src/slave/containerizer/mesos/CMakeFiles/mesos-io-switchboard.dir/build.make src/slave/containerizer/mesos/CMakeFiles/mesos-io-switchboard.dir/build
make[3]: Entering directory `/mesos/build'
[ 78%] Building CXX object src/slave/containerizer/mesos/CMakeFiles/mesos-io-switchboard.dir/io/switchboard_main.cpp.o
cd /mesos/build/src/slave/containerizer/mesos && /usr/bin/g++  -DBUILD_FLAGS=\"\" -DBUILD_JAVA_JVM_LIBRARY=\"\" -DHAS_AUTHENTICATION=1 -DHAVE_LIBZ -DLIBDIR=\"/usr/local/libmesos\" -DPICOJSON_USE_INT64 -DPKGDATADIR=\"/usr/local/share/mesos\" -DPKGLIBEXECDIR=\"/usr/local/libexec/mesos\" -DUSE_CMAKE_BUILD_CONFIG -DUSE_SSL_SOCKET=1 -DUSE_STATIC_LIB -DVERSION=\"1.5.0\" -DZOOKEEPER_VERSION=\"3.4.8\" -D__STDC_FORMAT_MACROS -I/mesos/include -I/mesos/build/include -I/mesos/build/include/mesos -I/mesos/build/src -I/mesos/src -I/mesos/3rdparty/libprocess/src/../include -I/mesos/3rdparty/stout/include -isystem /usr/include/apr-1.0 -isystem /mesos/build/3rdparty/boost-1.53.0/src/boost-1.53.0 -isystem /mesos/build/3rdparty/elfio-3.2/src/elfio-3.2 -isystem /mesos/build/3rdparty/glog-0.3.3/src/glog-0.3.3-build/include -isystem /mesos/build/3rdparty/picojson-1.3.0/src/picojson-1.3.0 -isystem /mesos/build/3rdparty/protobuf-3.3.0/src/protobuf-3.3.0/src -isystem /usr/include/subversion-1 -isystem /mesos/build/3rdparty/http_parser-2.6.2/src/http_parser-2.6.2 -isystem /mesos/build/3rdparty/zookeeper-3.4.8/src/zookeeper-3.4.8/src/c/include -isystem /mesos/build/3rdparty/zookeeper-3.4.8/src/zookeeper-3.4.8/src/c/generated -isystem /mesos/build/3rdparty/nvml-352.79/src/nvml-352.79 -isystem /mesos/build/3rdparty/leveldb-1.19/src/leveldb-1.19/include  -std=c++11 -Wformat-security -fstack-protector -fPIE   -o CMakeFiles/mesos-io-switchboard.dir/io/switchboard_main.cpp.o -c /mesos/src/slave/containerizer/mesos/io/switchboard_main.cpp
make[3]: Leaving directory `/mesos/build'
[ 78%] Built target mesos-default-executor
make -f src/usage/CMakeFiles/mesos-usage.dir/build.make src/usage/CMakeFiles/mesos-usage.dir/depend
make[3]: Entering directory `/mesos/build'
cd /mesos/build && /usr/local/bin/cmake -E cmake_depends "Unix Makefiles" /mesos /mesos/src/usage /mesos/build /mesos/build/src/usage /mesos/build/src/usage/CMakeFiles/mesos-usage.dir/DependInfo.cmake --color=
Scanning dependencies of target mesos-usage
make[3]: Leaving directory `/mesos/build'
make -f src/usage/CMakeFiles/mesos-usage.dir/build.make src/usage/CMakeFiles/mesos-usage.dir/build
make[3]: Entering directory `/mesos/build'
[ 78%] Building CXX object src/usage/CMakeFiles/mesos-usage.dir/main.cpp.o
cd /mesos/build/src/usage && /usr/bin/g++  -DBUILD_FLAGS=\"\" -DBUILD_JAVA_JVM_LIBRARY=\"\" -DHAS_AUTHENTICATION=1 -DHAVE_LIBZ -DLIBDIR=\"/usr/local/libmesos\" -DPICOJSON_USE_INT64 -DPKGDATADIR=\"/usr/local/share/mesos\" -DPKGLIBEXECDIR=\"/usr/local/libexec/mesos\" -DUSE_CMAKE_BUILD_CONFIG -DUSE_SSL_SOCKET=1 -DUSE_STATIC_LIB -DVERSION=\"1.5.0\" -DZOOKEEPER_VERSION=\"3.4.8\" -D__STDC_FORMAT_MACROS -I/mesos/include -I/mesos/build/include -I/mesos/build/include/mesos -I/mesos/build/src -I/mesos/src -I/mesos/3rdparty/libprocess/src/../include -I/mesos/3rdparty/stout/include -isystem /usr/include/apr-1.0 -isystem /mesos/build/3rdparty/boost-1.53.0/src/boost-1.53.0 -isystem /mesos/build/3rdparty/elfio-3.2/src/elfio-3.2 -isystem /mesos/build/3rdparty/glog-0.3.3/src/glog-0.3.3-build/include -isystem /mesos/build/3rdparty/picojson-1.3.0/src/picojson-1.3.0 -isystem /mesos/build/3rdparty/protobuf-3.3.0/src/protobuf-3.3.0/src -isystem /usr/include/subversion-1 -isystem /mesos/build/3rdparty/http_parser-2.6.2/src/http_parser-2.6.2 -isystem /mesos/build/3rdparty/zookeeper-3.4.8/src/zookeeper-3.4.8/src/c/include -isystem /mesos/build/3rdparty/zookeeper-3.4.8/src/zookeeper-3.4.8/src/c/generated -isystem /mesos/build/3rdparty/nvml-352.79/src/nvml-352.79 -isystem /mesos/build/3rdparty/leveldb-1.19/src/leveldb-1.19/include  -std=c++11 -Wformat-security -fstack-protector -fPIE   -o CMakeFiles/mesos-usage.dir/main.cpp.o -c /mesos/src/usage/main.cpp
[ 78%] Linking CXX executable ../../../mesos-containerizer
cd /mesos/build/src/slave/containerizer/mesos && /usr/local/bin/cmake -E cmake_link_script CMakeFiles/mesos-containerizer.dir/link.txt --verbose=1
/usr/bin/g++   -std=c++11 -Wformat-security -fstack-protector   CMakeFiles/mesos-containerizer.dir/main.cpp.o  -o ../../../mesos-containerizer -Wl,-rpath,/mesos/build/src/.libs:/mesos/build/3rdparty/libprocess/src:/mesos/build/3rdparty/glog-0.3.3/src/glog-0.3.3-build/lib:/mesos/build/3rdparty/libevent-2.1.5-beta/src/libevent-2.1.5-beta-build/lib:/mesos/build/src:/mesos/build/3rdparty/protobuf-3.3.0/src/protobuf-3.3.0-build ../../../.libs/libmesos.so.1.5.0 ../../../../3rdparty/libprocess/src/libprocess.so /usr/lib/x86_64-linux-gnu/libapr-1.so /usr/lib/x86_64-linux-gnu/libcurl.so ../../../../3rdparty/glog-0.3.3/src/glog-0.3.3-build/lib/libglog.so -lpthread /usr/lib/x86_64-linux-gnu/libz.so -lrt -ldl /usr/lib/x86_64-linux-gnu/libsvn_delta-1.so /usr/lib/x86_64-linux-gnu/libsvn_diff-1.so /usr/lib/x86_64-linux-gnu/libsvn_subr-1.so ../../../../3rdparty/http_parser-2.6.2/src/http_parser-2.6.2-build/libhttp_parser.a /usr/lib/x86_64-linux-gnu/libssl.so /usr/lib/x86_64-linux-gnu/libcrypto.so ../../../../3rdparty/zookeeper-3.4.8/src/zookeeper-3.4.8-build/libzookeeper.a ../../../../3rdparty/zookeeper-3.4.8/src/zookeeper-3.4.8-build/libhashtable.a ../../../libmesos-protobufs.so ../../../../3rdparty/protobuf-3.3.0/src/protobuf-3.3.0-build/libprotobuf.so ../../../../3rdparty/leveldb-1.19/src/leveldb-1.19/out-static/libleveldb.a -lsasl2 -Wl,-rpath-link,/mesos/build/3rdparty/libevent-2.1.5-beta/src/libevent-2.1.5-beta-build/lib 
[ 78%] Building CXX object src/slave/containerizer/mesos/CMakeFiles/mesos-cni-port-mapper.dir/isolators/network/cni/plugins/port_mapper/port_mapper.cpp.o
cd /mesos/build/src/slave/containerizer/mesos && /usr/bin/g++  -DBUILD_FLAGS=\"\" -DBUILD_JAVA_JVM_LIBRARY=\"\" -DHAS_AUTHENTICATION=1 -DHAVE_LIBZ -DLIBDIR=\"/usr/local/libmesos\" -DPICOJSON_USE_INT64 -DPKGDATADIR=\"/usr/local/share/mesos\" -DPKGLIBEXECDIR=\"/usr/local/libexec/mesos\" -DUSE_CMAKE_BUILD_CONFIG -DUSE_SSL_SOCKET=1 -DUSE_STATIC_LIB -DVERSION=\"1.5.0\" -DZOOKEEPER_VERSION=\"3.4.8\" -D__STDC_FORMAT_MACROS -I/mesos/include -I/mesos/build/include -I/mesos/build/include/mesos -I/mesos/build/src -I/mesos/src -I/mesos/3rdparty/libprocess/src/../include -I/mesos/3rdparty/stout/include -isystem /usr/include/apr-1.0 -isystem /mesos/build/3rdparty/boost-1.53.0/src/boost-1.53.0 -isystem /mesos/build/3rdparty/elfio-3.2/src/elfio-3.2 -isystem /mesos/build/3rdparty/glog-0.3.3/src/glog-0.3.3-build/include -isystem /mesos/build/3rdparty/picojson-1.3.0/src/picojson-1.3.0 -isystem /mesos/build/3rdparty/protobuf-3.3.0/src/protobuf-3.3.0/src -isystem /usr/include/subversion-1 -isystem /mesos/build/3rdparty/http_parser-2.6.2/src/http_parser-2.6.2 -isystem /mesos/build/3rdparty/zookeeper-3.4.8/src/zookeeper-3.4.8/src/c/include -isystem /mesos/build/3rdparty/zookeeper-3.4.8/src/zookeeper-3.4.8/src/c/generated -isystem /mesos/build/3rdparty/nvml-352.79/src/nvml-352.79 -isystem /mesos/build/3rdparty/leveldb-1.19/src/leveldb-1.19/include  -std=c++11 -Wformat-security -fstack-protector -fPIE   -o CMakeFiles/mesos-cni-port-mapper.dir/isolators/network/cni/plugins/port_mapper/port_mapper.cpp.o -c /mesos/src/slave/containerizer/mesos/isolators/network/cni/plugins/port_mapper/port_mapper.cpp
make[3]: Leaving directory `/mesos/build'
[ 78%] Built target mesos-containerizer
make -f src/slave/container_loggers/CMakeFiles/logrotate_container_logger.dir/build.make src/slave/container_loggers/CMakeFiles/logrotate_container_logger.dir/depend
make[3]: Entering directory `/mesos/build'
cd /mesos/build && /usr/local/bin/cmake -E cmake_depends "Unix Makefiles" /mesos /mesos/src/slave/container_loggers /mesos/build /mesos/build/src/slave/container_loggers /mesos/build/src/slave/container_loggers/CMakeFiles/logrotate_container_logger.dir/DependInfo.cmake --color=
Scanning dependencies of target logrotate_container_logger
make[3]: Leaving directory `/mesos/build'
make -f src/slave/container_loggers/CMakeFiles/logrotate_container_logger.dir/build.make src/slave/container_loggers/CMakeFiles/logrotate_container_logger.dir/build
make[3]: Entering directory `/mesos/build'
[ 79%] Building CXX object src/slave/container_loggers/CMakeFiles/logrotate_container_logger.dir/lib_logrotate.cpp.o
cd /mesos/build/src/slave/container_loggers && /usr/bin/g++  -DBUILD_FLAGS=\"\" -DBUILD_JAVA_JVM_LIBRARY=\"\" -DHAS_AUTHENTICATION=1 -DHAVE_LIBZ -DLIBDIR=\"/usr/local/libmesos\" -DPICOJSON_USE_INT64 -DPKGDATADIR=\"/usr/local/share/mesos\" -DPKGLIBEXECDIR=\"/usr/local/libexec/mesos\" -DUSE_CMAKE_BUILD_CONFIG -DUSE_SSL_SOCKET=1 -DUSE_STATIC_LIB -DVERSION=\"1.5.0\" -DZOOKEEPER_VERSION=\"3.4.8\" -D__STDC_FORMAT_MACROS -Dlogrotate_container_logger_EXPORTS -I/mesos/include -I/mesos/build/include -I/mesos/build/include/mesos -I/mesos/build/src -I/mesos/src -I/mesos/3rdparty/libprocess/src/../include -I/mesos/3rdparty/stout/include -isystem /usr/include/apr-1.0 -isystem /mesos/build/3rdparty/boost-1.53.0/src/boost-1.53.0 -isystem /mesos/build/3rdparty/elfio-3.2/src/elfio-3.2 -isystem /mesos/build/3rdparty/glog-0.3.3/src/glog-0.3.3-build/include -isystem /mesos/build/3rdparty/picojson-1.3.0/src/picojson-1.3.0 -isystem /mesos/build/3rdparty/protobuf-3.3.0/src/protobuf-3.3.0/src -isystem /usr/include/subversion-1 -isystem /mesos/build/3rdparty/http_parser-2.6.2/src/http_parser-2.6.2 -isystem /mesos/build/3rdparty/zookeeper-3.4.8/src/zookeeper-3.4.8/src/c/include -isystem /mesos/build/3rdparty/zookeeper-3.4.8/src/zookeeper-3.4.8/src/c/generated -isystem /mesos/build/3rdparty/nvml-352.79/src/nvml-352.79 -isystem /mesos/build/3rdparty/leveldb-1.19/src/leveldb-1.19/include  -std=c++11 -Wformat-security -fstack-protector -fPIC   -o CMakeFiles/logrotate_container_logger.dir/lib_logrotate.cpp.o -c /mesos/src/slave/container_loggers/lib_logrotate.cpp
[ 79%] Linking CXX executable ../mesos-master
cd /mesos/build/src/master && /usr/local/bin/cmake -E cmake_link_script CMakeFiles/mesos-master.dir/link.txt --verbose=1
/usr/bin/g++   -std=c++11 -Wformat-security -fstack-protector   CMakeFiles/mesos-master.dir/main.cpp.o  -o ../mesos-master -Wl,-rpath,/mesos/build/src/.libs:/mesos/build/3rdparty/libprocess/src:/mesos/build/3rdparty/glog-0.3.3/src/glog-0.3.3-build/lib:/mesos/build/3rdparty/libevent-2.1.5-beta/src/libevent-2.1.5-beta-build/lib:/mesos/build/src:/mesos/build/3rdparty/protobuf-3.3.0/src/protobuf-3.3.0-build ../.libs/libmesos.so.1.5.0 ../../3rdparty/libprocess/src/libprocess.so /usr/lib/x86_64-linux-gnu/libapr-1.so /usr/lib/x86_64-linux-gnu/libcurl.so ../../3rdparty/glog-0.3.3/src/glog-0.3.3-build/lib/libglog.so -lpthread /usr/lib/x86_64-linux-gnu/libz.so -lrt -ldl /usr/lib/x86_64-linux-gnu/libsvn_delta-1.so /usr/lib/x86_64-linux-gnu/libsvn_diff-1.so /usr/lib/x86_64-linux-gnu/libsvn_subr-1.so ../../3rdparty/http_parser-2.6.2/src/http_parser-2.6.2-build/libhttp_parser.a /usr/lib/x86_64-linux-gnu/libssl.so /usr/lib/x86_64-linux-gnu/libcrypto.so ../../3rdparty/zookeeper-3.4.8/src/zookeeper-3.4.8-build/libzookeeper.a ../../3rdparty/zookeeper-3.4.8/src/zookeeper-3.4.8-build/libhashtable.a ../libmesos-protobufs.so ../../3rdparty/protobuf-3.3.0/src/protobuf-3.3.0-build/libprotobuf.so ../../3rdparty/leveldb-1.19/src/leveldb-1.19/out-static/libleveldb.a -lsasl2 -Wl,-rpath-link,/mesos/build/3rdparty/libevent-2.1.5-beta/src/libevent-2.1.5-beta-build/lib 
[ 80%] Linking CXX executable ../mesos-usage
cd /mesos/build/src/usage && /usr/local/bin/cmake -E cmake_link_script CMakeFiles/mesos-usage.dir/link.txt --verbose=1
/usr/bin/g++   -std=c++11 -Wformat-security -fstack-protector   CMakeFiles/mesos-usage.dir/main.cpp.o  -o ../mesos-usage -Wl,-rpath,/mesos/build/src/.libs:/mesos/build/3rdparty/libprocess/src:/mesos/build/3rdparty/glog-0.3.3/src/glog-0.3.3-build/lib:/mesos/build/3rdparty/libevent-2.1.5-beta/src/libevent-2.1.5-beta-build/lib:/mesos/build/src:/mesos/build/3rdparty/protobuf-3.3.0/src/protobuf-3.3.0-build ../.libs/libmesos.so.1.5.0 ../../3rdparty/libprocess/src/libprocess.so /usr/lib/x86_64-linux-gnu/libapr-1.so /usr/lib/x86_64-linux-gnu/libcurl.so ../../3rdparty/glog-0.3.3/src/glog-0.3.3-build/lib/libglog.so -lpthread /usr/lib/x86_64-linux-gnu/libz.so -lrt -ldl /usr/lib/x86_64-linux-gnu/libsvn_delta-1.so /usr/lib/x86_64-linux-gnu/libsvn_diff-1.so /usr/lib/x86_64-linux-gnu/libsvn_subr-1.so ../../3rdparty/http_parser-2.6.2/src/http_parser-2.6.2-build/libhttp_parser.a /usr/lib/x86_64-linux-gnu/libssl.so /usr/lib/x86_64-linux-gnu/libcrypto.so ../../3rdparty/zookeeper-3.4.8/src/zookeeper-3.4.8-build/libzookeeper.a ../../3rdparty/zookeeper-3.4.8/src/zookeeper-3.4.8-build/libhashtable.a ../libmesos-protobufs.so ../../3rdparty/protobuf-3.3.0/src/protobuf-3.3.0-build/libprotobuf.so ../../3rdparty/leveldb-1.19/src/leveldb-1.19/out-static/libleveldb.a -lsasl2 -Wl,-rpath-link,/mesos/build/3rdparty/libevent-2.1.5-beta/src/libevent-2.1.5-beta-build/lib 
[ 80%] Linking CXX executable ../../../mesos-io-switchboard
cd /mesos/build/src/slave/containerizer/mesos && /usr/local/bin/cmake -E cmake_link_script CMakeFiles/mesos-io-switchboard.dir/link.txt --verbose=1
/usr/bin/g++   -std=c++11 -Wformat-security -fstack-protector   CMakeFiles/mesos-io-switchboard.dir/io/switchboard_main.cpp.o  -o ../../../mesos-io-switchboard -Wl,-rpath,/mesos/build/src/.libs:/mesos/build/3rdparty/libprocess/src:/mesos/build/3rdparty/glog-0.3.3/src/glog-0.3.3-build/lib:/mesos/build/3rdparty/libevent-2.1.5-beta/src/libevent-2.1.5-beta-build/lib:/mesos/build/src:/mesos/build/3rdparty/protobuf-3.3.0/src/protobuf-3.3.0-build ../../../.libs/libmesos.so.1.5.0 ../../../../3rdparty/libprocess/src/libprocess.so /usr/lib/x86_64-linux-gnu/libapr-1.so /usr/lib/x86_64-linux-gnu/libcurl.so ../../../../3rdparty/glog-0.3.3/src/glog-0.3.3-build/lib/libglog.so -lpthread /usr/lib/x86_64-linux-gnu/libz.so -lrt -ldl /usr/lib/x86_64-linux-gnu/libsvn_delta-1.so /usr/lib/x86_64-linux-gnu/libsvn_diff-1.so /usr/lib/x86_64-linux-gnu/libsvn_subr-1.so ../../../../3rdparty/http_parser-2.6.2/src/http_parser-2.6.2-build/libhttp_parser.a /usr/lib/x86_64-linux-gnu/libssl.so /usr/lib/x86_64-linux-gnu/libcrypto.so ../../../../3rdparty/zookeeper-3.4.8/src/zookeeper-3.4.8-build/libzookeeper.a ../../../../3rdparty/zookeeper-3.4.8/src/zookeeper-3.4.8-build/libhashtable.a ../../../libmesos-protobufs.so ../../../../3rdparty/protobuf-3.3.0/src/protobuf-3.3.0-build/libprotobuf.so ../../../../3rdparty/leveldb-1.19/src/leveldb-1.19/out-static/libleveldb.a -lsasl2 -Wl,-rpath-link,/mesos/build/3rdparty/libevent-2.1.5-beta/src/libevent-2.1.5-beta-build/lib 
[ 80%] Linking CXX executable ../mesos-agent
cd /mesos/build/src/slave && /usr/local/bin/cmake -E cmake_link_script CMakeFiles/mesos-agent.dir/link.txt --verbose=1
/usr/bin/g++   -std=c++11 -Wformat-security -fstack-protector   CMakeFiles/mesos-agent.dir/main.cpp.o  -o ../mesos-agent -Wl,-rpath,/mesos/build/src/.libs:/mesos/build/3rdparty/libprocess/src:/mesos/build/3rdparty/glog-0.3.3/src/glog-0.3.3-build/lib:/mesos/build/3rdparty/libevent-2.1.5-beta/src/libevent-2.1.5-beta-build/lib:/mesos/build/src:/mesos/build/3rdparty/protobuf-3.3.0/src/protobuf-3.3.0-build ../.libs/libmesos.so.1.5.0 ../../3rdparty/libprocess/src/libprocess.so /usr/lib/x86_64-linux-gnu/libapr-1.so /usr/lib/x86_64-linux-gnu/libcurl.so ../../3rdparty/glog-0.3.3/src/glog-0.3.3-build/lib/libglog.so -lpthread /usr/lib/x86_64-linux-gnu/libz.so -lrt -ldl /usr/lib/x86_64-linux-gnu/libsvn_delta-1.so /usr/lib/x86_64-linux-gnu/libsvn_diff-1.so /usr/lib/x86_64-linux-gnu/libsvn_subr-1.so ../../3rdparty/http_parser-2.6.2/src/http_parser-2.6.2-build/libhttp_parser.a /usr/lib/x86_64-linux-gnu/libssl.so /usr/lib/x86_64-linux-gnu/libcrypto.so ../../3rdparty/zookeeper-3.4.8/src/zookeeper-3.4.8-build/libzookeeper.a ../../3rdparty/zookeeper-3.4.8/src/zookeeper-3.4.8-build/libhashtable.a ../libmesos-protobufs.so ../../3rdparty/protobuf-3.3.0/src/protobuf-3.3.0-build/libprotobuf.so ../../3rdparty/leveldb-1.19/src/leveldb-1.19/out-static/libleveldb.a -lsasl2 -Wl,-rpath-link,/mesos/build/3rdparty/libevent-2.1.5-beta/src/libevent-2.1.5-beta-build/lib 
make[3]: Leaving directory `/mesos/build'
[ 80%] Built target mesos-master
make[3]: Leaving directory `/mesos/build'
[ 80%] Built target mesos-usage
make[3]: Leaving directory `/mesos/build'
[ 80%] Built target mesos-io-switchboard
make[3]: Leaving directory `/mesos/build'
[ 80%] Built target mesos-agent
[ 80%] Linking CXX shared library ../../.libs/liblogrotate_container_logger.so
cd /mesos/build/src/slave/container_loggers && /usr/local/bin/cmake -E cmake_link_script CMakeFiles/logrotate_container_logger.dir/link.txt --verbose=1
/usr/bin/g++ -fPIC  -std=c++11 -Wformat-security -fstack-protector  -shared -Wl,-soname,liblogrotate_container_logger.so -o ../../.libs/liblogrotate_container_logger.so CMakeFiles/logrotate_container_logger.dir/lib_logrotate.cpp.o -Wl,-rpath,/mesos/build/src/.libs:/mesos/build/3rdparty/libprocess/src:/mesos/build/3rdparty/glog-0.3.3/src/glog-0.3.3-build/lib:/mesos/build/3rdparty/libevent-2.1.5-beta/src/libevent-2.1.5-beta-build/lib:/mesos/build/src:/mesos/build/3rdparty/protobuf-3.3.0/src/protobuf-3.3.0-build ../../.libs/libmesos.so.1.5.0 ../../../3rdparty/libprocess/src/libprocess.so /usr/lib/x86_64-linux-gnu/libapr-1.so /usr/lib/x86_64-linux-gnu/libcurl.so ../../../3rdparty/glog-0.3.3/src/glog-0.3.3-build/lib/libglog.so -lpthread /usr/lib/x86_64-linux-gnu/libz.so -lrt -ldl /usr/lib/x86_64-linux-gnu/libsvn_delta-1.so /usr/lib/x86_64-linux-gnu/libsvn_diff-1.so /usr/lib/x86_64-linux-gnu/libsvn_subr-1.so ../../../3rdparty/http_parser-2.6.2/src/http_parser-2.6.2-build/libhttp_parser.a /usr/lib/x86_64-linux-gnu/libssl.so /usr/lib/x86_64-linux-gnu/libcrypto.so ../../../3rdparty/zookeeper-3.4.8/src/zookeeper-3.4.8-build/libzookeeper.a ../../../3rdparty/zookeeper-3.4.8/src/zookeeper-3.4.8-build/libhashtable.a ../../libmesos-protobufs.so ../../../3rdparty/protobuf-3.3.0/src/protobuf-3.3.0-build/libprotobuf.so ../../../3rdparty/leveldb-1.19/src/leveldb-1.19/out-static/libleveldb.a -lsasl2 -Wl,-rpath-link,/mesos/build/3rdparty/libevent-2.1.5-beta/src/libevent-2.1.5-beta-build/lib 
[ 80%] Linking CXX executable ../../../mesos-cni-port-mapper
cd /mesos/build/src/slave/containerizer/mesos && /usr/local/bin/cmake -E cmake_link_script CMakeFiles/mesos-cni-port-mapper.dir/link.txt --verbose=1
/usr/bin/g++   -std=c++11 -Wformat-security -fstack-protector   CMakeFiles/mesos-cni-port-mapper.dir/isolators/network/cni/plugins/port_mapper/main.cpp.o CMakeFiles/mesos-cni-port-mapper.dir/isolators/network/cni/plugins/port_mapper/port_mapper.cpp.o  -o ../../../mesos-cni-port-mapper -Wl,-rpath,/mesos/build/src/.libs:/mesos/build/3rdparty/libprocess/src:/mesos/build/3rdparty/glog-0.3.3/src/glog-0.3.3-build/lib:/mesos/build/3rdparty/libevent-2.1.5-beta/src/libevent-2.1.5-beta-build/lib:/mesos/build/src:/mesos/build/3rdparty/protobuf-3.3.0/src/protobuf-3.3.0-build ../../../.libs/libmesos.so.1.5.0 ../../../../3rdparty/libprocess/src/libprocess.so /usr/lib/x86_64-linux-gnu/libapr-1.so /usr/lib/x86_64-linux-gnu/libcurl.so ../../../../3rdparty/glog-0.3.3/src/glog-0.3.3-build/lib/libglog.so -lpthread /usr/lib/x86_64-linux-gnu/libz.so -lrt -ldl /usr/lib/x86_64-linux-gnu/libsvn_delta-1.so /usr/lib/x86_64-linux-gnu/libsvn_diff-1.so /usr/lib/x86_64-linux-gnu/libsvn_subr-1.so ../../../../3rdparty/http_parser-2.6.2/src/http_parser-2.6.2-build/libhttp_parser.a /usr/lib/x86_64-linux-gnu/libssl.so /usr/lib/x86_64-linux-gnu/libcrypto.so ../../../../3rdparty/zookeeper-3.4.8/src/zookeeper-3.4.8-build/libzookeeper.a ../../../../3rdparty/zookeeper-3.4.8/src/zookeeper-3.4.8-build/libhashtable.a ../../../libmesos-protobufs.so ../../../../3rdparty/protobuf-3.3.0/src/protobuf-3.3.0-build/libprotobuf.so ../../../../3rdparty/leveldb-1.19/src/leveldb-1.19/out-static/libleveldb.a -lsasl2 -Wl,-rpath-link,/mesos/build/3rdparty/libevent-2.1.5-beta/src/libevent-2.1.5-beta-build/lib 
make[3]: Leaving directory `/mesos/build'
[ 80%] Built target logrotate_container_logger
make -f src/tests/CMakeFiles/test-helper.dir/build.make src/tests/CMakeFiles/test-helper.dir/depend
make[3]: Entering directory `/mesos/build'
cd /mesos/build && /usr/local/bin/cmake -E cmake_depends "Unix Makefiles" /mesos /mesos/src/tests /mesos/build /mesos/build/src/tests /mesos/build/src/tests/CMakeFiles/test-helper.dir/DependInfo.cmake --color=
Scanning dependencies of target test-helper
make[3]: Leaving directory `/mesos/build'
make -f src/tests/CMakeFiles/test-helper.dir/build.make src/tests/CMakeFiles/test-helper.dir/build
make[3]: Entering directory `/mesos/build'
[ 80%] Building CXX object src/tests/CMakeFiles/test-helper.dir/active_user_test_helper.cpp.o
cd /mesos/build/src/tests && /usr/bin/g++  -DBUILD_DIR=\"/mesos/build\" -DBUILD_FLAGS=\"\" -DBUILD_JAVA_JVM_LIBRARY=\"\" -DHAS_AUTHENTICATION=1 -DHAVE_LIBZ -DLIBDIR=\"/usr/local/libmesos\" -DPICOJSON_USE_INT64 -DPKGDATADIR=\"/usr/local/share/mesos\" -DPKGLIBEXECDIR=\"/usr/local/libexec/mesos\" -DPKGMODULEDIR=\"\" -DSBINDIR=\"\" -DSOURCE_DIR=\"/mesos\" -DTESTLIBEXECDIR=\"\" -DUSE_CMAKE_BUILD_CONFIG -DUSE_SSL_SOCKET=1 -DUSE_STATIC_LIB -DVERSION=\"1.5.0\" -DZOOKEEPER_VERSION=\"3.4.8\" -D__STDC_FORMAT_MACROS -I/mesos/include -I/mesos/build/include -I/mesos/build/include/mesos -I/mesos/build/src -I/mesos/src -I/mesos/3rdparty/libprocess/src/../include -I/mesos/3rdparty/stout/include -isystem /usr/include/apr-1.0 -isystem /mesos/build/3rdparty/boost-1.53.0/src/boost-1.53.0 -isystem /mesos/build/3rdparty/elfio-3.2/src/elfio-3.2 -isystem /mesos/build/3rdparty/glog-0.3.3/src/glog-0.3.3-build/include -isystem /mesos/build/3rdparty/picojson-1.3.0/src/picojson-1.3.0 -isystem /mesos/build/3rdparty/protobuf-3.3.0/src/protobuf-3.3.0/src -isystem /usr/include/subversion-1 -isystem /mesos/build/3rdparty/http_parser-2.6.2/src/http_parser-2.6.2 -isystem /mesos/build/3rdparty/zookeeper-3.4.8/src/zookeeper-3.4.8/src/c/include -isystem /mesos/build/3rdparty/zookeeper-3.4.8/src/zookeeper-3.4.8/src/c/generated -isystem /mesos/build/3rdparty/nvml-352.79/src/nvml-352.79 -isystem /mesos/build/3rdparty/leveldb-1.19/src/leveldb-1.19/include -isystem /mesos/build/3rdparty/googletest-1.8.0/src/googletest-1.8.0/googlemock/include -isystem /mesos/build/3rdparty/googletest-1.8.0/src/googletest-1.8.0/googletest/include  -std=c++11 -Wformat-security -fstack-protector -fPIE   -o CMakeFiles/test-helper.dir/active_user_test_helper.cpp.o -c /mesos/src/tests/active_user_test_helper.cpp
[ 80%] Building CXX object src/tests/CMakeFiles/test-helper.dir/http_server_test_helper.cpp.o
[ 80%] Building CXX object src/tests/CMakeFiles/test-helper.dir/flags.cpp.o
cd /mesos/build/src/tests && /usr/bin/g++  -DBUILD_DIR=\"/mesos/build\" -DBUILD_FLAGS=\"\" -DBUILD_JAVA_JVM_LIBRARY=\"\" -DHAS_AUTHENTICATION=1 -DHAVE_LIBZ -DLIBDIR=\"/usr/local/libmesos\" -DPICOJSON_USE_INT64 -DPKGDATADIR=\"/usr/local/share/mesos\" -DPKGLIBEXECDIR=\"/usr/local/libexec/mesos\" -DPKGMODULEDIR=\"\" -DSBINDIR=\"\" -DSOURCE_DIR=\"/mesos\" -DTESTLIBEXECDIR=\"\" -DUSE_CMAKE_BUILD_CONFIG -DUSE_SSL_SOCKET=1 -DUSE_STATIC_LIB -DVERSION=\"1.5.0\" -DZOOKEEPER_VERSION=\"3.4.8\" -D__STDC_FORMAT_MACROS -I/mesos/include -I/mesos/build/include -I/mesos/build/include/mesos -I/mesos/build/src -I/mesos/src -I/mesos/3rdparty/libprocess/src/../include -I/mesos/3rdparty/stout/include -isystem /usr/include/apr-1.0 -isystem /mesos/build/3rdparty/boost-1.53.0/src/boost-1.53.0 -isystem /mesos/build/3rdparty/elfio-3.2/src/elfio-3.2 -isystem /mesos/build/3rdparty/glog-0.3.3/src/glog-0.3.3-build/include -isystem /mesos/build/3rdparty/picojson-1.3.0/src/picojson-1.3.0 -isystem /mesos/build/3rdparty/protobuf-3.3.0/src/protobuf-3.3.0/src -isystem /usr/include/subversion-1 -isystem /mesos/build/3rdparty/http_parser-2.6.2/src/http_parser-2.6.2 -isystem /mesos/build/3rdparty/zookeeper-3.4.8/src/zookeeper-3.4.8/src/c/include -isystem /mesos/build/3rdparty/zookeeper-3.4.8/src/zookeeper-3.4.8/src/c/generated -isystem /mesos/build/3rdparty/nvml-352.79/src/nvml-352.79 -isystem /mesos/build/3rdparty/leveldb-1.19/src/leveldb-1.19/include -isystem /mesos/build/3rdparty/googletest-1.8.0/src/googletest-1.8.0/googlemock/include -isystem /mesos/build/3rdparty/googletest-1.8.0/src/googletest-1.8.0/googletest/include  -std=c++11 -Wformat-security -fstack-protector -fPIE   -o CMakeFiles/test-helper.dir/http_server_test_helper.cpp.o -c /mesos/src/tests/http_server_test_helper.cpp
[ 80%] Building CXX object src/tests/CMakeFiles/test-helper.dir/resources_utils.cpp.o
cd /mesos/build/src/tests && /usr/bin/g++  -DBUILD_DIR=\"/mesos/build\" -DBUILD_FLAGS=\"\" -DBUILD_JAVA_JVM_LIBRARY=\"\" -DHAS_AUTHENTICATION=1 -DHAVE_LIBZ -DLIBDIR=\"/usr/local/libmesos\" -DPICOJSON_USE_INT64 -DPKGDATADIR=\"/usr/local/share/mesos\" -DPKGLIBEXECDIR=\"/usr/local/libexec/mesos\" -DPKGMODULEDIR=\"\" -DSBINDIR=\"\" -DSOURCE_DIR=\"/mesos\" -DTESTLIBEXECDIR=\"\" -DUSE_CMAKE_BUILD_CONFIG -DUSE_SSL_SOCKET=1 -DUSE_STATIC_LIB -DVERSION=\"1.5.0\" -DZOOKEEPER_VERSION=\"3.4.8\" -D__STDC_FORMAT_MACROS -I/mesos/include -I/mesos/build/include -I/mesos/build/include/mesos -I/mesos/build/src -I/mesos/src -I/mesos/3rdparty/libprocess/src/../include -I/mesos/3rdparty/stout/include -isystem /usr/include/apr-1.0 -isystem /mesos/build/3rdparty/boost-1.53.0/src/boost-1.53.0 -isystem /mesos/build/3rdparty/elfio-3.2/src/elfio-3.2 -isystem /mesos/build/3rdparty/glog-0.3.3/src/glog-0.3.3-build/include -isystem /mesos/build/3rdparty/picojson-1.3.0/src/picojson-1.3.0 -isystem /mesos/build/3rdparty/protobuf-3.3.0/src/protobuf-3.3.0/src -isystem /usr/include/subversion-1 -isystem /mesos/build/3rdparty/http_parser-2.6.2/src/http_parser-2.6.2 -isystem /mesos/build/3rdparty/zookeeper-3.4.8/src/zookeeper-3.4.8/src/c/include -isystem /mesos/build/3rdparty/zookeeper-3.4.8/src/zookeeper-3.4.8/src/c/generated -isystem /mesos/build/3rdparty/nvml-352.79/src/nvml-352.79 -isystem /mesos/build/3rdparty/leveldb-1.19/src/leveldb-1.19/include -isystem /mesos/build/3rdparty/googletest-1.8.0/src/googletest-1.8.0/googlemock/include -isystem /mesos/build/3rdparty/googletest-1.8.0/src/googletest-1.8.0/googletest/include  -std=c++11 -Wformat-security -fstack-protector -fPIE   -o CMakeFiles/test-helper.dir/flags.cpp.o -c /mesos/src/tests/flags.cpp
[ 81%] Building CXX object src/tests/CMakeFiles/test-helper.dir/test_helper_main.cpp.o
cd /mesos/build/src/tests && /usr/bin/g++  -DBUILD_DIR=\"/mesos/build\" -DBUILD_FLAGS=\"\" -DBUILD_JAVA_JVM_LIBRARY=\"\" -DHAS_AUTHENTICATION=1 -DHAVE_LIBZ -DLIBDIR=\"/usr/local/libmesos\" -DPICOJSON_USE_INT64 -DPKGDATADIR=\"/usr/local/share/mesos\" -DPKGLIBEXECDIR=\"/usr/local/libexec/mesos\" -DPKGMODULEDIR=\"\" -DSBINDIR=\"\" -DSOURCE_DIR=\"/mesos\" -DTESTLIBEXECDIR=\"\" -DUSE_CMAKE_BUILD_CONFIG -DUSE_SSL_SOCKET=1 -DUSE_STATIC_LIB -DVERSION=\"1.5.0\" -DZOOKEEPER_VERSION=\"3.4.8\" -D__STDC_FORMAT_MACROS -I/mesos/include -I/mesos/build/include -I/mesos/build/include/mesos -I/mesos/build/src -I/mesos/src -I/mesos/3rdparty/libprocess/src/../include -I/mesos/3rdparty/stout/include -isystem /usr/include/apr-1.0 -isystem /mesos/build/3rdparty/boost-1.53.0/src/boost-1.53.0 -isystem /mesos/build/3rdparty/elfio-3.2/src/elfio-3.2 -isystem /mesos/build/3rdparty/glog-0.3.3/src/glog-0.3.3-build/include -isystem /mesos/build/3rdparty/picojson-1.3.0/src/picojson-1.3.0 -isystem /mesos/build/3rdparty/protobuf-3.3.0/src/protobuf-3.3.0/src -isystem /usr/include/subversion-1 -isystem /mesos/build/3rdparty/http_parser-2.6.2/src/http_parser-2.6.2 -isystem /mesos/build/3rdparty/zookeeper-3.4.8/src/zookeeper-3.4.8/src/c/include -isystem /mesos/build/3rdparty/zookeeper-3.4.8/src/zookeeper-3.4.8/src/c/generated -isystem /mesos/build/3rdparty/nvml-352.79/src/nvml-352.79 -isystem /mesos/build/3rdparty/leveldb-1.19/src/leveldb-1.19/include -isystem /mesos/build/3rdparty/googletest-1.8.0/src/googletest-1.8.0/googlemock/include -isystem /mesos/build/3rdparty/googletest-1.8.0/src/googletest-1.8.0/googletest/include  -std=c++11 -Wformat-security -fstack-protector -fPIE   -o CMakeFiles/test-helper.dir/resources_utils.cpp.o -c /mesos/src/tests/resources_utils.cpp
cd /mesos/build/src/tests && /usr/bin/g++  -DBUILD_DIR=\"/mesos/build\" -DBUILD_FLAGS=\"\" -DBUILD_JAVA_JVM_LIBRARY=\"\" -DHAS_AUTHENTICATION=1 -DHAVE_LIBZ -DLIBDIR=\"/usr/local/libmesos\" -DPICOJSON_USE_INT64 -DPKGDATADIR=\"/usr/local/share/mesos\" -DPKGLIBEXECDIR=\"/usr/local/libexec/mesos\" -DPKGMODULEDIR=\"\" -DSBINDIR=\"\" -DSOURCE_DIR=\"/mesos\" -DTESTLIBEXECDIR=\"\" -DUSE_CMAKE_BUILD_CONFIG -DUSE_SSL_SOCKET=1 -DUSE_STATIC_LIB -DVERSION=\"1.5.0\" -DZOOKEEPER_VERSION=\"3.4.8\" -D__STDC_FORMAT_MACROS -I/mesos/include -I/mesos/build/include -I/mesos/build/include/mesos -I/mesos/build/src -I/mesos/src -I/mesos/3rdparty/libprocess/src/../include -I/mesos/3rdparty/stout/include -isystem /usr/include/apr-1.0 -isystem /mesos/build/3rdparty/boost-1.53.0/src/boost-1.53.0 -isystem /mesos/build/3rdparty/elfio-3.2/src/elfio-3.2 -isystem /mesos/build/3rdparty/glog-0.3.3/src/glog-0.3.3-build/include -isystem /mesos/build/3rdparty/picojson-1.3.0/src/picojson-1.3.0 -isystem /mesos/build/3rdparty/protobuf-3.3.0/src/protobuf-3.3.0/src -isystem /usr/include/subversion-1 -isystem /mesos/build/3rdparty/http_parser-2.6.2/src/http_parser-2.6.2 -isystem /mesos/build/3rdparty/zookeeper-3.4.8/src/zookeeper-3.4.8/src/c/include -isystem /mesos/build/3rdparty/zookeeper-3.4.8/src/zookeeper-3.4.8/src/c/generated -isystem /mesos/build/3rdparty/nvml-352.79/src/nvml-352.79 -isystem /mesos/build/3rdparty/leveldb-1.19/src/leveldb-1.19/include -isystem /mesos/build/3rdparty/googletest-1.8.0/src/googletest-1.8.0/googlemock/include -isystem /mesos/build/3rdparty/googletest-1.8.0/src/googletest-1.8.0/googletest/include  -std=c++11 -Wformat-security -fstack-protector -fPIE   -o CMakeFiles/test-helper.dir/test_helper_main.cpp.o -c /mesos/src/tests/test_helper_main.cpp
make[3]: Leaving directory `/mesos/build'
[ 81%] Built target mesos-cni-port-mapper
[ 81%] Building CXX object src/tests/CMakeFiles/test-helper.dir/utils.cpp.o
cd /mesos/build/src/tests && /usr/bin/g++  -DBUILD_DIR=\"/mesos/build\" -DBUILD_FLAGS=\"\" -DBUILD_JAVA_JVM_LIBRARY=\"\" -DHAS_AUTHENTICATION=1 -DHAVE_LIBZ -DLIBDIR=\"/usr/local/libmesos\" -DPICOJSON_USE_INT64 -DPKGDATADIR=\"/usr/local/share/mesos\" -DPKGLIBEXECDIR=\"/usr/local/libexec/mesos\" -DPKGMODULEDIR=\"\" -DSBINDIR=\"\" -DSOURCE_DIR=\"/mesos\" -DTESTLIBEXECDIR=\"\" -DUSE_CMAKE_BUILD_CONFIG -DUSE_SSL_SOCKET=1 -DUSE_STATIC_LIB -DVERSION=\"1.5.0\" -DZOOKEEPER_VERSION=\"3.4.8\" -D__STDC_FORMAT_MACROS -I/mesos/include -I/mesos/build/include -I/mesos/build/include/mesos -I/mesos/build/src -I/mesos/src -I/mesos/3rdparty/libprocess/src/../include -I/mesos/3rdparty/stout/include -isystem /usr/include/apr-1.0 -isystem /mesos/build/3rdparty/boost-1.53.0/src/boost-1.53.0 -isystem /mesos/build/3rdparty/elfio-3.2/src/elfio-3.2 -isystem /mesos/build/3rdparty/glog-0.3.3/src/glog-0.3.3-build/include -isystem /mesos/build/3rdparty/picojson-1.3.0/src/picojson-1.3.0 -isystem /mesos/build/3rdparty/protobuf-3.3.0/src/protobuf-3.3.0/src -isystem /usr/include/subversion-1 -isystem /mesos/build/3rdparty/http_parser-2.6.2/src/http_parser-2.6.2 -isystem /mesos/build/3rdparty/zookeeper-3.4.8/src/zookeeper-3.4.8/src/c/include -isystem /mesos/build/3rdparty/zookeeper-3.4.8/src/zookeeper-3.4.8/src/c/generated -isystem /mesos/build/3rdparty/nvml-352.79/src/nvml-352.79 -isystem /mesos/build/3rdparty/leveldb-1.19/src/leveldb-1.19/include -isystem /mesos/build/3rdparty/googletest-1.8.0/src/googletest-1.8.0/googlemock/include -isystem /mesos/build/3rdparty/googletest-1.8.0/src/googletest-1.8.0/googletest/include  -std=c++11 -Wformat-security -fstack-protector -fPIE   -o CMakeFiles/test-helper.dir/utils.cpp.o -c /mesos/src/tests/utils.cpp
[ 81%] Building CXX object src/tests/CMakeFiles/test-helper.dir/kill_policy_test_helper.cpp.o
cd /mesos/build/src/tests && /usr/bin/g++  -DBUILD_DIR=\"/mesos/build\" -DBUILD_FLAGS=\"\" -DBUILD_JAVA_JVM_LIBRARY=\"\" -DHAS_AUTHENTICATION=1 -DHAVE_LIBZ -DLIBDIR=\"/usr/local/libmesos\" -DPICOJSON_USE_INT64 -DPKGDATADIR=\"/usr/local/share/mesos\" -DPKGLIBEXECDIR=\"/usr/local/libexec/mesos\" -DPKGMODULEDIR=\"\" -DSBINDIR=\"\" -DSOURCE_DIR=\"/mesos\" -DTESTLIBEXECDIR=\"\" -DUSE_CMAKE_BUILD_CONFIG -DUSE_SSL_SOCKET=1 -DUSE_STATIC_LIB -DVERSION=\"1.5.0\" -DZOOKEEPER_VERSION=\"3.4.8\" -D__STDC_FORMAT_MACROS -I/mesos/include -I/mesos/build/include -I/mesos/build/include/mesos -I/mesos/build/src -I/mesos/src -I/mesos/3rdparty/libprocess/src/../include -I/mesos/3rdparty/stout/include -isystem /usr/include/apr-1.0 -isystem /mesos/build/3rdparty/boost-1.53.0/src/boost-1.53.0 -isystem /mesos/build/3rdparty/elfio-3.2/src/elfio-3.2 -isystem /mesos/build/3rdparty/glog-0.3.3/src/glog-0.3.3-build/include -isystem /mesos/build/3rdparty/picojson-1.3.0/src/picojson-1.3.0 -isystem /mesos/build/3rdparty/protobuf-3.3.0/src/protobuf-3.3.0/src -isystem /usr/include/subversion-1 -isystem /mesos/build/3rdparty/http_parser-2.6.2/src/http_parser-2.6.2 -isystem /mesos/build/3rdparty/zookeeper-3.4.8/src/zookeeper-3.4.8/src/c/include -isystem /mesos/build/3rdparty/zookeeper-3.4.8/src/zookeeper-3.4.8/src/c/generated -isystem /mesos/build/3rdparty/nvml-352.79/src/nvml-352.79 -isystem /mesos/build/3rdparty/leveldb-1.19/src/leveldb-1.19/include -isystem /mesos/build/3rdparty/googletest-1.8.0/src/googletest-1.8.0/googlemock/include -isystem /mesos/build/3rdparty/googletest-1.8.0/src/googletest-1.8.0/googletest/include  -std=c++11 -Wformat-security -fstack-protector -fPIE   -o CMakeFiles/test-helper.dir/kill_policy_test_helper.cpp.o -c /mesos/src/tests/kill_policy_test_helper.cpp
[ 81%] Building CXX object src/tests/CMakeFiles/test-helper.dir/containerizer/memory_test_helper.cpp.o
cd /mesos/build/src/tests && /usr/bin/g++  -DBUILD_DIR=\"/mesos/build\" -DBUILD_FLAGS=\"\" -DBUILD_JAVA_JVM_LIBRARY=\"\" -DHAS_AUTHENTICATION=1 -DHAVE_LIBZ -DLIBDIR=\"/usr/local/libmesos\" -DPICOJSON_USE_INT64 -DPKGDATADIR=\"/usr/local/share/mesos\" -DPKGLIBEXECDIR=\"/usr/local/libexec/mesos\" -DPKGMODULEDIR=\"\" -DSBINDIR=\"\" -DSOURCE_DIR=\"/mesos\" -DTESTLIBEXECDIR=\"\" -DUSE_CMAKE_BUILD_CONFIG -DUSE_SSL_SOCKET=1 -DUSE_STATIC_LIB -DVERSION=\"1.5.0\" -DZOOKEEPER_VERSION=\"3.4.8\" -D__STDC_FORMAT_MACROS -I/mesos/include -I/mesos/build/include -I/mesos/build/include/mesos -I/mesos/build/src -I/mesos/src -I/mesos/3rdparty/libprocess/src/../include -I/mesos/3rdparty/stout/include -isystem /usr/include/apr-1.0 -isystem /mesos/build/3rdparty/boost-1.53.0/src/boost-1.53.0 -isystem /mesos/build/3rdparty/elfio-3.2/src/elfio-3.2 -isystem /mesos/build/3rdparty/glog-0.3.3/src/glog-0.3.3-build/include -isystem /mesos/build/3rdparty/picojson-1.3.0/src/picojson-1.3.0 -isystem /mesos/build/3rdparty/protobuf-3.3.0/src/protobuf-3.3.0/src -isystem /usr/include/subversion-1 -isystem /mesos/build/3rdparty/http_parser-2.6.2/src/http_parser-2.6.2 -isystem /mesos/build/3rdparty/zookeeper-3.4.8/src/zookeeper-3.4.8/src/c/include -isystem /mesos/build/3rdparty/zookeeper-3.4.8/src/zookeeper-3.4.8/src/c/generated -isystem /mesos/build/3rdparty/nvml-352.79/src/nvml-352.79 -isystem /mesos/build/3rdparty/leveldb-1.19/src/leveldb-1.19/include -isystem /mesos/build/3rdparty/googletest-1.8.0/src/googletest-1.8.0/googlemock/include -isystem /mesos/build/3rdparty/googletest-1.8.0/src/googletest-1.8.0/googletest/include  -std=c++11 -Wformat-security -fstack-protector -fPIE   -o CMakeFiles/test-helper.dir/containerizer/memory_test_helper.cpp.o -c /mesos/src/tests/containerizer/memory_test_helper.cpp
[ 81%] Building CXX object src/tests/CMakeFiles/test-helper.dir/containerizer/capabilities_test_helper.cpp.o
cd /mesos/build/src/tests && /usr/bin/g++  -DBUILD_DIR=\"/mesos/build\" -DBUILD_FLAGS=\"\" -DBUILD_JAVA_JVM_LIBRARY=\"\" -DHAS_AUTHENTICATION=1 -DHAVE_LIBZ -DLIBDIR=\"/usr/local/libmesos\" -DPICOJSON_USE_INT64 -DPKGDATADIR=\"/usr/local/share/mesos\" -DPKGLIBEXECDIR=\"/usr/local/libexec/mesos\" -DPKGMODULEDIR=\"\" -DSBINDIR=\"\" -DSOURCE_DIR=\"/mesos\" -DTESTLIBEXECDIR=\"\" -DUSE_CMAKE_BUILD_CONFIG -DUSE_SSL_SOCKET=1 -DUSE_STATIC_LIB -DVERSION=\"1.5.0\" -DZOOKEEPER_VERSION=\"3.4.8\" -D__STDC_FORMAT_MACROS -I/mesos/include -I/mesos/build/include -I/mesos/build/include/mesos -I/mesos/build/src -I/mesos/src -I/mesos/3rdparty/libprocess/src/../include -I/mesos/3rdparty/stout/include -isystem /usr/include/apr-1.0 -isystem /mesos/build/3rdparty/boost-1.53.0/src/boost-1.53.0 -isystem /mesos/build/3rdparty/elfio-3.2/src/elfio-3.2 -isystem /mesos/build/3rdparty/glog-0.3.3/src/glog-0.3.3-build/include -isystem /mesos/build/3rdparty/picojson-1.3.0/src/picojson-1.3.0 -isystem /mesos/build/3rdparty/protobuf-3.3.0/src/protobuf-3.3.0/src -isystem /usr/include/subversion-1 -isystem /mesos/build/3rdparty/http_parser-2.6.2/src/http_parser-2.6.2 -isystem /mesos/build/3rdparty/zookeeper-3.4.8/src/zookeeper-3.4.8/src/c/include -isystem /mesos/build/3rdparty/zookeeper-3.4.8/src/zookeeper-3.4.8/src/c/generated -isystem /mesos/build/3rdparty/nvml-352.79/src/nvml-352.79 -isystem /mesos/build/3rdparty/leveldb-1.19/src/leveldb-1.19/include -isystem /mesos/build/3rdparty/googletest-1.8.0/src/googletest-1.8.0/googlemock/include -isystem /mesos/build/3rdparty/googletest-1.8.0/src/googletest-1.8.0/googletest/include  -std=c++11 -Wformat-security -fstack-protector -fPIE   -o CMakeFiles/test-helper.dir/containerizer/capabilities_test_helper.cpp.o -c /mesos/src/tests/containerizer/capabilities_test_helper.cpp
[ 81%] Building CXX object src/tests/CMakeFiles/test-helper.dir/containerizer/setns_test_helper.cpp.o
cd /mesos/build/src/tests && /usr/bin/g++  -DBUILD_DIR=\"/mesos/build\" -DBUILD_FLAGS=\"\" -DBUILD_JAVA_JVM_LIBRARY=\"\" -DHAS_AUTHENTICATION=1 -DHAVE_LIBZ -DLIBDIR=\"/usr/local/libmesos\" -DPICOJSON_USE_INT64 -DPKGDATADIR=\"/usr/local/share/mesos\" -DPKGLIBEXECDIR=\"/usr/local/libexec/mesos\" -DPKGMODULEDIR=\"\" -DSBINDIR=\"\" -DSOURCE_DIR=\"/mesos\" -DTESTLIBEXECDIR=\"\" -DUSE_CMAKE_BUILD_CONFIG -DUSE_SSL_SOCKET=1 -DUSE_STATIC_LIB -DVERSION=\"1.5.0\" -DZOOKEEPER_VERSION=\"3.4.8\" -D__STDC_FORMAT_MACROS -I/mesos/include -I/mesos/build/include -I/mesos/build/include/mesos -I/mesos/build/src -I/mesos/src -I/mesos/3rdparty/libprocess/src/../include -I/mesos/3rdparty/stout/include -isystem /usr/include/apr-1.0 -isystem /mesos/build/3rdparty/boost-1.53.0/src/boost-1.53.0 -isystem /mesos/build/3rdparty/elfio-3.2/src/elfio-3.2 -isystem /mesos/build/3rdparty/glog-0.3.3/src/glog-0.3.3-build/include -isystem /mesos/build/3rdparty/picojson-1.3.0/src/picojson-1.3.0 -isystem /mesos/build/3rdparty/protobuf-3.3.0/src/protobuf-3.3.0/src -isystem /usr/include/subversion-1 -isystem /mesos/build/3rdparty/http_parser-2.6.2/src/http_parser-2.6.2 -isystem /mesos/build/3rdparty/zookeeper-3.4.8/src/zookeeper-3.4.8/src/c/include -isystem /mesos/build/3rdparty/zookeeper-3.4.8/src/zookeeper-3.4.8/src/c/generated -isystem /mesos/build/3rdparty/nvml-352.79/src/nvml-352.79 -isystem /mesos/build/3rdparty/leveldb-1.19/src/leveldb-1.19/include -isystem /mesos/build/3rdparty/googletest-1.8.0/src/googletest-1.8.0/googlemock/include -isystem /mesos/build/3rdparty/googletest-1.8.0/src/googletest-1.8.0/googletest/include  -std=c++11 -Wformat-security -fstack-protector -fPIE   -o CMakeFiles/test-helper.dir/containerizer/setns_test_helper.cpp.o -c /mesos/src/tests/containerizer/setns_test_helper.cpp
[ 81%] Linking CXX executable ../test-helper
cd /mesos/build/src/tests && /usr/local/bin/cmake -E cmake_link_script CMakeFiles/test-helper.dir/link.txt --verbose=1
/usr/bin/g++   -std=c++11 -Wformat-security -fstack-protector   CMakeFiles/test-helper.dir/active_user_test_helper.cpp.o CMakeFiles/test-helper.dir/flags.cpp.o CMakeFiles/test-helper.dir/http_server_test_helper.cpp.o CMakeFiles/test-helper.dir/resources_utils.cpp.o CMakeFiles/test-helper.dir/test_helper_main.cpp.o CMakeFiles/test-helper.dir/utils.cpp.o CMakeFiles/test-helper.dir/kill_policy_test_helper.cpp.o CMakeFiles/test-helper.dir/containerizer/memory_test_helper.cpp.o CMakeFiles/test-helper.dir/containerizer/capabilities_test_helper.cpp.o CMakeFiles/test-helper.dir/containerizer/setns_test_helper.cpp.o  -o ../test-helper -Wl,-rpath,/mesos/build/src/.libs:/mesos/build/3rdparty/libprocess/src:/mesos/build/3rdparty/glog-0.3.3/src/glog-0.3.3-build/lib:/mesos/build/3rdparty/libevent-2.1.5-beta/src/libevent-2.1.5-beta-build/lib:/mesos/build/src:/mesos/build/3rdparty/protobuf-3.3.0/src/protobuf-3.3.0-build ../.libs/libmesos.so.1.5.0 ../../3rdparty/libprocess/src/libprocess.so /usr/lib/x86_64-linux-gnu/libapr-1.so /usr/lib/x86_64-linux-gnu/libcurl.so ../../3rdparty/glog-0.3.3/src/glog-0.3.3-build/lib/libglog.so -lpthread /usr/lib/x86_64-linux-gnu/libz.so -lrt -ldl /usr/lib/x86_64-linux-gnu/libsvn_delta-1.so /usr/lib/x86_64-linux-gnu/libsvn_diff-1.so /usr/lib/x86_64-linux-gnu/libsvn_subr-1.so ../../3rdparty/http_parser-2.6.2/src/http_parser-2.6.2-build/libhttp_parser.a /usr/lib/x86_64-linux-gnu/libssl.so /usr/lib/x86_64-linux-gnu/libcrypto.so ../../3rdparty/zookeeper-3.4.8/src/zookeeper-3.4.8-build/libzookeeper.a ../../3rdparty/zookeeper-3.4.8/src/zookeeper-3.4.8-build/libhashtable.a ../libmesos-protobufs.so ../../3rdparty/protobuf-3.3.0/src/protobuf-3.3.0-build/libprotobuf.so ../../3rdparty/leveldb-1.19/src/leveldb-1.19/out-static/libleveldb.a -lsasl2 ../../3rdparty/googletest-1.8.0/src/googletest-1.8.0-build/googlemock/libgmock.a ../../3rdparty/googletest-1.8.0/src/googletest-1.8.0-build/googlemock/gtest/libgtest.a ../.libs/libload_qos_controller.so ../.libs/libfixed_resource_estimator.so ../.libs/liblogrotate_container_logger.so -Wl,-rpath-link,/mesos/build/3rdparty/libevent-2.1.5-beta/src/libevent-2.1.5-beta-build/lib 
make[3]: Leaving directory `/mesos/build'
[ 81%] Built target test-helper
make -f src/tests/CMakeFiles/mesos-tests.dir/build.make src/tests/CMakeFiles/mesos-tests.dir/depend
make[3]: Entering directory `/mesos/build'
cd /mesos/build && /usr/local/bin/cmake -E cmake_depends "Unix Makefiles" /mesos /mesos/src/tests /mesos/build /mesos/build/src/tests /mesos/build/src/tests/CMakeFiles/mesos-tests.dir/DependInfo.cmake --color=
Scanning dependencies of target mesos-tests
make[3]: Leaving directory `/mesos/build'
make -f src/tests/CMakeFiles/mesos-tests.dir/build.make src/tests/CMakeFiles/mesos-tests.dir/build
make[3]: Entering directory `/mesos/build'
[ 81%] Building CXX object src/tests/CMakeFiles/mesos-tests.dir/active_user_test_helper.cpp.o
cd /mesos/build/src/tests && /usr/bin/g++  -DBUILD_DIR=\"/mesos/build\" -DBUILD_FLAGS=\"\" -DBUILD_JAVA_JVM_LIBRARY=\"\" -DHAS_AUTHENTICATION=1 -DHAVE_LIBZ -DLIBDIR=\"/usr/local/libmesos\" -DPICOJSON_USE_INT64 -DPKGDATADIR=\"/usr/local/share/mesos\" -DPKGLIBEXECDIR=\"/usr/local/libexec/mesos\" -DPKGMODULEDIR=\"\" -DSBINDIR=\"\" -DSOURCE_DIR=\"/mesos\" -DTESTLIBEXECDIR=\"\" -DUSE_CMAKE_BUILD_CONFIG -DUSE_SSL_SOCKET=1 -DUSE_STATIC_LIB -DVERSION=\"1.5.0\" -DZOOKEEPER_VERSION=\"3.4.8\" -D__STDC_FORMAT_MACROS -I/mesos/include -I/mesos/build/include -I/mesos/build/include/mesos -I/mesos/build/src -I/mesos/src -I/mesos/3rdparty/libprocess/src/../include -I/mesos/3rdparty/stout/include -isystem /usr/include/apr-1.0 -isystem /mesos/build/3rdparty/boost-1.53.0/src/boost-1.53.0 -isystem /mesos/build/3rdparty/elfio-3.2/src/elfio-3.2 -isystem /mesos/build/3rdparty/glog-0.3.3/src/glog-0.3.3-build/include -isystem /mesos/build/3rdparty/picojson-1.3.0/src/picojson-1.3.0 -isystem /mesos/build/3rdparty/protobuf-3.3.0/src/protobuf-3.3.0/src -isystem /usr/include/subversion-1 -isystem /mesos/build/3rdparty/http_parser-2.6.2/src/http_parser-2.6.2 -isystem /mesos/build/3rdparty/zookeeper-3.4.8/src/zookeeper-3.4.8/src/c/include -isystem /mesos/build/3rdparty/zookeeper-3.4.8/src/zookeeper-3.4.8/src/c/generated -isystem /mesos/build/3rdparty/nvml-352.79/src/nvml-352.79 -isystem /mesos/build/3rdparty/leveldb-1.19/src/leveldb-1.19/include -isystem /mesos/build/3rdparty/googletest-1.8.0/src/googletest-1.8.0/googlemock/include -isystem /mesos/build/3rdparty/googletest-1.8.0/src/googletest-1.8.0/googletest/include  -std=c++11 -Wformat-security -fstack-protector -fPIE   -o CMakeFiles/mesos-tests.dir/active_user_test_helper.cpp.o -c /mesos/src/tests/active_user_test_helper.cpp
[ 81%] Building CXX object src/tests/CMakeFiles/mesos-tests.dir/cluster.cpp.o
cd /mesos/build/src/tests && /usr/bin/g++  -DBUILD_DIR=\"/mesos/build\" -DBUILD_FLAGS=\"\" -DBUILD_JAVA_JVM_LIBRARY=\"\" -DHAS_AUTHENTICATION=1 -DHAVE_LIBZ -DLIBDIR=\"/usr/local/libmesos\" -DPICOJSON_USE_INT64 -DPKGDATADIR=\"/usr/local/share/mesos\" -DPKGLIBEXECDIR=\"/usr/local/libexec/mesos\" -DPKGMODULEDIR=\"\" -DSBINDIR=\"\" -DSOURCE_DIR=\"/mesos\" -DTESTLIBEXECDIR=\"\" -DUSE_CMAKE_BUILD_CONFIG -DUSE_SSL_SOCKET=1 -DUSE_STATIC_LIB -DVERSION=\"1.5.0\" -DZOOKEEPER_VERSION=\"3.4.8\" -D__STDC_FORMAT_MACROS -I/mesos/include -I/mesos/build/include -I/mesos/build/include/mesos -I/mesos/build/src -I/mesos/src -I/mesos/3rdparty/libprocess/src/../include -I/mesos/3rdparty/stout/include -isystem /usr/include/apr-1.0 -isystem /mesos/build/3rdparty/boost-1.53.0/src/boost-1.53.0 -isystem /mesos/build/3rdparty/elfio-3.2/src/elfio-3.2 -isystem /mesos/build/3rdparty/glog-0.3.3/src/glog-0.3.3-build/include -isystem /mesos/build/3rdparty/picojson-1.3.0/src/picojson-1.3.0 -isystem /mesos/build/3rdparty/protobuf-3.3.0/src/protobuf-3.3.0/src -isystem /usr/include/subversion-1 -isystem /mesos/build/3rdparty/http_parser-2.6.2/src/http_parser-2.6.2 -isystem /mesos/build/3rdparty/zookeeper-3.4.8/src/zookeeper-3.4.8/src/c/include -isystem /mesos/build/3rdparty/zookeeper-3.4.8/src/zookeeper-3.4.8/src/c/generated -isystem /mesos/build/3rdparty/nvml-352.79/src/nvml-352.79 -isystem /mesos/build/3rdparty/leveldb-1.19/src/leveldb-1.19/include -isystem /mesos/build/3rdparty/googletest-1.8.0/src/googletest-1.8.0/googlemock/include -isystem /mesos/build/3rdparty/googletest-1.8.0/src/googletest-1.8.0/googletest/include  -std=c++11 -Wformat-security -fstack-protector -fPIE   -o CMakeFiles/mesos-tests.dir/cluster.cpp.o -c /mesos/src/tests/cluster.cpp
[ 82%] Building CXX object src/tests/CMakeFiles/mesos-tests.dir/environment.cpp.o
[ 82%] Building CXX object src/tests/CMakeFiles/mesos-tests.dir/flags.cpp.o
[ 82%] Building CXX object src/tests/CMakeFiles/mesos-tests.dir/http_server_test_helper.cpp.o
[ 82%] Building CXX object src/tests/CMakeFiles/mesos-tests.dir/containerizer.cpp.o
cd /mesos/build/src/tests && /usr/bin/g++  -DBUILD_DIR=\"/mesos/build\" -DBUILD_FLAGS=\"\" -DBUILD_JAVA_JVM_LIBRARY=\"\" -DHAS_AUTHENTICATION=1 -DHAVE_LIBZ -DLIBDIR=\"/usr/local/libmesos\" -DPICOJSON_USE_INT64 -DPKGDATADIR=\"/usr/local/share/mesos\" -DPKGLIBEXECDIR=\"/usr/local/libexec/mesos\" -DPKGMODULEDIR=\"\" -DSBINDIR=\"\" -DSOURCE_DIR=\"/mesos\" -DTESTLIBEXECDIR=\"\" -DUSE_CMAKE_BUILD_CONFIG -DUSE_SSL_SOCKET=1 -DUSE_STATIC_LIB -DVERSION=\"1.5.0\" -DZOOKEEPER_VERSION=\"3.4.8\" -D__STDC_FORMAT_MACROS -I/mesos/include -I/mesos/build/include -I/mesos/build/include/mesos -I/mesos/build/src -I/mesos/src -I/mesos/3rdparty/libprocess/src/../include -I/mesos/3rdparty/stout/include -isystem /usr/include/apr-1.0 -isystem /mesos/build/3rdparty/boost-1.53.0/src/boost-1.53.0 -isystem /mesos/build/3rdparty/elfio-3.2/src/elfio-3.2 -isystem /mesos/build/3rdparty/glog-0.3.3/src/glog-0.3.3-build/include -isystem /mesos/build/3rdparty/picojson-1.3.0/src/picojson-1.3.0 -isystem /mesos/build/3rdparty/protobuf-3.3.0/src/protobuf-3.3.0/src -isystem /usr/include/subversion-1 -isystem /mesos/build/3rdparty/http_parser-2.6.2/src/http_parser-2.6.2 -isystem /mesos/build/3rdparty/zookeeper-3.4.8/src/zookeeper-3.4.8/src/c/include -isystem /mesos/build/3rdparty/zookeeper-3.4.8/src/zookeeper-3.4.8/src/c/generated -isystem /mesos/build/3rdparty/nvml-352.79/src/nvml-352.79 -isystem /mesos/build/3rdparty/leveldb-1.19/src/leveldb-1.19/include -isystem /mesos/build/3rdparty/googletest-1.8.0/src/googletest-1.8.0/googlemock/include -isystem /mesos/build/3rdparty/googletest-1.8.0/src/googletest-1.8.0/googletest/include  -std=c++11 -Wformat-security -fstack-protector -fPIE   -o CMakeFiles/mesos-tests.dir/environment.cpp.o -c /mesos/src/tests/environment.cpp
cd /mesos/build/src/tests && /usr/bin/g++  -DBUILD_DIR=\"/mesos/build\" -DBUILD_FLAGS=\"\" -DBUILD_JAVA_JVM_LIBRARY=\"\" -DHAS_AUTHENTICATION=1 -DHAVE_LIBZ -DLIBDIR=\"/usr/local/libmesos\" -DPICOJSON_USE_INT64 -DPKGDATADIR=\"/usr/local/share/mesos\" -DPKGLIBEXECDIR=\"/usr/local/libexec/mesos\" -DPKGMODULEDIR=\"\" -DSBINDIR=\"\" -DSOURCE_DIR=\"/mesos\" -DTESTLIBEXECDIR=\"\" -DUSE_CMAKE_BUILD_CONFIG -DUSE_SSL_SOCKET=1 -DUSE_STATIC_LIB -DVERSION=\"1.5.0\" -DZOOKEEPER_VERSION=\"3.4.8\" -D__STDC_FORMAT_MACROS -I/mesos/include -I/mesos/build/include -I/mesos/build/include/mesos -I/mesos/build/src -I/mesos/src -I/mesos/3rdparty/libprocess/src/../include -I/mesos/3rdparty/stout/include -isystem /usr/include/apr-1.0 -isystem /mesos/build/3rdparty/boost-1.53.0/src/boost-1.53.0 -isystem /mesos/build/3rdparty/elfio-3.2/src/elfio-3.2 -isystem /mesos/build/3rdparty/glog-0.3.3/src/glog-0.3.3-build/include -isystem /mesos/build/3rdparty/picojson-1.3.0/src/picojson-1.3.0 -isystem /mesos/build/3rdparty/protobuf-3.3.0/src/protobuf-3.3.0/src -isystem /usr/include/subversion-1 -isystem /mesos/build/3rdparty/http_parser-2.6.2/src/http_parser-2.6.2 -isystem /mesos/build/3rdparty/zookeeper-3.4.8/src/zookeeper-3.4.8/src/c/include -isystem /mesos/build/3rdparty/zookeeper-3.4.8/src/zookeeper-3.4.8/src/c/generated -isystem /mesos/build/3rdparty/nvml-352.79/src/nvml-352.79 -isystem /mesos/build/3rdparty/leveldb-1.19/src/leveldb-1.19/include -isystem /mesos/build/3rdparty/googletest-1.8.0/src/googletest-1.8.0/googlemock/include -isystem /mesos/build/3rdparty/googletest-1.8.0/src/googletest-1.8.0/googletest/include  -std=c++11 -Wformat-security -fstack-protector -fPIE   -o CMakeFiles/mesos-tests.dir/flags.cpp.o -c /mesos/src/tests/flags.cpp
cd /mesos/build/src/tests && /usr/bin/g++  -DBUILD_DIR=\"/mesos/build\" -DBUILD_FLAGS=\"\" -DBUILD_JAVA_JVM_LIBRARY=\"\" -DHAS_AUTHENTICATION=1 -DHAVE_LIBZ -DLIBDIR=\"/usr/local/libmesos\" -DPICOJSON_USE_INT64 -DPKGDATADIR=\"/usr/local/share/mesos\" -DPKGLIBEXECDIR=\"/usr/local/libexec/mesos\" -DPKGMODULEDIR=\"\" -DSBINDIR=\"\" -DSOURCE_DIR=\"/mesos\" -DTESTLIBEXECDIR=\"\" -DUSE_CMAKE_BUILD_CONFIG -DUSE_SSL_SOCKET=1 -DUSE_STATIC_LIB -DVERSION=\"1.5.0\" -DZOOKEEPER_VERSION=\"3.4.8\" -D__STDC_FORMAT_MACROS -I/mesos/include -I/mesos/build/include -I/mesos/build/include/mesos -I/mesos/build/src -I/mesos/src -I/mesos/3rdparty/libprocess/src/../include -I/mesos/3rdparty/stout/include -isystem /usr/include/apr-1.0 -isystem /mesos/build/3rdparty/boost-1.53.0/src/boost-1.53.0 -isystem /mesos/build/3rdparty/elfio-3.2/src/elfio-3.2 -isystem /mesos/build/3rdparty/glog-0.3.3/src/glog-0.3.3-build/include -isystem /mesos/build/3rdparty/picojson-1.3.0/src/picojson-1.3.0 -isystem /mesos/build/3rdparty/protobuf-3.3.0/src/protobuf-3.3.0/src -isystem /usr/include/subversion-1 -isystem /mesos/build/3rdparty/http_parser-2.6.2/src/http_parser-2.6.2 -isystem /mesos/build/3rdparty/zookeeper-3.4.8/src/zookeeper-3.4.8/src/c/include -isystem /mesos/build/3rdparty/zookeeper-3.4.8/src/zookeeper-3.4.8/src/c/generated -isystem /mesos/build/3rdparty/nvml-352.79/src/nvml-352.79 -isystem /mesos/build/3rdparty/leveldb-1.19/src/leveldb-1.19/include -isystem /mesos/build/3rdparty/googletest-1.8.0/src/googletest-1.8.0/googlemock/include -isystem /mesos/build/3rdparty/googletest-1.8.0/src/googletest-1.8.0/googletest/include  -std=c++11 -Wformat-security -fstack-protector -fPIE   -o CMakeFiles/mesos-tests.dir/http_server_test_helper.cpp.o -c /mesos/src/tests/http_server_test_helper.cpp
cd /mesos/build/src/tests && /usr/bin/g++  -DBUILD_DIR=\"/mesos/build\" -DBUILD_FLAGS=\"\" -DBUILD_JAVA_JVM_LIBRARY=\"\" -DHAS_AUTHENTICATION=1 -DHAVE_LIBZ -DLIBDIR=\"/usr/local/libmesos\" -DPICOJSON_USE_INT64 -DPKGDATADIR=\"/usr/local/share/mesos\" -DPKGLIBEXECDIR=\"/usr/local/libexec/mesos\" -DPKGMODULEDIR=\"\" -DSBINDIR=\"\" -DSOURCE_DIR=\"/mesos\" -DTESTLIBEXECDIR=\"\" -DUSE_CMAKE_BUILD_CONFIG -DUSE_SSL_SOCKET=1 -DUSE_STATIC_LIB -DVERSION=\"1.5.0\" -DZOOKEEPER_VERSION=\"3.4.8\" -D__STDC_FORMAT_MACROS -I/mesos/include -I/mesos/build/include -I/mesos/build/include/mesos -I/mesos/build/src -I/mesos/src -I/mesos/3rdparty/libprocess/src/../include -I/mesos/3rdparty/stout/include -isystem /usr/include/apr-1.0 -isystem /mesos/build/3rdparty/boost-1.53.0/src/boost-1.53.0 -isystem /mesos/build/3rdparty/elfio-3.2/src/elfio-3.2 -isystem /mesos/build/3rdparty/glog-0.3.3/src/glog-0.3.3-build/include -isystem /mesos/build/3rdparty/picojson-1.3.0/src/picojson-1.3.0 -isystem /mesos/build/3rdparty/protobuf-3.3.0/src/protobuf-3.3.0/src -isystem /usr/include/subversion-1 -isystem /mesos/build/3rdparty/http_parser-2.6.2/src/http_parser-2.6.2 -isystem /mesos/build/3rdparty/zookeeper-3.4.8/src/zookeeper-3.4.8/src/c/include -isystem /mesos/build/3rdparty/zookeeper-3.4.8/src/zookeeper-3.4.8/src/c/generated -isystem /mesos/build/3rdparty/nvml-352.79/src/nvml-352.79 -isystem /mesos/build/3rdparty/leveldb-1.19/src/leveldb-1.19/include -isystem /mesos/build/3rdparty/googletest-1.8.0/src/googletest-1.8.0/googlemock/include -isystem /mesos/build/3rdparty/googletest-1.8.0/src/googletest-1.8.0/googletest/include  -std=c++11 -Wformat-security -fstack-protector -fPIE   -o CMakeFiles/mesos-tests.dir/containerizer.cpp.o -c /mesos/src/tests/containerizer.cpp
[ 82%] Building CXX object src/tests/CMakeFiles/mesos-tests.dir/main.cpp.o
cd /mesos/build/src/tests && /usr/bin/g++  -DBUILD_DIR=\"/mesos/build\" -DBUILD_FLAGS=\"\" -DBUILD_JAVA_JVM_LIBRARY=\"\" -DHAS_AUTHENTICATION=1 -DHAVE_LIBZ -DLIBDIR=\"/usr/local/libmesos\" -DPICOJSON_USE_INT64 -DPKGDATADIR=\"/usr/local/share/mesos\" -DPKGLIBEXECDIR=\"/usr/local/libexec/mesos\" -DPKGMODULEDIR=\"\" -DSBINDIR=\"\" -DSOURCE_DIR=\"/mesos\" -DTESTLIBEXECDIR=\"\" -DUSE_CMAKE_BUILD_CONFIG -DUSE_SSL_SOCKET=1 -DUSE_STATIC_LIB -DVERSION=\"1.5.0\" -DZOOKEEPER_VERSION=\"3.4.8\" -D__STDC_FORMAT_MACROS -I/mesos/include -I/mesos/build/include -I/mesos/build/include/mesos -I/mesos/build/src -I/mesos/src -I/mesos/3rdparty/libprocess/src/../include -I/mesos/3rdparty/stout/include -isystem /usr/include/apr-1.0 -isystem /mesos/build/3rdparty/boost-1.53.0/src/boost-1.53.0 -isystem /mesos/build/3rdparty/elfio-3.2/src/elfio-3.2 -isystem /mesos/build/3rdparty/glog-0.3.3/src/glog-0.3.3-build/include -isystem /mesos/build/3rdparty/picojson-1.3.0/src/picojson-1.3.0 -isystem /mesos/build/3rdparty/protobuf-3.3.0/src/protobuf-3.3.0/src -isystem /usr/include/subversion-1 -isystem /mesos/build/3rdparty/http_parser-2.6.2/src/http_parser-2.6.2 -isystem /mesos/build/3rdparty/zookeeper-3.4.8/src/zookeeper-3.4.8/src/c/include -isystem /mesos/build/3rdparty/zookeeper-3.4.8/src/zookeeper-3.4.8/src/c/generated -isystem /mesos/build/3rdparty/nvml-352.79/src/nvml-352.79 -isystem /mesos/build/3rdparty/leveldb-1.19/src/leveldb-1.19/include -isystem /mesos/build/3rdparty/googletest-1.8.0/src/googletest-1.8.0/googlemock/include -isystem /mesos/build/3rdparty/googletest-1.8.0/src/googletest-1.8.0/googletest/include  -std=c++11 -Wformat-security -fstack-protector -fPIE   -o CMakeFiles/mesos-tests.dir/main.cpp.o -c /mesos/src/tests/main.cpp
[ 82%] Building CXX object src/tests/CMakeFiles/mesos-tests.dir/mesos.cpp.o
cd /mesos/build/src/tests && /usr/bin/g++  -DBUILD_DIR=\"/mesos/build\" -DBUILD_FLAGS=\"\" -DBUILD_JAVA_JVM_LIBRARY=\"\" -DHAS_AUTHENTICATION=1 -DHAVE_LIBZ -DLIBDIR=\"/usr/local/libmesos\" -DPICOJSON_USE_INT64 -DPKGDATADIR=\"/usr/local/share/mesos\" -DPKGLIBEXECDIR=\"/usr/local/libexec/mesos\" -DPKGMODULEDIR=\"\" -DSBINDIR=\"\" -DSOURCE_DIR=\"/mesos\" -DTESTLIBEXECDIR=\"\" -DUSE_CMAKE_BUILD_CONFIG -DUSE_SSL_SOCKET=1 -DUSE_STATIC_LIB -DVERSION=\"1.5.0\" -DZOOKEEPER_VERSION=\"3.4.8\" -D__STDC_FORMAT_MACROS -I/mesos/include -I/mesos/build/include -I/mesos/build/include/mesos -I/mesos/build/src -I/mesos/src -I/mesos/3rdparty/libprocess/src/../include -I/mesos/3rdparty/stout/include -isystem /usr/include/apr-1.0 -isystem /mesos/build/3rdparty/boost-1.53.0/src/boost-1.53.0 -isystem /mesos/build/3rdparty/elfio-3.2/src/elfio-3.2 -isystem /mesos/build/3rdparty/glog-0.3.3/src/glog-0.3.3-build/include -isystem /mesos/build/3rdparty/picojson-1.3.0/src/picojson-1.3.0 -isystem /mesos/build/3rdparty/protobuf-3.3.0/src/protobuf-3.3.0/src -isystem /usr/include/subversion-1 -isystem /mesos/build/3rdparty/http_parser-2.6.2/src/http_parser-2.6.2 -isystem /mesos/build/3rdparty/zookeeper-3.4.8/src/zookeeper-3.4.8/src/c/include -isystem /mesos/build/3rdparty/zookeeper-3.4.8/src/zookeeper-3.4.8/src/c/generated -isystem /mesos/build/3rdparty/nvml-352.79/src/nvml-352.79 -isystem /mesos/build/3rdparty/leveldb-1.19/src/leveldb-1.19/include -isystem /mesos/build/3rdparty/googletest-1.8.0/src/googletest-1.8.0/googlemock/include -isystem /mesos/build/3rdparty/googletest-1.8.0/src/googletest-1.8.0/googletest/include  -std=c++11 -Wformat-security -fstack-protector -fPIE   -o CMakeFiles/mesos-tests.dir/mesos.cpp.o -c /mesos/src/tests/mesos.cpp
[ 82%] Building CXX object src/tests/CMakeFiles/mesos-tests.dir/mock_docker.cpp.o
cd /mesos/build/src/tests && /usr/bin/g++  -DBUILD_DIR=\"/mesos/build\" -DBUILD_FLAGS=\"\" -DBUILD_JAVA_JVM_LIBRARY=\"\" -DHAS_AUTHENTICATION=1 -DHAVE_LIBZ -DLIBDIR=\"/usr/local/libmesos\" -DPICOJSON_USE_INT64 -DPKGDATADIR=\"/usr/local/share/mesos\" -DPKGLIBEXECDIR=\"/usr/local/libexec/mesos\" -DPKGMODULEDIR=\"\" -DSBINDIR=\"\" -DSOURCE_DIR=\"/mesos\" -DTESTLIBEXECDIR=\"\" -DUSE_CMAKE_BUILD_CONFIG -DUSE_SSL_SOCKET=1 -DUSE_STATIC_LIB -DVERSION=\"1.5.0\" -DZOOKEEPER_VERSION=\"3.4.8\" -D__STDC_FORMAT_MACROS -I/mesos/include -I/mesos/build/include -I/mesos/build/include/mesos -I/mesos/build/src -I/mesos/src -I/mesos/3rdparty/libprocess/src/../include -I/mesos/3rdparty/stout/include -isystem /usr/include/apr-1.0 -isystem /mesos/build/3rdparty/boost-1.53.0/src/boost-1.53.0 -isystem /mesos/build/3rdparty/elfio-3.2/src/elfio-3.2 -isystem /mesos/build/3rdparty/glog-0.3.3/src/glog-0.3.3-build/include -isystem /mesos/build/3rdparty/picojson-1.3.0/src/picojson-1.3.0 -isystem /mesos/build/3rdparty/protobuf-3.3.0/src/protobuf-3.3.0/src -isystem /usr/include/subversion-1 -isystem /mesos/build/3rdparty/http_parser-2.6.2/src/http_parser-2.6.2 -isystem /mesos/build/3rdparty/zookeeper-3.4.8/src/zookeeper-3.4.8/src/c/include -isystem /mesos/build/3rdparty/zookeeper-3.4.8/src/zookeeper-3.4.8/src/c/generated -isystem /mesos/build/3rdparty/nvml-352.79/src/nvml-352.79 -isystem /mesos/build/3rdparty/leveldb-1.19/src/leveldb-1.19/include -isystem /mesos/build/3rdparty/googletest-1.8.0/src/googletest-1.8.0/googlemock/include -isystem /mesos/build/3rdparty/googletest-1.8.0/src/googletest-1.8.0/googletest/include  -std=c++11 -Wformat-security -fstack-protector -fPIE   -o CMakeFiles/mesos-tests.dir/mock_docker.cpp.o -c /mesos/src/tests/mock_docker.cpp
[ 82%] Building CXX object src/tests/CMakeFiles/mesos-tests.dir/mock_fetcher.cpp.o
cd /mesos/build/src/tests && /usr/bin/g++  -DBUILD_DIR=\"/mesos/build\" -DBUILD_FLAGS=\"\" -DBUILD_JAVA_JVM_LIBRARY=\"\" -DHAS_AUTHENTICATION=1 -DHAVE_LIBZ -DLIBDIR=\"/usr/local/libmesos\" -DPICOJSON_USE_INT64 -DPKGDATADIR=\"/usr/local/share/mesos\" -DPKGLIBEXECDIR=\"/usr/local/libexec/mesos\" -DPKGMODULEDIR=\"\" -DSBINDIR=\"\" -DSOURCE_DIR=\"/mesos\" -DTESTLIBEXECDIR=\"\" -DUSE_CMAKE_BUILD_CONFIG -DUSE_SSL_SOCKET=1 -DUSE_STATIC_LIB -DVERSION=\"1.5.0\" -DZOOKEEPER_VERSION=\"3.4.8\" -D__STDC_FORMAT_MACROS -I/mesos/include -I/mesos/build/include -I/mesos/build/include/mesos -I/mesos/build/src -I/mesos/src -I/mesos/3rdparty/libprocess/src/../include -I/mesos/3rdparty/stout/include -isystem /usr/include/apr-1.0 -isystem /mesos/build/3rdparty/boost-1.53.0/src/boost-1.53.0 -isystem /mesos/build/3rdparty/elfio-3.2/src/elfio-3.2 -isystem /mesos/build/3rdparty/glog-0.3.3/src/glog-0.3.3-build/include -isystem /mesos/build/3rdparty/picojson-1.3.0/src/picojson-1.3.0 -isystem /mesos/build/3rdparty/protobuf-3.3.0/src/protobuf-3.3.0/src -isystem /usr/include/subversion-1 -isystem /mesos/build/3rdparty/http_parser-2.6.2/src/http_parser-2.6.2 -isystem /mesos/build/3rdparty/zookeeper-3.4.8/src/zookeeper-3.4.8/src/c/include -isystem /mesos/build/3rdparty/zookeeper-3.4.8/src/zookeeper-3.4.8/src/c/generated -isystem /mesos/build/3rdparty/nvml-352.79/src/nvml-352.79 -isystem /mesos/build/3rdparty/leveldb-1.19/src/leveldb-1.19/include -isystem /mesos/build/3rdparty/googletest-1.8.0/src/googletest-1.8.0/googlemock/include -isystem /mesos/build/3rdparty/googletest-1.8.0/src/googletest-1.8.0/googletest/include  -std=c++11 -Wformat-security -fstack-protector -fPIE   -o CMakeFiles/mesos-tests.dir/mock_fetcher.cpp.o -c /mesos/src/tests/mock_fetcher.cpp
[ 83%] Building CXX object src/tests/CMakeFiles/mesos-tests.dir/mock_registrar.cpp.o
cd /mesos/build/src/tests && /usr/bin/g++  -DBUILD_DIR=\"/mesos/build\" -DBUILD_FLAGS=\"\" -DBUILD_JAVA_JVM_LIBRARY=\"\" -DHAS_AUTHENTICATION=1 -DHAVE_LIBZ -DLIBDIR=\"/usr/local/libmesos\" -DPICOJSON_USE_INT64 -DPKGDATADIR=\"/usr/local/share/mesos\" -DPKGLIBEXECDIR=\"/usr/local/libexec/mesos\" -DPKGMODULEDIR=\"\" -DSBINDIR=\"\" -DSOURCE_DIR=\"/mesos\" -DTESTLIBEXECDIR=\"\" -DUSE_CMAKE_BUILD_CONFIG -DUSE_SSL_SOCKET=1 -DUSE_STATIC_LIB -DVERSION=\"1.5.0\" -DZOOKEEPER_VERSION=\"3.4.8\" -D__STDC_FORMAT_MACROS -I/mesos/include -I/mesos/build/include -I/mesos/build/include/mesos -I/mesos/build/src -I/mesos/src -I/mesos/3rdparty/libprocess/src/../include -I/mesos/3rdparty/stout/include -isystem /usr/include/apr-1.0 -isystem /mesos/build/3rdparty/boost-1.53.0/src/boost-1.53.0 -isystem /mesos/build/3rdparty/elfio-3.2/src/elfio-3.2 -isystem /mesos/build/3rdparty/glog-0.3.3/src/glog-0.3.3-build/include -isystem /mesos/build/3rdparty/picojson-1.3.0/src/picojson-1.3.0 -isystem /mesos/build/3rdparty/protobuf-3.3.0/src/protobuf-3.3.0/src -isystem /usr/include/subversion-1 -isystem /mesos/build/3rdparty/http_parser-2.6.2/src/http_parser-2.6.2 -isystem /mesos/build/3rdparty/zookeeper-3.4.8/src/zookeeper-3.4.8/src/c/include -isystem /mesos/build/3rdparty/zookeeper-3.4.8/src/zookeeper-3.4.8/src/c/generated -isystem /mesos/build/3rdparty/nvml-352.79/src/nvml-352.79 -isystem /mesos/build/3rdparty/leveldb-1.19/src/leveldb-1.19/include -isystem /mesos/build/3rdparty/googletest-1.8.0/src/googletest-1.8.0/googlemock/include -isystem /mesos/build/3rdparty/googletest-1.8.0/src/googletest-1.8.0/googletest/include  -std=c++11 -Wformat-security -fstack-protector -fPIE   -o CMakeFiles/mesos-tests.dir/mock_registrar.cpp.o -c /mesos/src/tests/mock_registrar.cpp
[ 83%] Building CXX object src/tests/CMakeFiles/mesos-tests.dir/mock_slave.cpp.o
cd /mesos/build/src/tests && /usr/bin/g++  -DBUILD_DIR=\"/mesos/build\" -DBUILD_FLAGS=\"\" -DBUILD_JAVA_JVM_LIBRARY=\"\" -DHAS_AUTHENTICATION=1 -DHAVE_LIBZ -DLIBDIR=\"/usr/local/libmesos\" -DPICOJSON_USE_INT64 -DPKGDATADIR=\"/usr/local/share/mesos\" -DPKGLIBEXECDIR=\"/usr/local/libexec/mesos\" -DPKGMODULEDIR=\"\" -DSBINDIR=\"\" -DSOURCE_DIR=\"/mesos\" -DTESTLIBEXECDIR=\"\" -DUSE_CMAKE_BUILD_CONFIG -DUSE_SSL_SOCKET=1 -DUSE_STATIC_LIB -DVERSION=\"1.5.0\" -DZOOKEEPER_VERSION=\"3.4.8\" -D__STDC_FORMAT_MACROS -I/mesos/include -I/mesos/build/include -I/mesos/build/include/mesos -I/mesos/build/src -I/mesos/src -I/mesos/3rdparty/libprocess/src/../include -I/mesos/3rdparty/stout/include -isystem /usr/include/apr-1.0 -isystem /mesos/build/3rdparty/boost-1.53.0/src/boost-1.53.0 -isystem /mesos/build/3rdparty/elfio-3.2/src/elfio-3.2 -isystem /mesos/build/3rdparty/glog-0.3.3/src/glog-0.3.3-build/include -isystem /mesos/build/3rdparty/picojson-1.3.0/src/picojson-1.3.0 -isystem /mesos/build/3rdparty/protobuf-3.3.0/src/protobuf-3.3.0/src -isystem /usr/include/subversion-1 -isystem /mesos/build/3rdparty/http_parser-2.6.2/src/http_parser-2.6.2 -isystem /mesos/build/3rdparty/zookeeper-3.4.8/src/zookeeper-3.4.8/src/c/include -isystem /mesos/build/3rdparty/zookeeper-3.4.8/src/zookeeper-3.4.8/src/c/generated -isystem /mesos/build/3rdparty/nvml-352.79/src/nvml-352.79 -isystem /mesos/build/3rdparty/leveldb-1.19/src/leveldb-1.19/include -isystem /mesos/build/3rdparty/googletest-1.8.0/src/googletest-1.8.0/googlemock/include -isystem /mesos/build/3rdparty/googletest-1.8.0/src/googletest-1.8.0/googletest/include  -std=c++11 -Wformat-security -fstack-protector -fPIE   -o CMakeFiles/mesos-tests.dir/mock_slave.cpp.o -c /mesos/src/tests/mock_slave.cpp
[ 83%] Building CXX object src/tests/CMakeFiles/mesos-tests.dir/module.cpp.o
cd /mesos/build/src/tests && /usr/bin/g++  -DBUILD_DIR=\"/mesos/build\" -DBUILD_FLAGS=\"\" -DBUILD_JAVA_JVM_LIBRARY=\"\" -DHAS_AUTHENTICATION=1 -DHAVE_LIBZ -DLIBDIR=\"/usr/local/libmesos\" -DPICOJSON_USE_INT64 -DPKGDATADIR=\"/usr/local/share/mesos\" -DPKGLIBEXECDIR=\"/usr/local/libexec/mesos\" -DPKGMODULEDIR=\"\" -DSBINDIR=\"\" -DSOURCE_DIR=\"/mesos\" -DTESTLIBEXECDIR=\"\" -DUSE_CMAKE_BUILD_CONFIG -DUSE_SSL_SOCKET=1 -DUSE_STATIC_LIB -DVERSION=\"1.5.0\" -DZOOKEEPER_VERSION=\"3.4.8\" -D__STDC_FORMAT_MACROS -I/mesos/include -I/mesos/build/include -I/mesos/build/include/mesos -I/mesos/build/src -I/mesos/src -I/mesos/3rdparty/libprocess/src/../include -I/mesos/3rdparty/stout/include -isystem /usr/include/apr-1.0 -isystem /mesos/build/3rdparty/boost-1.53.0/src/boost-1.53.0 -isystem /mesos/build/3rdparty/elfio-3.2/src/elfio-3.2 -isystem /mesos/build/3rdparty/glog-0.3.3/src/glog-0.3.3-build/include -isystem /mesos/build/3rdparty/picojson-1.3.0/src/picojson-1.3.0 -isystem /mesos/build/3rdparty/protobuf-3.3.0/src/protobuf-3.3.0/src -isystem /usr/include/subversion-1 -isystem /mesos/build/3rdparty/http_parser-2.6.2/src/http_parser-2.6.2 -isystem /mesos/build/3rdparty/zookeeper-3.4.8/src/zookeeper-3.4.8/src/c/include -isystem /mesos/build/3rdparty/zookeeper-3.4.8/src/zookeeper-3.4.8/src/c/generated -isystem /mesos/build/3rdparty/nvml-352.79/src/nvml-352.79 -isystem /mesos/build/3rdparty/leveldb-1.19/src/leveldb-1.19/include -isystem /mesos/build/3rdparty/googletest-1.8.0/src/googletest-1.8.0/googlemock/include -isystem /mesos/build/3rdparty/googletest-1.8.0/src/googletest-1.8.0/googletest/include  -std=c++11 -Wformat-security -fstack-protector -fPIE   -o CMakeFiles/mesos-tests.dir/module.cpp.o -c /mesos/src/tests/module.cpp
[ 83%] Building CXX object src/tests/CMakeFiles/mesos-tests.dir/resources_utils.cpp.o
cd /mesos/build/src/tests && /usr/bin/g++  -DBUILD_DIR=\"/mesos/build\" -DBUILD_FLAGS=\"\" -DBUILD_JAVA_JVM_LIBRARY=\"\" -DHAS_AUTHENTICATION=1 -DHAVE_LIBZ -DLIBDIR=\"/usr/local/libmesos\" -DPICOJSON_USE_INT64 -DPKGDATADIR=\"/usr/local/share/mesos\" -DPKGLIBEXECDIR=\"/usr/local/libexec/mesos\" -DPKGMODULEDIR=\"\" -DSBINDIR=\"\" -DSOURCE_DIR=\"/mesos\" -DTESTLIBEXECDIR=\"\" -DUSE_CMAKE_BUILD_CONFIG -DUSE_SSL_SOCKET=1 -DUSE_STATIC_LIB -DVERSION=\"1.5.0\" -DZOOKEEPER_VERSION=\"3.4.8\" -D__STDC_FORMAT_MACROS -I/mesos/include -I/mesos/build/include -I/mesos/build/include/mesos -I/mesos/build/src -I/mesos/src -I/mesos/3rdparty/libprocess/src/../include -I/mesos/3rdparty/stout/include -isystem /usr/include/apr-1.0 -isystem /mesos/build/3rdparty/boost-1.53.0/src/boost-1.53.0 -isystem /mesos/build/3rdparty/elfio-3.2/src/elfio-3.2 -isystem /mesos/build/3rdparty/glog-0.3.3/src/glog-0.3.3-build/include -isystem /mesos/build/3rdparty/picojson-1.3.0/src/picojson-1.3.0 -isystem /mesos/build/3rdparty/protobuf-3.3.0/src/protobuf-3.3.0/src -isystem /usr/include/subversion-1 -isystem /mesos/build/3rdparty/http_parser-2.6.2/src/http_parser-2.6.2 -isystem /mesos/build/3rdparty/zookeeper-3.4.8/src/zookeeper-3.4.8/src/c/include -isystem /mesos/build/3rdparty/zookeeper-3.4.8/src/zookeeper-3.4.8/src/c/generated -isystem /mesos/build/3rdparty/nvml-352.79/src/nvml-352.79 -isystem /mesos/build/3rdparty/leveldb-1.19/src/leveldb-1.19/include -isystem /mesos/build/3rdparty/googletest-1.8.0/src/googletest-1.8.0/googlemock/include -isystem /mesos/build/3rdparty/googletest-1.8.0/src/googletest-1.8.0/googletest/include  -std=c++11 -Wformat-security -fstack-protector -fPIE   -o CMakeFiles/mesos-tests.dir/resources_utils.cpp.o -c /mesos/src/tests/resources_utils.cpp
[ 83%] Building CXX object src/tests/CMakeFiles/mesos-tests.dir/utils.cpp.o
cd /mesos/build/src/tests && /usr/bin/g++  -DBUILD_DIR=\"/mesos/build\" -DBUILD_FLAGS=\"\" -DBUILD_JAVA_JVM_LIBRARY=\"\" -DHAS_AUTHENTICATION=1 -DHAVE_LIBZ -DLIBDIR=\"/usr/local/libmesos\" -DPICOJSON_USE_INT64 -DPKGDATADIR=\"/usr/local/share/mesos\" -DPKGLIBEXECDIR=\"/usr/local/libexec/mesos\" -DPKGMODULEDIR=\"\" -DSBINDIR=\"\" -DSOURCE_DIR=\"/mesos\" -DTESTLIBEXECDIR=\"\" -DUSE_CMAKE_BUILD_CONFIG -DUSE_SSL_SOCKET=1 -DUSE_STATIC_LIB -DVERSION=\"1.5.0\" -DZOOKEEPER_VERSION=\"3.4.8\" -D__STDC_FORMAT_MACROS -I/mesos/include -I/mesos/build/include -I/mesos/build/include/mesos -I/mesos/build/src -I/mesos/src -I/mesos/3rdparty/libprocess/src/../include -I/mesos/3rdparty/stout/include -isystem /usr/include/apr-1.0 -isystem /mesos/build/3rdparty/boost-1.53.0/src/boost-1.53.0 -isystem /mesos/build/3rdparty/elfio-3.2/src/elfio-3.2 -isystem /mesos/build/3rdparty/glog-0.3.3/src/glog-0.3.3-build/include -isystem /mesos/build/3rdparty/picojson-1.3.0/src/picojson-1.3.0 -isystem /mesos/build/3rdparty/protobuf-3.3.0/src/protobuf-3.3.0/src -isystem /usr/include/subversion-1 -isystem /mesos/build/3rdparty/http_parser-2.6.2/src/http_parser-2.6.2 -isystem /mesos/build/3rdparty/zookeeper-3.4.8/src/zookeeper-3.4.8/src/c/include -isystem /mesos/build/3rdparty/zookeeper-3.4.8/src/zookeeper-3.4.8/src/c/generated -isystem /mesos/build/3rdparty/nvml-352.79/src/nvml-352.79 -isystem /mesos/build/3rdparty/leveldb-1.19/src/leveldb-1.19/include -isystem /mesos/build/3rdparty/googletest-1.8.0/src/googletest-1.8.0/googlemock/include -isystem /mesos/build/3rdparty/googletest-1.8.0/src/googletest-1.8.0/googletest/include  -std=c++11 -Wformat-security -fstack-protector -fPIE   -o CMakeFiles/mesos-tests.dir/utils.cpp.o -c /mesos/src/tests/utils.cpp
[ 83%] Building CXX object src/tests/CMakeFiles/mesos-tests.dir/containerizer/launcher.cpp.o
cd /mesos/build/src/tests && /usr/bin/g++  -DBUILD_DIR=\"/mesos/build\" -DBUILD_FLAGS=\"\" -DBUILD_JAVA_JVM_LIBRARY=\"\" -DHAS_AUTHENTICATION=1 -DHAVE_LIBZ -DLIBDIR=\"/usr/local/libmesos\" -DPICOJSON_USE_INT64 -DPKGDATADIR=\"/usr/local/share/mesos\" -DPKGLIBEXECDIR=\"/usr/local/libexec/mesos\" -DPKGMODULEDIR=\"\" -DSBINDIR=\"\" -DSOURCE_DIR=\"/mesos\" -DTESTLIBEXECDIR=\"\" -DUSE_CMAKE_BUILD_CONFIG -DUSE_SSL_SOCKET=1 -DUSE_STATIC_LIB -DVERSION=\"1.5.0\" -DZOOKEEPER_VERSION=\"3.4.8\" -D__STDC_FORMAT_MACROS -I/mesos/include -I/mesos/build/include -I/mesos/build/include/mesos -I/mesos/build/src -I/mesos/src -I/mesos/3rdparty/libprocess/src/../include -I/mesos/3rdparty/stout/include -isystem /usr/include/apr-1.0 -isystem /mesos/build/3rdparty/boost-1.53.0/src/boost-1.53.0 -isystem /mesos/build/3rdparty/elfio-3.2/src/elfio-3.2 -isystem /mesos/build/3rdparty/glog-0.3.3/src/glog-0.3.3-build/include -isystem /mesos/build/3rdparty/picojson-1.3.0/src/picojson-1.3.0 -isystem /mesos/build/3rdparty/protobuf-3.3.0/src/protobuf-3.3.0/src -isystem /usr/include/subversion-1 -isystem /mesos/build/3rdparty/http_parser-2.6.2/src/http_parser-2.6.2 -isystem /mesos/build/3rdparty/zookeeper-3.4.8/src/zookeeper-3.4.8/src/c/include -isystem /mesos/build/3rdparty/zookeeper-3.4.8/src/zookeeper-3.4.8/src/c/generated -isystem /mesos/build/3rdparty/nvml-352.79/src/nvml-352.79 -isystem /mesos/build/3rdparty/leveldb-1.19/src/leveldb-1.19/include -isystem /mesos/build/3rdparty/googletest-1.8.0/src/googletest-1.8.0/googlemock/include -isystem /mesos/build/3rdparty/googletest-1.8.0/src/googletest-1.8.0/googletest/include  -std=c++11 -Wformat-security -fstack-protector -fPIE   -o CMakeFiles/mesos-tests.dir/containerizer/launcher.cpp.o -c /mesos/src/tests/containerizer/launcher.cpp
[ 83%] Building CXX object src/tests/CMakeFiles/mesos-tests.dir/kill_policy_test_helper.cpp.o
cd /mesos/build/src/tests && /usr/bin/g++  -DBUILD_DIR=\"/mesos/build\" -DBUILD_FLAGS=\"\" -DBUILD_JAVA_JVM_LIBRARY=\"\" -DHAS_AUTHENTICATION=1 -DHAVE_LIBZ -DLIBDIR=\"/usr/local/libmesos\" -DPICOJSON_USE_INT64 -DPKGDATADIR=\"/usr/local/share/mesos\" -DPKGLIBEXECDIR=\"/usr/local/libexec/mesos\" -DPKGMODULEDIR=\"\" -DSBINDIR=\"\" -DSOURCE_DIR=\"/mesos\" -DTESTLIBEXECDIR=\"\" -DUSE_CMAKE_BUILD_CONFIG -DUSE_SSL_SOCKET=1 -DUSE_STATIC_LIB -DVERSION=\"1.5.0\" -DZOOKEEPER_VERSION=\"3.4.8\" -D__STDC_FORMAT_MACROS -I/mesos/include -I/mesos/build/include -I/mesos/build/include/mesos -I/mesos/build/src -I/mesos/src -I/mesos/3rdparty/libprocess/src/../include -I/mesos/3rdparty/stout/include -isystem /usr/include/apr-1.0 -isystem /mesos/build/3rdparty/boost-1.53.0/src/boost-1.53.0 -isystem /mesos/build/3rdparty/elfio-3.2/src/elfio-3.2 -isystem /mesos/build/3rdparty/glog-0.3.3/src/glog-0.3.3-build/include -isystem /mesos/build/3rdparty/picojson-1.3.0/src/picojson-1.3.0 -isystem /mesos/build/3rdparty/protobuf-3.3.0/src/protobuf-3.3.0/src -isystem /usr/include/subversion-1 -isystem /mesos/build/3rdparty/http_parser-2.6.2/src/http_parser-2.6.2 -isystem /mesos/build/3rdparty/zookeeper-3.4.8/src/zookeeper-3.4.8/src/c/include -isystem /mesos/build/3rdparty/zookeeper-3.4.8/src/zookeeper-3.4.8/src/c/generated -isystem /mesos/build/3rdparty/nvml-352.79/src/nvml-352.79 -isystem /mesos/build/3rdparty/leveldb-1.19/src/leveldb-1.19/include -isystem /mesos/build/3rdparty/googletest-1.8.0/src/googletest-1.8.0/googlemock/include -isystem /mesos/build/3rdparty/googletest-1.8.0/src/googletest-1.8.0/googletest/include  -std=c++11 -Wformat-security -fstack-protector -fPIE   -o CMakeFiles/mesos-tests.dir/kill_policy_test_helper.cpp.o -c /mesos/src/tests/kill_policy_test_helper.cpp
[ 83%] Building CXX object src/tests/CMakeFiles/mesos-tests.dir/script.cpp.o
cd /mesos/build/src/tests && /usr/bin/g++  -DBUILD_DIR=\"/mesos/build\" -DBUILD_FLAGS=\"\" -DBUILD_JAVA_JVM_LIBRARY=\"\" -DHAS_AUTHENTICATION=1 -DHAVE_LIBZ -DLIBDIR=\"/usr/local/libmesos\" -DPICOJSON_USE_INT64 -DPKGDATADIR=\"/usr/local/share/mesos\" -DPKGLIBEXECDIR=\"/usr/local/libexec/mesos\" -DPKGMODULEDIR=\"\" -DSBINDIR=\"\" -DSOURCE_DIR=\"/mesos\" -DTESTLIBEXECDIR=\"\" -DUSE_CMAKE_BUILD_CONFIG -DUSE_SSL_SOCKET=1 -DUSE_STATIC_LIB -DVERSION=\"1.5.0\" -DZOOKEEPER_VERSION=\"3.4.8\" -D__STDC_FORMAT_MACROS -I/mesos/include -I/mesos/build/include -I/mesos/build/include/mesos -I/mesos/build/src -I/mesos/src -I/mesos/3rdparty/libprocess/src/../include -I/mesos/3rdparty/stout/include -isystem /usr/include/apr-1.0 -isystem /mesos/build/3rdparty/boost-1.53.0/src/boost-1.53.0 -isystem /mesos/build/3rdparty/elfio-3.2/src/elfio-3.2 -isystem /mesos/build/3rdparty/glog-0.3.3/src/glog-0.3.3-build/include -isystem /mesos/build/3rdparty/picojson-1.3.0/src/picojson-1.3.0 -isystem /mesos/build/3rdparty/protobuf-3.3.0/src/protobuf-3.3.0/src -isystem /usr/include/subversion-1 -isystem /mesos/build/3rdparty/http_parser-2.6.2/src/http_parser-2.6.2 -isystem /mesos/build/3rdparty/zookeeper-3.4.8/src/zookeeper-3.4.8/src/c/include -isystem /mesos/build/3rdparty/zookeeper-3.4.8/src/zookeeper-3.4.8/src/c/generated -isystem /mesos/build/3rdparty/nvml-352.79/src/nvml-352.79 -isystem /mesos/build/3rdparty/leveldb-1.19/src/leveldb-1.19/include -isystem /mesos/build/3rdparty/googletest-1.8.0/src/googletest-1.8.0/googlemock/include -isystem /mesos/build/3rdparty/googletest-1.8.0/src/googletest-1.8.0/googletest/include  -std=c++11 -Wformat-security -fstack-protector -fPIE   -o CMakeFiles/mesos-tests.dir/script.cpp.o -c /mesos/src/tests/script.cpp
[ 84%] Building CXX object src/tests/CMakeFiles/mesos-tests.dir/containerizer/memory_test_helper.cpp.o
cd /mesos/build/src/tests && /usr/bin/g++  -DBUILD_DIR=\"/mesos/build\" -DBUILD_FLAGS=\"\" -DBUILD_JAVA_JVM_LIBRARY=\"\" -DHAS_AUTHENTICATION=1 -DHAVE_LIBZ -DLIBDIR=\"/usr/local/libmesos\" -DPICOJSON_USE_INT64 -DPKGDATADIR=\"/usr/local/share/mesos\" -DPKGLIBEXECDIR=\"/usr/local/libexec/mesos\" -DPKGMODULEDIR=\"\" -DSBINDIR=\"\" -DSOURCE_DIR=\"/mesos\" -DTESTLIBEXECDIR=\"\" -DUSE_CMAKE_BUILD_CONFIG -DUSE_SSL_SOCKET=1 -DUSE_STATIC_LIB -DVERSION=\"1.5.0\" -DZOOKEEPER_VERSION=\"3.4.8\" -D__STDC_FORMAT_MACROS -I/mesos/include -I/mesos/build/include -I/mesos/build/include/mesos -I/mesos/build/src -I/mesos/src -I/mesos/3rdparty/libprocess/src/../include -I/mesos/3rdparty/stout/include -isystem /usr/include/apr-1.0 -isystem /mesos/build/3rdparty/boost-1.53.0/src/boost-1.53.0 -isystem /mesos/build/3rdparty/elfio-3.2/src/elfio-3.2 -isystem /mesos/build/3rdparty/glog-0.3.3/src/glog-0.3.3-build/include -isystem /mesos/build/3rdparty/picojson-1.3.0/src/picojson-1.3.0 -isystem /mesos/build/3rdparty/protobuf-3.3.0/src/protobuf-3.3.0/src -isystem /usr/include/subversion-1 -isystem /mesos/build/3rdparty/http_parser-2.6.2/src/http_parser-2.6.2 -isystem /mesos/build/3rdparty/zookeeper-3.4.8/src/zookeeper-3.4.8/src/c/include -isystem /mesos/build/3rdparty/zookeeper-3.4.8/src/zookeeper-3.4.8/src/c/generated -isystem /mesos/build/3rdparty/nvml-352.79/src/nvml-352.79 -isystem /mesos/build/3rdparty/leveldb-1.19/src/leveldb-1.19/include -isystem /mesos/build/3rdparty/googletest-1.8.0/src/googletest-1.8.0/googlemock/include -isystem /mesos/build/3rdparty/googletest-1.8.0/src/googletest-1.8.0/googletest/include  -std=c++11 -Wformat-security -fstack-protector -fPIE   -o CMakeFiles/mesos-tests.dir/containerizer/memory_test_helper.cpp.o -c /mesos/src/tests/containerizer/memory_test_helper.cpp
[ 84%] Building CXX object src/tests/CMakeFiles/mesos-tests.dir/containerizer/capabilities_test_helper.cpp.o
cd /mesos/build/src/tests && /usr/bin/g++  -DBUILD_DIR=\"/mesos/build\" -DBUILD_FLAGS=\"\" -DBUILD_JAVA_JVM_LIBRARY=\"\" -DHAS_AUTHENTICATION=1 -DHAVE_LIBZ -DLIBDIR=\"/usr/local/libmesos\" -DPICOJSON_USE_INT64 -DPKGDATADIR=\"/usr/local/share/mesos\" -DPKGLIBEXECDIR=\"/usr/local/libexec/mesos\" -DPKGMODULEDIR=\"\" -DSBINDIR=\"\" -DSOURCE_DIR=\"/mesos\" -DTESTLIBEXECDIR=\"\" -DUSE_CMAKE_BUILD_CONFIG -DUSE_SSL_SOCKET=1 -DUSE_STATIC_LIB -DVERSION=\"1.5.0\" -DZOOKEEPER_VERSION=\"3.4.8\" -D__STDC_FORMAT_MACROS -I/mesos/include -I/mesos/build/include -I/mesos/build/include/mesos -I/mesos/build/src -I/mesos/src -I/mesos/3rdparty/libprocess/src/../include -I/mesos/3rdparty/stout/include -isystem /usr/include/apr-1.0 -isystem /mesos/build/3rdparty/boost-1.53.0/src/boost-1.53.0 -isystem /mesos/build/3rdparty/elfio-3.2/src/elfio-3.2 -isystem /mesos/build/3rdparty/glog-0.3.3/src/glog-0.3.3-build/include -isystem /mesos/build/3rdparty/picojson-1.3.0/src/picojson-1.3.0 -isystem /mesos/build/3rdparty/protobuf-3.3.0/src/protobuf-3.3.0/src -isystem /usr/include/subversion-1 -isystem /mesos/build/3rdparty/http_parser-2.6.2/src/http_parser-2.6.2 -isystem /mesos/build/3rdparty/zookeeper-3.4.8/src/zookeeper-3.4.8/src/c/include -isystem /mesos/build/3rdparty/zookeeper-3.4.8/src/zookeeper-3.4.8/src/c/generated -isystem /mesos/build/3rdparty/nvml-352.79/src/nvml-352.79 -isystem /mesos/build/3rdparty/leveldb-1.19/src/leveldb-1.19/include -isystem /mesos/build/3rdparty/googletest-1.8.0/src/googletest-1.8.0/googlemock/include -isystem /mesos/build/3rdparty/googletest-1.8.0/src/googletest-1.8.0/googletest/include  -std=c++11 -Wformat-security -fstack-protector -fPIE   -o CMakeFiles/mesos-tests.dir/containerizer/capabilities_test_helper.cpp.o -c /mesos/src/tests/containerizer/capabilities_test_helper.cpp
[ 84%] Building CXX object src/tests/CMakeFiles/mesos-tests.dir/containerizer/setns_test_helper.cpp.o
cd /mesos/build/src/tests && /usr/bin/g++  -DBUILD_DIR=\"/mesos/build\" -DBUILD_FLAGS=\"\" -DBUILD_JAVA_JVM_LIBRARY=\"\" -DHAS_AUTHENTICATION=1 -DHAVE_LIBZ -DLIBDIR=\"/usr/local/libmesos\" -DPICOJSON_USE_INT64 -DPKGDATADIR=\"/usr/local/share/mesos\" -DPKGLIBEXECDIR=\"/usr/local/libexec/mesos\" -DPKGMODULEDIR=\"\" -DSBINDIR=\"\" -DSOURCE_DIR=\"/mesos\" -DTESTLIBEXECDIR=\"\" -DUSE_CMAKE_BUILD_CONFIG -DUSE_SSL_SOCKET=1 -DUSE_STATIC_LIB -DVERSION=\"1.5.0\" -DZOOKEEPER_VERSION=\"3.4.8\" -D__STDC_FORMAT_MACROS -I/mesos/include -I/mesos/build/include -I/mesos/build/include/mesos -I/mesos/build/src -I/mesos/src -I/mesos/3rdparty/libprocess/src/../include -I/mesos/3rdparty/stout/include -isystem /usr/include/apr-1.0 -isystem /mesos/build/3rdparty/boost-1.53.0/src/boost-1.53.0 -isystem /mesos/build/3rdparty/elfio-3.2/src/elfio-3.2 -isystem /mesos/build/3rdparty/glog-0.3.3/src/glog-0.3.3-build/include -isystem /mesos/build/3rdparty/picojson-1.3.0/src/picojson-1.3.0 -isystem /mesos/build/3rdparty/protobuf-3.3.0/src/protobuf-3.3.0/src -isystem /usr/include/subversion-1 -isystem /mesos/build/3rdparty/http_parser-2.6.2/src/http_parser-2.6.2 -isystem /mesos/build/3rdparty/zookeeper-3.4.8/src/zookeeper-3.4.8/src/c/include -isystem /mesos/build/3rdparty/zookeeper-3.4.8/src/zookeeper-3.4.8/src/c/generated -isystem /mesos/build/3rdparty/nvml-352.79/src/nvml-352.79 -isystem /mesos/build/3rdparty/leveldb-1.19/src/leveldb-1.19/include -isystem /mesos/build/3rdparty/googletest-1.8.0/src/googletest-1.8.0/googlemock/include -isystem /mesos/build/3rdparty/googletest-1.8.0/src/googletest-1.8.0/googletest/include  -std=c++11 -Wformat-security -fstack-protector -fPIE   -o CMakeFiles/mesos-tests.dir/containerizer/setns_test_helper.cpp.o -c /mesos/src/tests/containerizer/setns_test_helper.cpp
[ 84%] Building CXX object src/tests/CMakeFiles/mesos-tests.dir/anonymous_tests.cpp.o
cd /mesos/build/src/tests && /usr/bin/g++  -DBUILD_DIR=\"/mesos/build\" -DBUILD_FLAGS=\"\" -DBUILD_JAVA_JVM_LIBRARY=\"\" -DHAS_AUTHENTICATION=1 -DHAVE_LIBZ -DLIBDIR=\"/usr/local/libmesos\" -DPICOJSON_USE_INT64 -DPKGDATADIR=\"/usr/local/share/mesos\" -DPKGLIBEXECDIR=\"/usr/local/libexec/mesos\" -DPKGMODULEDIR=\"\" -DSBINDIR=\"\" -DSOURCE_DIR=\"/mesos\" -DTESTLIBEXECDIR=\"\" -DUSE_CMAKE_BUILD_CONFIG -DUSE_SSL_SOCKET=1 -DUSE_STATIC_LIB -DVERSION=\"1.5.0\" -DZOOKEEPER_VERSION=\"3.4.8\" -D__STDC_FORMAT_MACROS -I/mesos/include -I/mesos/build/include -I/mesos/build/include/mesos -I/mesos/build/src -I/mesos/src -I/mesos/3rdparty/libprocess/src/../include -I/mesos/3rdparty/stout/include -isystem /usr/include/apr-1.0 -isystem /mesos/build/3rdparty/boost-1.53.0/src/boost-1.53.0 -isystem /mesos/build/3rdparty/elfio-3.2/src/elfio-3.2 -isystem /mesos/build/3rdparty/glog-0.3.3/src/glog-0.3.3-build/include -isystem /mesos/build/3rdparty/picojson-1.3.0/src/picojson-1.3.0 -isystem /mesos/build/3rdparty/protobuf-3.3.0/src/protobuf-3.3.0/src -isystem /usr/include/subversion-1 -isystem /mesos/build/3rdparty/http_parser-2.6.2/src/http_parser-2.6.2 -isystem /mesos/build/3rdparty/zookeeper-3.4.8/src/zookeeper-3.4.8/src/c/include -isystem /mesos/build/3rdparty/zookeeper-3.4.8/src/zookeeper-3.4.8/src/c/generated -isystem /mesos/build/3rdparty/nvml-352.79/src/nvml-352.79 -isystem /mesos/build/3rdparty/leveldb-1.19/src/leveldb-1.19/include -isystem /mesos/build/3rdparty/googletest-1.8.0/src/googletest-1.8.0/googlemock/include -isystem /mesos/build/3rdparty/googletest-1.8.0/src/googletest-1.8.0/googletest/include  -std=c++11 -Wformat-security -fstack-protector -fPIE   -o CMakeFiles/mesos-tests.dir/anonymous_tests.cpp.o -c /mesos/src/tests/anonymous_tests.cpp
[ 84%] Building CXX object src/tests/CMakeFiles/mesos-tests.dir/api_tests.cpp.o
cd /mesos/build/src/tests && /usr/bin/g++  -DBUILD_DIR=\"/mesos/build\" -DBUILD_FLAGS=\"\" -DBUILD_JAVA_JVM_LIBRARY=\"\" -DHAS_AUTHENTICATION=1 -DHAVE_LIBZ -DLIBDIR=\"/usr/local/libmesos\" -DPICOJSON_USE_INT64 -DPKGDATADIR=\"/usr/local/share/mesos\" -DPKGLIBEXECDIR=\"/usr/local/libexec/mesos\" -DPKGMODULEDIR=\"\" -DSBINDIR=\"\" -DSOURCE_DIR=\"/mesos\" -DTESTLIBEXECDIR=\"\" -DUSE_CMAKE_BUILD_CONFIG -DUSE_SSL_SOCKET=1 -DUSE_STATIC_LIB -DVERSION=\"1.5.0\" -DZOOKEEPER_VERSION=\"3.4.8\" -D__STDC_FORMAT_MACROS -I/mesos/include -I/mesos/build/include -I/mesos/build/include/mesos -I/mesos/build/src -I/mesos/src -I/mesos/3rdparty/libprocess/src/../include -I/mesos/3rdparty/stout/include -isystem /usr/include/apr-1.0 -isystem /mesos/build/3rdparty/boost-1.53.0/src/boost-1.53.0 -isystem /mesos/build/3rdparty/elfio-3.2/src/elfio-3.2 -isystem /mesos/build/3rdparty/glog-0.3.3/src/glog-0.3.3-build/include -isystem /mesos/build/3rdparty/picojson-1.3.0/src/picojson-1.3.0 -isystem /mesos/build/3rdparty/protobuf-3.3.0/src/protobuf-3.3.0/src -isystem /usr/include/subversion-1 -isystem /mesos/build/3rdparty/http_parser-2.6.2/src/http_parser-2.6.2 -isystem /mesos/build/3rdparty/zookeeper-3.4.8/src/zookeeper-3.4.8/src/c/include -isystem /mesos/build/3rdparty/zookeeper-3.4.8/src/zookeeper-3.4.8/src/c/generated -isystem /mesos/build/3rdparty/nvml-352.79/src/nvml-352.79 -isystem /mesos/build/3rdparty/leveldb-1.19/src/leveldb-1.19/include -isystem /mesos/build/3rdparty/googletest-1.8.0/src/googletest-1.8.0/googlemock/include -isystem /mesos/build/3rdparty/googletest-1.8.0/src/googletest-1.8.0/googletest/include  -std=c++11 -Wformat-security -fstack-protector -fPIE   -o CMakeFiles/mesos-tests.dir/api_tests.cpp.o -c /mesos/src/tests/api_tests.cpp
[ 84%] Building CXX object src/tests/CMakeFiles/mesos-tests.dir/attributes_tests.cpp.o
cd /mesos/build/src/tests && /usr/bin/g++  -DBUILD_DIR=\"/mesos/build\" -DBUILD_FLAGS=\"\" -DBUILD_JAVA_JVM_LIBRARY=\"\" -DHAS_AUTHENTICATION=1 -DHAVE_LIBZ -DLIBDIR=\"/usr/local/libmesos\" -DPICOJSON_USE_INT64 -DPKGDATADIR=\"/usr/local/share/mesos\" -DPKGLIBEXECDIR=\"/usr/local/libexec/mesos\" -DPKGMODULEDIR=\"\" -DSBINDIR=\"\" -DSOURCE_DIR=\"/mesos\" -DTESTLIBEXECDIR=\"\" -DUSE_CMAKE_BUILD_CONFIG -DUSE_SSL_SOCKET=1 -DUSE_STATIC_LIB -DVERSION=\"1.5.0\" -DZOOKEEPER_VERSION=\"3.4.8\" -D__STDC_FORMAT_MACROS -I/mesos/include -I/mesos/build/include -I/mesos/build/include/mesos -I/mesos/build/src -I/mesos/src -I/mesos/3rdparty/libprocess/src/../include -I/mesos/3rdparty/stout/include -isystem /usr/include/apr-1.0 -isystem /mesos/build/3rdparty/boost-1.53.0/src/boost-1.53.0 -isystem /mesos/build/3rdparty/elfio-3.2/src/elfio-3.2 -isystem /mesos/build/3rdparty/glog-0.3.3/src/glog-0.3.3-build/include -isystem /mesos/build/3rdparty/picojson-1.3.0/src/picojson-1.3.0 -isystem /mesos/build/3rdparty/protobuf-3.3.0/src/protobuf-3.3.0/src -isystem /usr/include/subversion-1 -isystem /mesos/build/3rdparty/http_parser-2.6.2/src/http_parser-2.6.2 -isystem /mesos/build/3rdparty/zookeeper-3.4.8/src/zookeeper-3.4.8/src/c/include -isystem /mesos/build/3rdparty/zookeeper-3.4.8/src/zookeeper-3.4.8/src/c/generated -isystem /mesos/build/3rdparty/nvml-352.79/src/nvml-352.79 -isystem /mesos/build/3rdparty/leveldb-1.19/src/leveldb-1.19/include -isystem /mesos/build/3rdparty/googletest-1.8.0/src/googletest-1.8.0/googlemock/include -isystem /mesos/build/3rdparty/googletest-1.8.0/src/googletest-1.8.0/googletest/include  -std=c++11 -Wformat-security -fstack-protector -fPIE   -o CMakeFiles/mesos-tests.dir/attributes_tests.cpp.o -c /mesos/src/tests/attributes_tests.cpp
[ 84%] Building CXX object src/tests/CMakeFiles/mesos-tests.dir/authentication_tests.cpp.o
cd /mesos/build/src/tests && /usr/bin/g++  -DBUILD_DIR=\"/mesos/build\" -DBUILD_FLAGS=\"\" -DBUILD_JAVA_JVM_LIBRARY=\"\" -DHAS_AUTHENTICATION=1 -DHAVE_LIBZ -DLIBDIR=\"/usr/local/libmesos\" -DPICOJSON_USE_INT64 -DPKGDATADIR=\"/usr/local/share/mesos\" -DPKGLIBEXECDIR=\"/usr/local/libexec/mesos\" -DPKGMODULEDIR=\"\" -DSBINDIR=\"\" -DSOURCE_DIR=\"/mesos\" -DTESTLIBEXECDIR=\"\" -DUSE_CMAKE_BUILD_CONFIG -DUSE_SSL_SOCKET=1 -DUSE_STATIC_LIB -DVERSION=\"1.5.0\" -DZOOKEEPER_VERSION=\"3.4.8\" -D__STDC_FORMAT_MACROS -I/mesos/include -I/mesos/build/include -I/mesos/build/include/mesos -I/mesos/build/src -I/mesos/src -I/mesos/3rdparty/libprocess/src/../include -I/mesos/3rdparty/stout/include -isystem /usr/include/apr-1.0 -isystem /mesos/build/3rdparty/boost-1.53.0/src/boost-1.53.0 -isystem /mesos/build/3rdparty/elfio-3.2/src/elfio-3.2 -isystem /mesos/build/3rdparty/glog-0.3.3/src/glog-0.3.3-build/include -isystem /mesos/build/3rdparty/picojson-1.3.0/src/picojson-1.3.0 -isystem /mesos/build/3rdparty/protobuf-3.3.0/src/protobuf-3.3.0/src -isystem /usr/include/subversion-1 -isystem /mesos/build/3rdparty/http_parser-2.6.2/src/http_parser-2.6.2 -isystem /mesos/build/3rdparty/zookeeper-3.4.8/src/zookeeper-3.4.8/src/c/include -isystem /mesos/build/3rdparty/zookeeper-3.4.8/src/zookeeper-3.4.8/src/c/generated -isystem /mesos/build/3rdparty/nvml-352.79/src/nvml-352.79 -isystem /mesos/build/3rdparty/leveldb-1.19/src/leveldb-1.19/include -isystem /mesos/build/3rdparty/googletest-1.8.0/src/googletest-1.8.0/googlemock/include -isystem /mesos/build/3rdparty/googletest-1.8.0/src/googletest-1.8.0/googletest/include  -std=c++11 -Wformat-security -fstack-protector -fPIE   -o CMakeFiles/mesos-tests.dir/authentication_tests.cpp.o -c /mesos/src/tests/authentication_tests.cpp
[ 85%] Building CXX object src/tests/CMakeFiles/mesos-tests.dir/check_tests.cpp.o
cd /mesos/build/src/tests && /usr/bin/g++  -DBUILD_DIR=\"/mesos/build\" -DBUILD_FLAGS=\"\" -DBUILD_JAVA_JVM_LIBRARY=\"\" -DHAS_AUTHENTICATION=1 -DHAVE_LIBZ -DLIBDIR=\"/usr/local/libmesos\" -DPICOJSON_USE_INT64 -DPKGDATADIR=\"/usr/local/share/mesos\" -DPKGLIBEXECDIR=\"/usr/local/libexec/mesos\" -DPKGMODULEDIR=\"\" -DSBINDIR=\"\" -DSOURCE_DIR=\"/mesos\" -DTESTLIBEXECDIR=\"\" -DUSE_CMAKE_BUILD_CONFIG -DUSE_SSL_SOCKET=1 -DUSE_STATIC_LIB -DVERSION=\"1.5.0\" -DZOOKEEPER_VERSION=\"3.4.8\" -D__STDC_FORMAT_MACROS -I/mesos/include -I/mesos/build/include -I/mesos/build/include/mesos -I/mesos/build/src -I/mesos/src -I/mesos/3rdparty/libprocess/src/../include -I/mesos/3rdparty/stout/include -isystem /usr/include/apr-1.0 -isystem /mesos/build/3rdparty/boost-1.53.0/src/boost-1.53.0 -isystem /mesos/build/3rdparty/elfio-3.2/src/elfio-3.2 -isystem /mesos/build/3rdparty/glog-0.3.3/src/glog-0.3.3-build/include -isystem /mesos/build/3rdparty/picojson-1.3.0/src/picojson-1.3.0 -isystem /mesos/build/3rdparty/protobuf-3.3.0/src/protobuf-3.3.0/src -isystem /usr/include/subversion-1 -isystem /mesos/build/3rdparty/http_parser-2.6.2/src/http_parser-2.6.2 -isystem /mesos/build/3rdparty/zookeeper-3.4.8/src/zookeeper-3.4.8/src/c/include -isystem /mesos/build/3rdparty/zookeeper-3.4.8/src/zookeeper-3.4.8/src/c/generated -isystem /mesos/build/3rdparty/nvml-352.79/src/nvml-352.79 -isystem /mesos/build/3rdparty/leveldb-1.19/src/leveldb-1.19/include -isystem /mesos/build/3rdparty/googletest-1.8.0/src/googletest-1.8.0/googlemock/include -isystem /mesos/build/3rdparty/googletest-1.8.0/src/googletest-1.8.0/googletest/include  -std=c++11 -Wformat-security -fstack-protector -fPIE   -o CMakeFiles/mesos-tests.dir/check_tests.cpp.o -c /mesos/src/tests/check_tests.cpp
[ 85%] Building CXX object src/tests/CMakeFiles/mesos-tests.dir/command_executor_tests.cpp.o
cd /mesos/build/src/tests && /usr/bin/g++  -DBUILD_DIR=\"/mesos/build\" -DBUILD_FLAGS=\"\" -DBUILD_JAVA_JVM_LIBRARY=\"\" -DHAS_AUTHENTICATION=1 -DHAVE_LIBZ -DLIBDIR=\"/usr/local/libmesos\" -DPICOJSON_USE_INT64 -DPKGDATADIR=\"/usr/local/share/mesos\" -DPKGLIBEXECDIR=\"/usr/local/libexec/mesos\" -DPKGMODULEDIR=\"\" -DSBINDIR=\"\" -DSOURCE_DIR=\"/mesos\" -DTESTLIBEXECDIR=\"\" -DUSE_CMAKE_BUILD_CONFIG -DUSE_SSL_SOCKET=1 -DUSE_STATIC_LIB -DVERSION=\"1.5.0\" -DZOOKEEPER_VERSION=\"3.4.8\" -D__STDC_FORMAT_MACROS -I/mesos/include -I/mesos/build/include -I/mesos/build/include/mesos -I/mesos/build/src -I/mesos/src -I/mesos/3rdparty/libprocess/src/../include -I/mesos/3rdparty/stout/include -isystem /usr/include/apr-1.0 -isystem /mesos/build/3rdparty/boost-1.53.0/src/boost-1.53.0 -isystem /mesos/build/3rdparty/elfio-3.2/src/elfio-3.2 -isystem /mesos/build/3rdparty/glog-0.3.3/src/glog-0.3.3-build/include -isystem /mesos/build/3rdparty/picojson-1.3.0/src/picojson-1.3.0 -isystem /mesos/build/3rdparty/protobuf-3.3.0/src/protobuf-3.3.0/src -isystem /usr/include/subversion-1 -isystem /mesos/build/3rdparty/http_parser-2.6.2/src/http_parser-2.6.2 -isystem /mesos/build/3rdparty/zookeeper-3.4.8/src/zookeeper-3.4.8/src/c/include -isystem /mesos/build/3rdparty/zookeeper-3.4.8/src/zookeeper-3.4.8/src/c/generated -isystem /mesos/build/3rdparty/nvml-352.79/src/nvml-352.79 -isystem /mesos/build/3rdparty/leveldb-1.19/src/leveldb-1.19/include -isystem /mesos/build/3rdparty/googletest-1.8.0/src/googletest-1.8.0/googlemock/include -isystem /mesos/build/3rdparty/googletest-1.8.0/src/googletest-1.8.0/googletest/include  -std=c++11 -Wformat-security -fstack-protector -fPIE   -o CMakeFiles/mesos-tests.dir/command_executor_tests.cpp.o -c /mesos/src/tests/command_executor_tests.cpp
[ 85%] Building CXX object src/tests/CMakeFiles/mesos-tests.dir/common_validation_tests.cpp.o
cd /mesos/build/src/tests && /usr/bin/g++  -DBUILD_DIR=\"/mesos/build\" -DBUILD_FLAGS=\"\" -DBUILD_JAVA_JVM_LIBRARY=\"\" -DHAS_AUTHENTICATION=1 -DHAVE_LIBZ -DLIBDIR=\"/usr/local/libmesos\" -DPICOJSON_USE_INT64 -DPKGDATADIR=\"/usr/local/share/mesos\" -DPKGLIBEXECDIR=\"/usr/local/libexec/mesos\" -DPKGMODULEDIR=\"\" -DSBINDIR=\"\" -DSOURCE_DIR=\"/mesos\" -DTESTLIBEXECDIR=\"\" -DUSE_CMAKE_BUILD_CONFIG -DUSE_SSL_SOCKET=1 -DUSE_STATIC_LIB -DVERSION=\"1.5.0\" -DZOOKEEPER_VERSION=\"3.4.8\" -D__STDC_FORMAT_MACROS -I/mesos/include -I/mesos/build/include -I/mesos/build/include/mesos -I/mesos/build/src -I/mesos/src -I/mesos/3rdparty/libprocess/src/../include -I/mesos/3rdparty/stout/include -isystem /usr/include/apr-1.0 -isystem /mesos/build/3rdparty/boost-1.53.0/src/boost-1.53.0 -isystem /mesos/build/3rdparty/elfio-3.2/src/elfio-3.2 -isystem /mesos/build/3rdparty/glog-0.3.3/src/glog-0.3.3-build/include -isystem /mesos/build/3rdparty/picojson-1.3.0/src/picojson-1.3.0 -isystem /mesos/build/3rdparty/protobuf-3.3.0/src/protobuf-3.3.0/src -isystem /usr/include/subversion-1 -isystem /mesos/build/3rdparty/http_parser-2.6.2/src/http_parser-2.6.2 -isystem /mesos/build/3rdparty/zookeeper-3.4.8/src/zookeeper-3.4.8/src/c/include -isystem /mesos/build/3rdparty/zookeeper-3.4.8/src/zookeeper-3.4.8/src/c/generated -isystem /mesos/build/3rdparty/nvml-352.79/src/nvml-352.79 -isystem /mesos/build/3rdparty/leveldb-1.19/src/leveldb-1.19/include -isystem /mesos/build/3rdparty/googletest-1.8.0/src/googletest-1.8.0/googlemock/include -isystem /mesos/build/3rdparty/googletest-1.8.0/src/googletest-1.8.0/googletest/include  -std=c++11 -Wformat-security -fstack-protector -fPIE   -o CMakeFiles/mesos-tests.dir/common_validation_tests.cpp.o -c /mesos/src/tests/common_validation_tests.cpp
[ 85%] Building CXX object src/tests/CMakeFiles/mesos-tests.dir/credentials_tests.cpp.o
cd /mesos/build/src/tests && /usr/bin/g++  -DBUILD_DIR=\"/mesos/build\" -DBUILD_FLAGS=\"\" -DBUILD_JAVA_JVM_LIBRARY=\"\" -DHAS_AUTHENTICATION=1 -DHAVE_LIBZ -DLIBDIR=\"/usr/local/libmesos\" -DPICOJSON_USE_INT64 -DPKGDATADIR=\"/usr/local/share/mesos\" -DPKGLIBEXECDIR=\"/usr/local/libexec/mesos\" -DPKGMODULEDIR=\"\" -DSBINDIR=\"\" -DSOURCE_DIR=\"/mesos\" -DTESTLIBEXECDIR=\"\" -DUSE_CMAKE_BUILD_CONFIG -DUSE_SSL_SOCKET=1 -DUSE_STATIC_LIB -DVERSION=\"1.5.0\" -DZOOKEEPER_VERSION=\"3.4.8\" -D__STDC_FORMAT_MACROS -I/mesos/include -I/mesos/build/include -I/mesos/build/include/mesos -I/mesos/build/src -I/mesos/src -I/mesos/3rdparty/libprocess/src/../include -I/mesos/3rdparty/stout/include -isystem /usr/include/apr-1.0 -isystem /mesos/build/3rdparty/boost-1.53.0/src/boost-1.53.0 -isystem /mesos/build/3rdparty/elfio-3.2/src/elfio-3.2 -isystem /mesos/build/3rdparty/glog-0.3.3/src/glog-0.3.3-build/include -isystem /mesos/build/3rdparty/picojson-1.3.0/src/picojson-1.3.0 -isystem /mesos/build/3rdparty/protobuf-3.3.0/src/protobuf-3.3.0/src -isystem /usr/include/subversion-1 -isystem /mesos/build/3rdparty/http_parser-2.6.2/src/http_parser-2.6.2 -isystem /mesos/build/3rdparty/zookeeper-3.4.8/src/zookeeper-3.4.8/src/c/include -isystem /mesos/build/3rdparty/zookeeper-3.4.8/src/zookeeper-3.4.8/src/c/generated -isystem /mesos/build/3rdparty/nvml-352.79/src/nvml-352.79 -isystem /mesos/build/3rdparty/leveldb-1.19/src/leveldb-1.19/include -isystem /mesos/build/3rdparty/googletest-1.8.0/src/googletest-1.8.0/googlemock/include -isystem /mesos/build/3rdparty/googletest-1.8.0/src/googletest-1.8.0/googletest/include  -std=c++11 -Wformat-security -fstack-protector -fPIE   -o CMakeFiles/mesos-tests.dir/credentials_tests.cpp.o -c /mesos/src/tests/credentials_tests.cpp
[ 85%] Building CXX object src/tests/CMakeFiles/mesos-tests.dir/default_executor_tests.cpp.o
cd /mesos/build/src/tests && /usr/bin/g++  -DBUILD_DIR=\"/mesos/build\" -DBUILD_FLAGS=\"\" -DBUILD_JAVA_JVM_LIBRARY=\"\" -DHAS_AUTHENTICATION=1 -DHAVE_LIBZ -DLIBDIR=\"/usr/local/libmesos\" -DPICOJSON_USE_INT64 -DPKGDATADIR=\"/usr/local/share/mesos\" -DPKGLIBEXECDIR=\"/usr/local/libexec/mesos\" -DPKGMODULEDIR=\"\" -DSBINDIR=\"\" -DSOURCE_DIR=\"/mesos\" -DTESTLIBEXECDIR=\"\" -DUSE_CMAKE_BUILD_CONFIG -DUSE_SSL_SOCKET=1 -DUSE_STATIC_LIB -DVERSION=\"1.5.0\" -DZOOKEEPER_VERSION=\"3.4.8\" -D__STDC_FORMAT_MACROS -I/mesos/include -I/mesos/build/include -I/mesos/build/include/mesos -I/mesos/build/src -I/mesos/src -I/mesos/3rdparty/libprocess/src/../include -I/mesos/3rdparty/stout/include -isystem /usr/include/apr-1.0 -isystem /mesos/build/3rdparty/boost-1.53.0/src/boost-1.53.0 -isystem /mesos/build/3rdparty/elfio-3.2/src/elfio-3.2 -isystem /mesos/build/3rdparty/glog-0.3.3/src/glog-0.3.3-build/include -isystem /mesos/build/3rdparty/picojson-1.3.0/src/picojson-1.3.0 -isystem /mesos/build/3rdparty/protobuf-3.3.0/src/protobuf-3.3.0/src -isystem /usr/include/subversion-1 -isystem /mesos/build/3rdparty/http_parser-2.6.2/src/http_parser-2.6.2 -isystem /mesos/build/3rdparty/zookeeper-3.4.8/src/zookeeper-3.4.8/src/c/include -isystem /mesos/build/3rdparty/zookeeper-3.4.8/src/zookeeper-3.4.8/src/c/generated -isystem /mesos/build/3rdparty/nvml-352.79/src/nvml-352.79 -isystem /mesos/build/3rdparty/leveldb-1.19/src/leveldb-1.19/include -isystem /mesos/build/3rdparty/googletest-1.8.0/src/googletest-1.8.0/googlemock/include -isystem /mesos/build/3rdparty/googletest-1.8.0/src/googletest-1.8.0/googletest/include  -std=c++11 -Wformat-security -fstack-protector -fPIE   -o CMakeFiles/mesos-tests.dir/default_executor_tests.cpp.o -c /mesos/src/tests/default_executor_tests.cpp
/mesos/src/tests/command_executor_tests.cpp:502:1: fatal error: error writing to /tmp/cc4NI5UB.s: No space left on device
 } // namespace mesos {
 ^
compilation terminated.
/mesos/src/tests/authentication_tests.cpp:884:1: fatal error: error writing to /tmp/cc2Fd4gW.s: No space left on device
 } // namespace mesos {
 ^
compilation terminated.
/mesos/src/tests/check_tests.cpp:2939:1: fatal error: error writing to /tmp/cc4CPSbL.s: No space left on device
 } // namespace mesos {
 ^
compilation terminated.
[ 85%] Building CXX object src/tests/CMakeFiles/mesos-tests.dir/exception_tests.cpp.o
cd /mesos/build/src/tests && /usr/bin/g++  -DBUILD_DIR=\"/mesos/build\" -DBUILD_FLAGS=\"\" -DBUILD_JAVA_JVM_LIBRARY=\"\" -DHAS_AUTHENTICATION=1 -DHAVE_LIBZ -DLIBDIR=\"/usr/local/libmesos\" -DPICOJSON_USE_INT64 -DPKGDATADIR=\"/usr/local/share/mesos\" -DPKGLIBEXECDIR=\"/usr/local/libexec/mesos\" -DPKGMODULEDIR=\"\" -DSBINDIR=\"\" -DSOURCE_DIR=\"/mesos\" -DTESTLIBEXECDIR=\"\" -DUSE_CMAKE_BUILD_CONFIG -DUSE_SSL_SOCKET=1 -DUSE_STATIC_LIB -DVERSION=\"1.5.0\" -DZOOKEEPER_VERSION=\"3.4.8\" -D__STDC_FORMAT_MACROS -I/mesos/include -I/mesos/build/include -I/mesos/build/include/mesos -I/mesos/build/src -I/mesos/src -I/mesos/3rdparty/libprocess/src/../include -I/mesos/3rdparty/stout/include -isystem /usr/include/apr-1.0 -isystem /mesos/build/3rdparty/boost-1.53.0/src/boost-1.53.0 -isystem /mesos/build/3rdparty/elfio-3.2/src/elfio-3.2 -isystem /mesos/build/3rdparty/glog-0.3.3/src/glog-0.3.3-build/include -isystem /mesos/build/3rdparty/picojson-1.3.0/src/picojson-1.3.0 -isystem /mesos/build/3rdparty/protobuf-3.3.0/src/protobuf-3.3.0/src -isystem /usr/include/subversion-1 -isystem /mesos/build/3rdparty/http_parser-2.6.2/src/http_parser-2.6.2 -isystem /mesos/build/3rdparty/zookeeper-3.4.8/src/zookeeper-3.4.8/src/c/include -isystem /mesos/build/3rdparty/zookeeper-3.4.8/src/zookeeper-3.4.8/src/c/generated -isystem /mesos/build/3rdparty/nvml-352.79/src/nvml-352.79 -isystem /mesos/build/3rdparty/leveldb-1.19/src/leveldb-1.19/include -isystem /mesos/build/3rdparty/googletest-1.8.0/src/googletest-1.8.0/googlemock/include -isystem /mesos/build/3rdparty/googletest-1.8.0/src/googletest-1.8.0/googletest/include  -std=c++11 -Wformat-security -fstack-protector -fPIE   -o CMakeFiles/mesos-tests.dir/exception_tests.cpp.o -c /mesos/src/tests/exception_tests.cpp
[ 85%] Building CXX object src/tests/CMakeFiles/mesos-tests.dir/executor_http_api_tests.cpp.o
cd /mesos/build/src/tests && /usr/bin/g++  -DBUILD_DIR=\"/mesos/build\" -DBUILD_FLAGS=\"\" -DBUILD_JAVA_JVM_LIBRARY=\"\" -DHAS_AUTHENTICATION=1 -DHAVE_LIBZ -DLIBDIR=\"/usr/local/libmesos\" -DPICOJSON_USE_INT64 -DPKGDATADIR=\"/usr/local/share/mesos\" -DPKGLIBEXECDIR=\"/usr/local/libexec/mesos\" -DPKGMODULEDIR=\"\" -DSBINDIR=\"\" -DSOURCE_DIR=\"/mesos\" -DTESTLIBEXECDIR=\"\" -DUSE_CMAKE_BUILD_CONFIG -DUSE_SSL_SOCKET=1 -DUSE_STATIC_LIB -DVERSION=\"1.5.0\" -DZOOKEEPER_VERSION=\"3.4.8\" -D__STDC_FORMAT_MACROS -I/mesos/include -I/mesos/build/include -I/mesos/build/include/mesos -I/mesos/build/src -I/mesos/src -I/mesos/3rdparty/libprocess/src/../include -I/mesos/3rdparty/stout/include -isystem /usr/include/apr-1.0 -isystem /mesos/build/3rdparty/boost-1.53.0/src/boost-1.53.0 -isystem /mesos/build/3rdparty/elfio-3.2/src/elfio-3.2 -isystem /mesos/build/3rdparty/glog-0.3.3/src/glog-0.3.3-build/include -isystem /mesos/build/3rdparty/picojson-1.3.0/src/picojson-1.3.0 -isystem /mesos/build/3rdparty/protobuf-3.3.0/src/protobuf-3.3.0/src -isystem /usr/include/subversion-1 -isystem /mesos/build/3rdparty/http_parser-2.6.2/src/http_parser-2.6.2 -isystem /mesos/build/3rdparty/zookeeper-3.4.8/src/zookeeper-3.4.8/src/c/include -isystem /mesos/build/3rdparty/zookeeper-3.4.8/src/zookeeper-3.4.8/src/c/generated -isystem /mesos/build/3rdparty/nvml-352.79/src/nvml-352.79 -isystem /mesos/build/3rdparty/leveldb-1.19/src/leveldb-1.19/include -isystem /mesos/build/3rdparty/googletest-1.8.0/src/googletest-1.8.0/googlemock/include -isystem /mesos/build/3rdparty/googletest-1.8.0/src/googletest-1.8.0/googletest/include  -std=c++11 -Wformat-security -fstack-protector -fPIE   -o CMakeFiles/mesos-tests.dir/executor_http_api_tests.cpp.o -c /mesos/src/tests/executor_http_api_tests.cpp
The bug is not reproducible, so it is likely a hardware or OS problem.
make[3]: *** [src/tests/CMakeFiles/mesos-tests.dir/command_executor_tests.cpp.o] Error 1
make[3]: *** Waiting for unfinished jobs....
The bug is not reproducible, so it is likely a hardware or OS problem.
make[3]: *** [src/tests/CMakeFiles/mesos-tests.dir/check_tests.cpp.o] Error 1
The bug is not reproducible, so it is likely a hardware or OS problem.
make[3]: *** [src/tests/CMakeFiles/mesos-tests.dir/authentication_tests.cpp.o] Error 1
make[3]: Leaving directory `/mesos/build'
make[2]: Leaving directory `/mesos/build'
make[2]: *** [src/tests/CMakeFiles/mesos-tests.dir/all] Error 2
make[1]: *** [CMakeFiles/check.dir/rule] Error 2
make[1]: Leaving directory `/mesos/build'
make: *** [check] Error 2
+ docker rmi mesos-1506042512-716
Untagged: mesos-1506042512-716:latest
Deleted: sha256:10971cf9d3fd4c3512236fbd79b7cdbd94f7a987d58ae4419b66cc61d15454c3
Deleted: sha256:da2d7b8497da2e4967a693f68495c1a61dfc7ed7c58419145136c6d7edb8fc33
Deleted: sha256:f5a7fcbda3daac6beef4a8a0fdff5d2fcf22019e283c5823b32301b1b82c8106
Deleted: sha256:6a94a6b80d5ccc13f9317f42b07c0502fa99d0043b5265eace64b5200d26698e
Deleted: sha256:e4229968841cd8f4a8828a621db607afb7c45bed2bb6b3fa0abe0654fd16a694
Deleted: sha256:153eeec2b93807ea2b9df318c0d5223ea09c5ea075da93c50d99511166a2d2e6
Deleted: sha256:c60162dd4b0055111293f9bee42dc0634a120a4404d20a5c8537bf10e653dfe0
Deleted: sha256:60c75bb9c41ffb56cb9a16ab7ae3f645b7dd267439a7d8112e22426dc04743ff
Deleted: sha256:a98686eff4252eef712d1ccec6ec985e82cb6a4e692c93bab98a50acc8b6cc58
Deleted: sha256:a90abce32dfa6e44c1310940654b4b95c665f3598d544739dfbeec477c15b055
Deleted: sha256:cbb67f2165bff7f934ec5d179f0a0e53837bf581911bb2807da8a83f3b8a9641
Deleted: sha256:14eafaac60b82088df0918370b407f03ae6eba600bcce338a8f32fc0a07eaf34
Deleted: sha256:81864a0b9a11b8820a6791e404e4781fd290c953a980e5598a904720b8b2b35a
Deleted: sha256:7c9d7c92151f51c73e1f460fe110b1debaeadd42abae82315c804a9f9a32e2a5
Deleted: sha256:71ec2ec2947c3b80a0e6b84cf0ec15e2a23f4314ccca7e31f1b39b014e9a1053
Deleted: sha256:0f6740525a0b975429934e49293d5b63acb92136f64dde03d44b5eac0e886a8a
Deleted: sha256:efc76f9c9d789367ea0d558c575c01f2fa4d077b5d77016d228c989784e0cd83
Deleted: sha256:0fce01b29f6b81968ac6e89b9f6c0d8577b1a065f73b441264cdc7b434b3201e
Deleted: sha256:14a91f68816d860cbc83cf5b342e5f3ba4318cb69d9010a2035188813b724376
Deleted: sha256:82bacbb2aec6770cd5313262ee532f6e82733098c7aa25f07467f80fbf5cc6d7
Deleted: sha256:520363a8cc49afdf1f4d3907290e6da28160b5fa11af3de159811d88109c58b2
Deleted: sha256:d7d96b5791004e17e055837be6e83caa1be784d8f9c54587ea82eac27be5ef41
Deleted: sha256:a185de504cf3f61cd3019f6393524e9426fcd1b033dbbe4a2e67a0b200ac761b
Deleted: sha256:b622aad47e239ef7ccc95b879af5c4c8703050de8059cd57e299a0051450044e
Deleted: sha256:83142faf1e59351afb988e0845c7e17558da2ad3cda73a79dee2a7d39de15278
Deleted: sha256:ea8cf9b5c625e68f6929b3b1ea3a725fd3bfa0a87491bd6e0ed9ff991fc7c991
Deleted: sha256:646f29a8bd7847a8f9c5be28a4db76e826497cdaee1e51e00fff8afe7fbbf8ee
Deleted: sha256:95c4ad2eac949c65445053f97e64ac176d26cc1c1e43058bb31f4c69299f4d00
Build step 'Execute shell' marked build as failure

Mime
View raw message