mesos-builds mailing list archives

Site index · List index
Message view « Date » · « Thread »
Top « Date » · « Thread »
From Apache Jenkins Server <jenk...@builds.apache.org>
Subject Build failed in Jenkins: Mesos-Buildbot » autotools,clang,--verbose --enable-libevent --enable-ssl,GLOG_v=1 MESOS_VERBOSE=1,ubuntu:14.04,(ubuntu)&&(!ubuntu-us1)&&(!ubuntu-eu2)&&(!qnode3)&&(!H23) #4227
Date Fri, 15 Sep 2017 12:59:10 GMT
See <https://builds.apache.org/job/Mesos-Buildbot/BUILDTOOL=autotools,COMPILER=clang,CONFIGURATION=--verbose%20--enable-libevent%20--enable-ssl,ENVIRONMENT=GLOG_v=1%20MESOS_VERBOSE=1,OS=ubuntu%3A14.04,label_exp=(ubuntu)&&(!ubuntu-us1)&&(!ubuntu-eu2)&&(!qnode3)&&(!H23)/4227/display/redirect>

------------------------------------------
[...truncated 32.56 MB...]
I0915 12:59:01.540338 27974 credentials.hpp:86] Loading credential for authentication from
'/tmp/Endpoint_SlaveEndpointTest_UnauthorizedRequest_0_1f7rr1/credential'
I0915 12:59:01.540684 27974 slave.cpp:285] Agent using credential for: test-principal
I0915 12:59:01.540733 27974 credentials.hpp:37] Loading credentials for authentication from
'/tmp/Endpoint_SlaveEndpointTest_UnauthorizedRequest_0_1f7rr1/http_credentials'
I0915 12:59:01.541424 27974 http.cpp:1045] Creating default 'basic' HTTP authenticator for
realm 'mesos-agent-executor'
I0915 12:59:01.541664 27974 http.cpp:1066] Creating default 'jwt' HTTP authenticator for realm
'mesos-agent-executor'
I0915 12:59:01.542007 27974 http.cpp:1045] Creating default 'basic' HTTP authenticator for
realm 'mesos-agent-readonly'
I0915 12:59:01.542155 27974 http.cpp:1066] Creating default 'jwt' HTTP authenticator for realm
'mesos-agent-readonly'
I0915 12:59:01.542462 27974 http.cpp:1045] Creating default 'basic' HTTP authenticator for
realm 'mesos-agent-readwrite'
I0915 12:59:01.542562 27974 http.cpp:1066] Creating default 'jwt' HTTP authenticator for realm
'mesos-agent-readwrite'
I0915 12:59:01.544831 27974 slave.cpp:583] Agent resources: [{"name":"cpus","scalar":{"value":2.0},"type":"SCALAR"},{"name":"mem","scalar":{"value":1024.0},"type":"SCALAR"},{"name":"disk","scalar":{"value":1024.0},"type":"SCALAR"},{"name":"ports","ranges":{"range":[{"begin":31000,"end":32000}]},"type":"RANGES"}]
I0915 12:59:01.545212 27974 slave.cpp:591] Agent attributes: [  ]
I0915 12:59:01.545243 27974 slave.cpp:600] Agent hostname: adce9827d74a
I0915 12:59:01.545465 27980 status_update_manager.cpp:177] Pausing sending status updates
I0915 12:59:01.547251 27973 state.cpp:64] Recovering state from '/tmp/Endpoint_SlaveEndpointTest_UnauthorizedRequest_0_uznNvz/meta'
I0915 12:59:01.547543 27968 status_update_manager.cpp:203] Recovering status update manager
I0915 12:59:01.547813 27985 containerizer.cpp:648] Recovering containerizer
I0915 12:59:01.549271 27981 provisioner.cpp:416] Provisioner recovery complete
I0915 12:59:01.549706 27977 slave.cpp:6298] Finished recovery
I0915 12:59:01.550215 27977 slave.cpp:6480] Querying resource estimator for oversubscribable
resources
I0915 12:59:01.550489 27978 slave.cpp:6494] Received oversubscribable resources {} from the
resource estimator
I0915 12:59:01.552573 27965 process.cpp:3929] Handling HTTP event for process 'slave(817)'
with path: '/slave(817)/monitor/statistics'
I0915 12:59:01.554610 27981 http.cpp:1185] HTTP GET for /slave(817)/monitor/statistics from
172.17.0.3:35146
I0915 12:59:01.554692 27981 http.cpp:976] Authorizing principal 'test-principal' to GET the
'/monitor/statistics' endpoint
I0915 12:59:01.556740  6909 slave.cpp:861] Agent terminating
[       OK ] Endpoint/SlaveEndpointTest.UnauthorizedRequest/0 (31 ms)
[ RUN      ] Endpoint/SlaveEndpointTest.UnauthorizedRequest/1
I0915 12:59:01.566987  6909 containerizer.cpp:292] Using isolation { environment_secret, posix/cpu,
posix/mem, filesystem/posix, network/cni }
W0915 12:59:01.567453  6909 backend.cpp:76] Failed to create 'aufs' backend: AufsBackend requires
root privileges
W0915 12:59:01.567564  6909 backend.cpp:76] Failed to create 'bind' backend: BindBackend requires
root privileges
I0915 12:59:01.567595  6909 provisioner.cpp:255] Using default backend 'copy'
I0915 12:59:01.570776 27976 slave.cpp:252] Mesos agent started on (818)@172.17.0.3:41746
I0915 12:59:01.570816 27976 slave.cpp:253] Flags at startup: --acls="" --appc_simple_discovery_uri_prefix="http://"
--appc_store_dir="/tmp/Endpoint_SlaveEndpointTest_UnauthorizedRequest_1_VrvnqP/store/appc"
--authenticate_http_executors="true" --authenticate_http_readonly="true" --authenticate_http_readwrite="true"
--authenticatee="crammd5" --authentication_backoff_factor="1secs" --authorizer="local" --cgroups_cpu_enable_pids_and_tids_count="false"
--cgroups_enable_cfs="false" --cgroups_hierarchy="/sys/fs/cgroup" --cgroups_limit_swap="false"
--cgroups_root="mesos" --container_disk_watch_interval="15secs" --containerizers="mesos" --credential="/tmp/Endpoint_SlaveEndpointTest_UnauthorizedRequest_1_VrvnqP/credential"
--default_role="*" --disallow_sharing_agent_pid_namespace="false" --disk_watch_interval="1mins"
--docker="docker" --docker_kill_orphans="true" --docker_registry="https://registry-1.docker.io"
--docker_remove_delay="6hrs" --docker_socket="/var/run/docker.sock" --docker_stop_timeout="0ns"
--docker_store_dir="/tmp/Endpoint_SlaveEndpointTest_UnauthorizedRequest_1_VrvnqP/store/docker"
--docker_volume_checkpoint_dir="/var/run/mesos/isolators/docker/volume" --enforce_container_disk_quota="false"
--executor_registration_timeout="1mins" --executor_reregistration_timeout="2secs" --executor_secret_key="/tmp/Endpoint_SlaveEndpointTest_UnauthorizedRequest_1_VrvnqP/executor_secret_key"
--executor_shutdown_grace_period="5secs" --fetcher_cache_dir="/tmp/Endpoint_SlaveEndpointTest_UnauthorizedRequest_1_VrvnqP/fetch"
--fetcher_cache_size="2GB" --frameworks_home="" --gc_delay="1weeks" --gc_disk_headroom="0.1"
--hadoop_home="" --help="false" --hostname_lookup="true" --http_command_executor="false" --http_credentials="/tmp/Endpoint_SlaveEndpointTest_UnauthorizedRequest_1_VrvnqP/http_credentials"
--http_heartbeat_interval="30secs" --initialize_driver_logging="true" --isolation="posix/cpu,posix/mem"
--launcher="posix" --launcher_dir="/mesos/mesos-1.5.0/_build/src" --logbufsecs="0" --logging_level="INFO"
--max_completed_executors_per_framework="150" --oversubscribed_resources_interval="15secs"
--perf_duration="10secs" --perf_interval="1mins" --port="5051" --qos_correction_interval_min="0ns"
--quiet="false" --recover="reconnect" --recovery_timeout="15mins" --registration_backoff_factor="10ms"
--resources="cpus:2;gpus:0;mem:1024;disk:1024;ports:[31000-32000]" --revocable_cpu_low_priority="true"
--runtime_dir="/tmp/Endpoint_SlaveEndpointTest_UnauthorizedRequest_1_VrvnqP" --sandbox_directory="/mnt/mesos/sandbox"
--strict="true" --switch_user="true" --systemd_enable_support="true" --systemd_runtime_directory="/run/systemd/system"
--version="false" --work_dir="/tmp/Endpoint_SlaveEndpointTest_UnauthorizedRequest_1_G9d2pn"
--zk_session_timeout="10secs"
I0915 12:59:01.571198 27976 credentials.hpp:86] Loading credential for authentication from
'/tmp/Endpoint_SlaveEndpointTest_UnauthorizedRequest_1_VrvnqP/credential'
I0915 12:59:01.571358 27976 slave.cpp:285] Agent using credential for: test-principal
I0915 12:59:01.571379 27976 credentials.hpp:37] Loading credentials for authentication from
'/tmp/Endpoint_SlaveEndpointTest_UnauthorizedRequest_1_VrvnqP/http_credentials'
I0915 12:59:01.571655 27976 http.cpp:1045] Creating default 'basic' HTTP authenticator for
realm 'mesos-agent-executor'
I0915 12:59:01.571789 27976 http.cpp:1066] Creating default 'jwt' HTTP authenticator for realm
'mesos-agent-executor'
I0915 12:59:01.572012 27976 http.cpp:1045] Creating default 'basic' HTTP authenticator for
realm 'mesos-agent-readonly'
I0915 12:59:01.572145 27976 http.cpp:1066] Creating default 'jwt' HTTP authenticator for realm
'mesos-agent-readonly'
I0915 12:59:01.572337 27976 http.cpp:1045] Creating default 'basic' HTTP authenticator for
realm 'mesos-agent-readwrite'
I0915 12:59:01.572439 27976 http.cpp:1066] Creating default 'jwt' HTTP authenticator for realm
'mesos-agent-readwrite'
I0915 12:59:01.573904 27976 slave.cpp:583] Agent resources: [{"name":"cpus","scalar":{"value":2.0},"type":"SCALAR"},{"name":"mem","scalar":{"value":1024.0},"type":"SCALAR"},{"name":"disk","scalar":{"value":1024.0},"type":"SCALAR"},{"name":"ports","ranges":{"range":[{"begin":31000,"end":32000}]},"type":"RANGES"}]
I0915 12:59:01.574148 27976 slave.cpp:591] Agent attributes: [  ]
I0915 12:59:01.574164 27976 slave.cpp:600] Agent hostname: adce9827d74a
I0915 12:59:01.574312 27980 status_update_manager.cpp:177] Pausing sending status updates
I0915 12:59:01.575732 27983 state.cpp:64] Recovering state from '/tmp/Endpoint_SlaveEndpointTest_UnauthorizedRequest_1_G9d2pn/meta'
I0915 12:59:01.576012 27970 status_update_manager.cpp:203] Recovering status update manager
I0915 12:59:01.576197 27970 containerizer.cpp:648] Recovering containerizer
I0915 12:59:01.577517 27974 provisioner.cpp:416] Provisioner recovery complete
I0915 12:59:01.577890 27967 slave.cpp:6298] Finished recovery
I0915 12:59:01.578764 27967 slave.cpp:6480] Querying resource estimator for oversubscribable
resources
I0915 12:59:01.579174 27978 slave.cpp:6494] Received oversubscribable resources {} from the
resource estimator
I0915 12:59:01.581321 27985 process.cpp:3929] Handling HTTP event for process 'slave(818)'
with path: '/slave(818)/monitor/statistics.json'
I0915 12:59:01.583032 27974 http.cpp:1185] HTTP GET for /slave(818)/monitor/statistics.json
from 172.17.0.3:35148
I0915 12:59:01.583103 27974 http.cpp:976] Authorizing principal 'test-principal' to GET the
'/monitor/statistics.json' endpoint
I0915 12:59:01.585327  6909 slave.cpp:861] Agent terminating
[       OK ] Endpoint/SlaveEndpointTest.UnauthorizedRequest/1 (31 ms)
[ RUN      ] Endpoint/SlaveEndpointTest.UnauthorizedRequest/2
I0915 12:59:01.599105  6909 containerizer.cpp:292] Using isolation { environment_secret, posix/cpu,
posix/mem, filesystem/posix, network/cni }
W0915 12:59:01.599565  6909 backend.cpp:76] Failed to create 'aufs' backend: AufsBackend requires
root privileges
W0915 12:59:01.599666  6909 backend.cpp:76] Failed to create 'bind' backend: BindBackend requires
root privileges
I0915 12:59:01.599699  6909 provisioner.cpp:255] Using default backend 'copy'
I0915 12:59:01.603864 27985 slave.cpp:252] Mesos agent started on (819)@172.17.0.3:41746
I0915 12:59:01.603917 27985 slave.cpp:253] Flags at startup: --acls="" --appc_simple_discovery_uri_prefix="http://"
--appc_store_dir="/tmp/Endpoint_SlaveEndpointTest_UnauthorizedRequest_2_VFWJHD/store/appc"
--authenticate_http_executors="true" --authenticate_http_readonly="true" --authenticate_http_readwrite="true"
--authenticatee="crammd5" --authentication_backoff_factor="1secs" --authorizer="local" --cgroups_cpu_enable_pids_and_tids_count="false"
--cgroups_enable_cfs="false" --cgroups_hierarchy="/sys/fs/cgroup" --cgroups_limit_swap="false"
--cgroups_root="mesos" --container_disk_watch_interval="15secs" --containerizers="mesos" --credential="/tmp/Endpoint_SlaveEndpointTest_UnauthorizedRequest_2_VFWJHD/credential"
--default_role="*" --disallow_sharing_agent_pid_namespace="false" --disk_watch_interval="1mins"
--docker="docker" --docker_kill_orphans="true" --docker_registry="https://registry-1.docker.io"
--docker_remove_delay="6hrs" --docker_socket="/var/run/docker.sock" --docker_stop_timeout="0ns"
--docker_store_dir="/tmp/Endpoint_SlaveEndpointTest_UnauthorizedRequest_2_VFWJHD/store/docker"
--docker_volume_checkpoint_dir="/var/run/mesos/isolators/docker/volume" --enforce_container_disk_quota="false"
--executor_registration_timeout="1mins" --executor_reregistration_timeout="2secs" --executor_secret_key="/tmp/Endpoint_SlaveEndpointTest_UnauthorizedRequest_2_VFWJHD/executor_secret_key"
--executor_shutdown_grace_period="5secs" --fetcher_cache_dir="/tmp/Endpoint_SlaveEndpointTest_UnauthorizedRequest_2_VFWJHD/fetch"
--fetcher_cache_size="2GB" --frameworks_home="" --gc_delay="1weeks" --gc_disk_headroom="0.1"
--hadoop_home="" --help="false" --hostname_lookup="true" --http_command_executor="false" --http_credentials="/tmp/Endpoint_SlaveEndpointTest_UnauthorizedRequest_2_VFWJHD/http_credentials"
--http_heartbeat_interval="30secs" --initialize_driver_logging="true" --isolation="posix/cpu,posix/mem"
--launcher="posix" --launcher_dir="/mesos/mesos-1.5.0/_build/src" --logbufsecs="0" --logging_level="INFO"
--max_completed_executors_per_framework="150" --oversubscribed_resources_interval="15secs"
--perf_duration="10secs" --perf_interval="1mins" --port="5051" --qos_correction_interval_min="0ns"
--quiet="false" --recover="reconnect" --recovery_timeout="15mins" --registration_backoff_factor="10ms"
--resources="cpus:2;gpus:0;mem:1024;disk:1024;ports:[31000-32000]" --revocable_cpu_low_priority="true"
--runtime_dir="/tmp/Endpoint_SlaveEndpointTest_UnauthorizedRequest_2_VFWJHD" --sandbox_directory="/mnt/mesos/sandbox"
--strict="true" --switch_user="true" --systemd_enable_support="true" --systemd_runtime_directory="/run/systemd/system"
--version="false" --work_dir="/tmp/Endpoint_SlaveEndpointTest_UnauthorizedRequest_2_GHJDCb"
--zk_session_timeout="10secs"
I0915 12:59:01.604557 27985 credentials.hpp:86] Loading credential for authentication from
'/tmp/Endpoint_SlaveEndpointTest_UnauthorizedRequest_2_VFWJHD/credential'
I0915 12:59:01.604832 27985 slave.cpp:285] Agent using credential for: test-principal
I0915 12:59:01.604866 27985 credentials.hpp:37] Loading credentials for authentication from
'/tmp/Endpoint_SlaveEndpointTest_UnauthorizedRequest_2_VFWJHD/http_credentials'
I0915 12:59:01.605294 27985 http.cpp:1045] Creating default 'basic' HTTP authenticator for
realm 'mesos-agent-executor'
I0915 12:59:01.605469 27985 http.cpp:1066] Creating default 'jwt' HTTP authenticator for realm
'mesos-agent-executor'
I0915 12:59:01.605784 27985 http.cpp:1045] Creating default 'basic' HTTP authenticator for
realm 'mesos-agent-readonly'
I0915 12:59:01.605962 27985 http.cpp:1066] Creating default 'jwt' HTTP authenticator for realm
'mesos-agent-readonly'
I0915 12:59:01.606207 27985 http.cpp:1045] Creating default 'basic' HTTP authenticator for
realm 'mesos-agent-readwrite'
I0915 12:59:01.606348 27985 http.cpp:1066] Creating default 'jwt' HTTP authenticator for realm
'mesos-agent-readwrite'
I0915 12:59:01.608120 27985 slave.cpp:583] Agent resources: [{"name":"cpus","scalar":{"value":2.0},"type":"SCALAR"},{"name":"mem","scalar":{"value":1024.0},"type":"SCALAR"},{"name":"disk","scalar":{"value":1024.0},"type":"SCALAR"},{"name":"ports","ranges":{"range":[{"begin":31000,"end":32000}]},"type":"RANGES"}]
I0915 12:59:01.608392 27985 slave.cpp:591] Agent attributes: [  ]
I0915 12:59:01.608418 27985 slave.cpp:600] Agent hostname: adce9827d74a
I0915 12:59:01.608561 27983 status_update_manager.cpp:177] Pausing sending status updates
I0915 12:59:01.610738 27981 state.cpp:64] Recovering state from '/tmp/Endpoint_SlaveEndpointTest_UnauthorizedRequest_2_GHJDCb/meta'
I0915 12:59:01.611093 27966 status_update_manager.cpp:203] Recovering status update manager
I0915 12:59:01.611412 27971 containerizer.cpp:648] Recovering containerizer
I0915 12:59:01.613088 27969 provisioner.cpp:416] Provisioner recovery complete
I0915 12:59:01.613464 27987 slave.cpp:6298] Finished recovery
I0915 12:59:01.614017 27987 slave.cpp:6480] Querying resource estimator for oversubscribable
resources
I0915 12:59:01.614264 27975 slave.cpp:6494] Received oversubscribable resources {} from the
resource estimator
I0915 12:59:01.616510 27988 process.cpp:3929] Handling HTTP event for process 'slave(819)'
with path: '/slave(819)/containers'
I0915 12:59:01.618386 27983 http.cpp:1185] HTTP GET for /slave(819)/containers from 172.17.0.3:35150
I0915 12:59:01.618458 27983 http.cpp:976] Authorizing principal 'test-principal' to GET the
'/containers' endpoint
I0915 12:59:01.621078  6909 slave.cpp:861] Agent terminating
[       OK ] Endpoint/SlaveEndpointTest.UnauthorizedRequest/2 (35 ms)
[ RUN      ] Endpoint/SlaveEndpointTest.NoAuthorizer/0
I0915 12:59:01.634681  6909 containerizer.cpp:292] Using isolation { environment_secret, posix/cpu,
posix/mem, filesystem/posix, network/cni }
W0915 12:59:01.635224  6909 backend.cpp:76] Failed to create 'aufs' backend: AufsBackend requires
root privileges
W0915 12:59:01.635341  6909 backend.cpp:76] Failed to create 'bind' backend: BindBackend requires
root privileges
I0915 12:59:01.635385  6909 provisioner.cpp:255] Using default backend 'copy'
I0915 12:59:01.637050  6909 cluster.cpp:448] Creating default 'local' authorizer
I0915 12:59:01.639032 27972 slave.cpp:252] Mesos agent started on (820)@172.17.0.3:41746
I0915 12:59:01.639075 27972 slave.cpp:253] Flags at startup: --acls="" --appc_simple_discovery_uri_prefix="http://"
--appc_store_dir="/tmp/Endpoint_SlaveEndpointTest_NoAuthorizer_0_Hwl5js/store/appc" --authenticate_http_executors="true"
--authenticate_http_readonly="true" --authenticate_http_readwrite="true" --authenticatee="crammd5"
--authentication_backoff_factor="1secs" --authorizer="local" --cgroups_cpu_enable_pids_and_tids_count="false"
--cgroups_enable_cfs="false" --cgroups_hierarchy="/sys/fs/cgroup" --cgroups_limit_swap="false"
--cgroups_root="mesos" --container_disk_watch_interval="15secs" --containerizers="mesos" --credential="/tmp/Endpoint_SlaveEndpointTest_NoAuthorizer_0_Hwl5js/credential"
--default_role="*" --disallow_sharing_agent_pid_namespace="false" --disk_watch_interval="1mins"
--docker="docker" --docker_kill_orphans="true" --docker_registry="https://registry-1.docker.io"
--docker_remove_delay="6hrs" --docker_socket="/var/run/docker.sock" --docker_stop_timeout="0ns"
--docker_store_dir="/tmp/Endpoint_SlaveEndpointTest_NoAuthorizer_0_Hwl5js/store/docker" --docker_volume_checkpoint_dir="/var/run/mesos/isolators/docker/volume"
--enforce_container_disk_quota="false" --executor_registration_timeout="1mins" --executor_reregistration_timeout="2secs"
--executor_secret_key="/tmp/Endpoint_SlaveEndpointTest_NoAuthorizer_0_Hwl5js/executor_secret_key"
--executor_shutdown_grace_period="5secs" --fetcher_cache_dir="/tmp/Endpoint_SlaveEndpointTest_NoAuthorizer_0_Hwl5js/fetch"
--fetcher_cache_size="2GB" --frameworks_home="" --gc_delay="1weeks" --gc_disk_headroom="0.1"
--hadoop_home="" --help="false" --hostname_lookup="true" --http_command_executor="false" --http_credentials="/tmp/Endpoint_SlaveEndpointTest_NoAuthorizer_0_Hwl5js/http_credentials"
--http_heartbeat_interval="30secs" --initialize_driver_logging="true" --isolation="posix/cpu,posix/mem"
--launcher="posix" --launcher_dir="/mesos/mesos-1.5.0/_build/src" --logbufsecs="0" --logging_level="INFO"
--max_completed_executors_per_framework="150" --oversubscribed_resources_interval="15secs"
--perf_duration="10secs" --perf_interval="1mins" --port="5051" --qos_correction_interval_min="0ns"
--quiet="false" --recover="reconnect" --recovery_timeout="15mins" --registration_backoff_factor="10ms"
--resources="cpus:2;gpus:0;mem:1024;disk:1024;ports:[31000-32000]" --revocable_cpu_low_priority="true"
--runtime_dir="/tmp/Endpoint_SlaveEndpointTest_NoAuthorizer_0_Hwl5js" --sandbox_directory="/mnt/mesos/sandbox"
--strict="true" --switch_user="true" --systemd_enable_support="true" --systemd_runtime_directory="/run/systemd/system"
--version="false" --work_dir="/tmp/Endpoint_SlaveEndpointTest_NoAuthorizer_0_i8wK9Z" --zk_session_timeout="10secs"
I0915 12:59:01.639503 27972 credentials.hpp:86] Loading credential for authentication from
'/tmp/Endpoint_SlaveEndpointTest_NoAuthorizer_0_Hwl5js/credential'
I0915 12:59:01.639681 27972 slave.cpp:285] Agent using credential for: test-principal
I0915 12:59:01.639713 27972 credentials.hpp:37] Loading credentials for authentication from
'/tmp/Endpoint_SlaveEndpointTest_NoAuthorizer_0_Hwl5js/http_credentials'
I0915 12:59:01.640008 27972 http.cpp:1045] Creating default 'basic' HTTP authenticator for
realm 'mesos-agent-executor'
I0915 12:59:01.640157 27972 http.cpp:1066] Creating default 'jwt' HTTP authenticator for realm
'mesos-agent-executor'
I0915 12:59:01.640375 27972 http.cpp:1045] Creating default 'basic' HTTP authenticator for
realm 'mesos-agent-readonly'
I0915 12:59:01.640478 27972 http.cpp:1066] Creating default 'jwt' HTTP authenticator for realm
'mesos-agent-readonly'
I0915 12:59:01.640664 27972 http.cpp:1045] Creating default 'basic' HTTP authenticator for
realm 'mesos-agent-readwrite'
I0915 12:59:01.640765 27972 http.cpp:1066] Creating default 'jwt' HTTP authenticator for realm
'mesos-agent-readwrite'
I0915 12:59:01.642242 27972 slave.cpp:583] Agent resources: [{"name":"cpus","scalar":{"value":2.0},"type":"SCALAR"},{"name":"mem","scalar":{"value":1024.0},"type":"SCALAR"},{"name":"disk","scalar":{"value":1024.0},"type":"SCALAR"},{"name":"ports","ranges":{"range":[{"begin":31000,"end":32000}]},"type":"RANGES"}]
I0915 12:59:01.642463 27972 slave.cpp:591] Agent attributes: [  ]
I0915 12:59:01.642479 27972 slave.cpp:600] Agent hostname: adce9827d74a
I0915 12:59:01.642635 27978 status_update_manager.cpp:177] Pausing sending status updates
I0915 12:59:01.644140 27983 state.cpp:64] Recovering state from '/tmp/Endpoint_SlaveEndpointTest_NoAuthorizer_0_i8wK9Z/meta'
I0915 12:59:01.644517 27968 status_update_manager.cpp:203] Recovering status update manager
I0915 12:59:01.644691 27968 containerizer.cpp:648] Recovering containerizer
I0915 12:59:01.646103 27980 provisioner.cpp:416] Provisioner recovery complete
I0915 12:59:01.646597 27978 slave.cpp:6298] Finished recovery
I0915 12:59:01.647053 27978 slave.cpp:6480] Querying resource estimator for oversubscribable
resources
I0915 12:59:01.647317 27973 slave.cpp:6494] Received oversubscribable resources {} from the
resource estimator
I0915 12:59:01.649879 27969 process.cpp:3929] Handling HTTP event for process 'slave(820)'
with path: '/slave(820)/monitor/statistics'
I0915 12:59:01.652029 27971 http.cpp:1185] HTTP GET for /slave(820)/monitor/statistics from
172.17.0.3:35152
I0915 12:59:01.652114 27971 http.cpp:976] Authorizing principal 'test-principal' to GET the
'/monitor/statistics' endpoint
I0915 12:59:01.655254 27966 slave.cpp:861] Agent terminating
[       OK ] Endpoint/SlaveEndpointTest.NoAuthorizer/0 (32 ms)
[ RUN      ] Endpoint/SlaveEndpointTest.NoAuthorizer/1
I0915 12:59:01.668663  6909 containerizer.cpp:292] Using isolation { environment_secret, posix/cpu,
posix/mem, filesystem/posix, network/cni }
W0915 12:59:01.669445  6909 backend.cpp:76] Failed to create 'aufs' backend: AufsBackend requires
root privileges
W0915 12:59:01.669623  6909 backend.cpp:76] Failed to create 'bind' backend: BindBackend requires
root privileges
I0915 12:59:01.669677  6909 provisioner.cpp:255] Using default backend 'copy'
I0915 12:59:01.672700  6909 cluster.cpp:448] Creating default 'local' authorizer
I0915 12:59:01.676079 27968 slave.cpp:252] Mesos agent started on (821)@172.17.0.3:41746
I0915 12:59:01.676121 27968 slave.cpp:253] Flags at startup: --acls="" --appc_simple_discovery_uri_prefix="http://"
--appc_store_dir="/tmp/Endpoint_SlaveEndpointTest_NoAuthorizer_1_RAS5fh/store/appc" --authenticate_http_executors="true"
--authenticate_http_readonly="true" --authenticate_http_readwrite="true" --authenticatee="crammd5"
--authentication_backoff_factor="1secs" --authorizer="local" --cgroups_cpu_enable_pids_and_tids_count="false"
--cgroups_enable_cfs="false" --cgroups_hierarchy="/sys/fs/cgroup" --cgroups_limit_swap="false"
--cgroups_root="mesos" --container_disk_watch_interval="15secs" --containerizers="mesos" --credential="/tmp/Endpoint_SlaveEndpointTest_NoAuthorizer_1_RAS5fh/credential"
--default_role="*" --disallow_sharing_agent_pid_namespace="false" --disk_watch_interval="1mins"
--docker="docker" --docker_kill_orphans="true" --docker_registry="https://registry-1.docker.io"
--docker_remove_delay="6hrs" --docker_socket="/var/run/docker.sock" --docker_stop_timeout="0ns"
--docker_store_dir="/tmp/Endpoint_SlaveEndpointTest_NoAuthorizer_1_RAS5fh/store/docker" --docker_volume_checkpoint_dir="/var/run/mesos/isolators/docker/volume"
--enforce_container_disk_quota="false" --executor_registration_timeout="1mins" --executor_reregistration_timeout="2secs"
--executor_secret_key="/tmp/Endpoint_SlaveEndpointTest_NoAuthorizer_1_RAS5fh/executor_secret_key"
--executor_shutdown_grace_period="5secs" --fetcher_cache_dir="/tmp/Endpoint_SlaveEndpointTest_NoAuthorizer_1_RAS5fh/fetch"
--fetcher_cache_size="2GB" --frameworks_home="" --gc_delay="1weeks" --gc_disk_headroom="0.1"
--hadoop_home="" --help="false" --hostname_lookup="true" --http_command_executor="false" --http_credentials="/tmp/Endpoint_SlaveEndpointTest_NoAuthorizer_1_RAS5fh/http_credentials"
--http_heartbeat_interval="30secs" --initialize_driver_logging="true" --isolation="posix/cpu,posix/mem"
--launcher="posix" --launcher_dir="/mesos/mesos-1.5.0/_build/src" --logbufsecs="0" --logging_level="INFO"
--max_completed_executors_per_framework="150" --oversubscribed_resources_interval="15secs"
--perf_duration="10secs" --perf_interval="1mins" --port="5051" --qos_correction_interval_min="0ns"
--quiet="false" --recover="reconnect" --recovery_timeout="15mins" --registration_backoff_factor="10ms"
--resources="cpus:2;gpus:0;mem:1024;disk:1024;ports:[31000-32000]" --revocable_cpu_low_priority="true"
--runtime_dir="/tmp/Endpoint_SlaveEndpointTest_NoAuthorizer_1_RAS5fh" --sandbox_directory="/mnt/mesos/sandbox"
--strict="true" --switch_user="true" --systemd_enable_support="true" --systemd_runtime_directory="/run/systemd/system"
--version="false" --work_dir="/tmp/Endpoint_SlaveEndpointTest_NoAuthorizer_1_ELaR0O" --zk_session_timeout="10secs"
I0915 12:59:01.676479 27968 credentials.hpp:86] Loading credential for authentication from
'/tmp/Endpoint_SlaveEndpointTest_NoAuthorizer_1_RAS5fh/credential'
I0915 12:59:01.676637 27968 slave.cpp:285] Agent using credential for: test-principal
I0915 12:59:01.676663 27968 credentials.hpp:37] Loading credentials for authentication from
'/tmp/Endpoint_SlaveEndpointTest_NoAuthorizer_1_RAS5fh/http_credentials'
I0915 12:59:01.676936 27968 http.cpp:1045] Creating default 'basic' HTTP authenticator for
realm 'mesos-agent-executor'
I0915 12:59:01.677060 27968 http.cpp:1066] Creating default 'jwt' HTTP authenticator for realm
'mesos-agent-executor'
I0915 12:59:01.677261 27968 http.cpp:1045] Creating default 'basic' HTTP authenticator for
realm 'mesos-agent-readonly'
I0915 12:59:01.677361 27968 http.cpp:1066] Creating default 'jwt' HTTP authenticator for realm
'mesos-agent-readonly'
I0915 12:59:01.677541 27968 http.cpp:1045] Creating default 'basic' HTTP authenticator for
realm 'mesos-agent-readwrite'
I0915 12:59:01.677641 27968 http.cpp:1066] Creating default 'jwt' HTTP authenticator for realm
'mesos-agent-readwrite'
I0915 12:59:01.679455 27968 slave.cpp:583] Agent resources: [{"name":"cpus","scalar":{"value":2.0},"type":"SCALAR"},{"name":"mem","scalar":{"value":1024.0},"type":"SCALAR"},{"name":"disk","scalar":{"value":1024.0},"type":"SCALAR"},{"name":"ports","ranges":{"range":[{"begin":31000,"end":32000}]},"type":"RANGES"}]
I0915 12:59:01.679746 27968 slave.cpp:591] Agent attributes: [  ]
I0915 12:59:01.679764 27968 slave.cpp:600] Agent hostname: adce9827d74a
I0915 12:59:01.679972 27979 status_update_manager.cpp:177] Pausing sending status updates
I0915 12:59:01.682271 27980 state.cpp:64] Recovering state from '/tmp/Endpoint_SlaveEndpointTest_NoAuthorizer_1_ELaR0O/meta'
I0915 12:59:01.682731 27966 status_update_manager.cpp:203] Recovering status update manager
I0915 12:59:01.682981 27966 containerizer.cpp:648] Recovering containerizer
I0915 12:59:01.684648 27987 provisioner.cpp:416] Provisioner recovery complete
I0915 12:59:01.685169 27970 slave.cpp:6298] Finished recovery
I0915 12:59:01.685694 27970 slave.cpp:6480] Querying resource estimator for oversubscribable
resources
I0915 12:59:01.686033 27969 slave.cpp:6494] Received oversubscribable resources {} from the
resource estimator
I0915 12:59:01.688516 27973 process.cpp:3929] Handling HTTP event for process 'slave(821)'
with path: '/slave(821)/monitor/statistics.json'
I0915 12:59:01.691242 27987 http.cpp:1185] HTTP GET for /slave(821)/monitor/statistics.json
from 172.17.0.3:35154
I0915 12:59:01.691328 27987 http.cpp:976] Authorizing principal 'test-principal' to GET the
'/monitor/statistics.json' endpoint
I0915 12:59:01.694787 27968 slave.cpp:861] Agent terminating
[       OK ] Endpoint/SlaveEndpointTest.NoAuthorizer/1 (41 ms)
[ RUN      ] Endpoint/SlaveEndpointTest.NoAuthorizer/2
I0915 12:59:01.710100  6909 containerizer.cpp:292] Using isolation { environment_secret, posix/cpu,
posix/mem, filesystem/posix, network/cni }
W0915 12:59:01.710670  6909 backend.cpp:76] Failed to create 'aufs' backend: AufsBackend requires
root privileges
W0915 12:59:01.710808  6909 backend.cpp:76] Failed to create 'bind' backend: BindBackend requires
root privileges
I0915 12:59:01.710860  6909 provisioner.cpp:255] Using default backend 'copy'
I0915 12:59:01.712865  6909 cluster.cpp:448] Creating default 'local' authorizer
I0915 12:59:01.717713 27975 slave.cpp:252] Mesos agent started on (822)@172.17.0.3:41746
I0915 12:59:01.717782 27975 slave.cpp:253] Flags at startup: --acls="" --appc_simple_discovery_uri_prefix="http://"
--appc_store_dir="/tmp/Endpoint_SlaveEndpointTest_NoAuthorizer_2_ZK3uA6/store/appc" --authenticate_http_executors="true"
--authenticate_http_readonly="true" --authenticate_http_readwrite="true" --authenticatee="crammd5"
--authentication_backoff_factor="1secs" --authorizer="local" --cgroups_cpu_enable_pids_and_tids_count="false"
--cgroups_enable_cfs="false" --cgroups_hierarchy="/sys/fs/cgroup" --cgroups_limit_swap="false"
--cgroups_root="mesos" --container_disk_watch_interval="15secs" --containerizers="mesos" --credential="/tmp/Endpoint_SlaveEndpointTest_NoAuthorizer_2_ZK3uA6/credential"
--default_role="*" --disallow_sharing_agent_pid_namespace="false" --disk_watch_interval="1mins"
--docker="docker" --docker_kill_orphans="true" --docker_registry="https://registry-1.docker.io"
--docker_remove_delay="6hrs" --docker_socket="/var/run/docker.sock" --docker_stop_timeout="0ns"
--docker_store_dir="/tmp/Endpoint_SlaveEndpointTest_NoAuthorizer_2_ZK3uA6/store/docker" --docker_volume_checkpoint_dir="/var/run/mesos/isolators/docker/volume"
--enforce_container_disk_quota="false" --executor_registration_timeout="1mins" --executor_reregistration_timeout="2secs"
--executor_secret_key="/tmp/Endpoint_SlaveEndpointTest_NoAuthorizer_2_ZK3uA6/executor_secret_key"
--executor_shutdown_grace_period="5secs" --fetcher_cache_dir="/tmp/Endpoint_SlaveEndpointTest_NoAuthorizer_2_ZK3uA6/fetch"
--fetcher_cache_size="2GB" --frameworks_home="" --gc_delay="1weeks" --gc_disk_headroom="0.1"
--hadoop_home="" --help="false" --hostname_lookup="true" --http_command_executor="false" --http_credentials="/tmp/Endpoint_SlaveEndpointTest_NoAuthorizer_2_ZK3uA6/http_credentials"
--http_heartbeat_interval="30secs" --initialize_driver_logging="true" --isolation="posix/cpu,posix/mem"
--launcher="posix" --launcher_dir="/mesos/mesos-1.5.0/_build/src" --logbufsecs="0" --logging_level="INFO"
--max_completed_executors_per_framework="150" --oversubscribed_resources_interval="15secs"
--perf_duration="10secs" --perf_interval="1mins" --port="5051" --qos_correction_interval_min="0ns"
--quiet="false" --recover="reconnect" --recovery_timeout="15mins" --registration_backoff_factor="10ms"
--resources="cpus:2;gpus:0;mem:1024;disk:1024;ports:[31000-32000]" --revocable_cpu_low_priority="true"
--runtime_dir="/tmp/Endpoint_SlaveEndpointTest_NoAuthorizer_2_ZK3uA6" --sandbox_directory="/mnt/mesos/sandbox"
--strict="true" --switch_user="true" --systemd_enable_support="true" --systemd_runtime_directory="/run/systemd/system"
--version="false" --work_dir="/tmp/Endpoint_SlaveEndpointTest_NoAuthorizer_2_UzQ1eE" --zk_session_timeout="10secs"
I0915 12:59:01.718674 27975 credentials.hpp:86] Loading credential for authentication from
'/tmp/Endpoint_SlaveEndpointTest_NoAuthorizer_2_ZK3uA6/credential'
I0915 12:59:01.718991 27975 slave.cpp:285] Agent using credential for: test-principal
I0915 12:59:01.719019 27975 credentials.hpp:37] Loading credentials for authentication from
'/tmp/Endpoint_SlaveEndpointTest_NoAuthorizer_2_ZK3uA6/http_credentials'
I0915 12:59:01.719497 27975 http.cpp:1045] Creating default 'basic' HTTP authenticator for
realm 'mesos-agent-executor'
I0915 12:59:01.719710 27975 http.cpp:1066] Creating default 'jwt' HTTP authenticator for realm
'mesos-agent-executor'
I0915 12:59:01.720082 27975 http.cpp:1045] Creating default 'basic' HTTP authenticator for
realm 'mesos-agent-readonly'
I0915 12:59:01.720266 27975 http.cpp:1066] Creating default 'jwt' HTTP authenticator for realm
'mesos-agent-readonly'
I0915 12:59:01.720582 27975 http.cpp:1045] Creating default 'basic' HTTP authenticator for
realm 'mesos-agent-readwrite'
I0915 12:59:01.720785 27975 http.cpp:1066] Creating default 'jwt' HTTP authenticator for realm
'mesos-agent-readwrite'
I0915 12:59:01.723397 27975 slave.cpp:583] Agent resources: [{"name":"cpus","scalar":{"value":2.0},"type":"SCALAR"},{"name":"mem","scalar":{"value":1024.0},"type":"SCALAR"},{"name":"disk","scalar":{"value":1024.0},"type":"SCALAR"},{"name":"ports","ranges":{"range":[{"begin":31000,"end":32000}]},"type":"RANGES"}]
I0915 12:59:01.723788 27975 slave.cpp:591] Agent attributes: [  ]
I0915 12:59:01.723809 27975 slave.cpp:600] Agent hostname: adce9827d74a
I0915 12:59:01.724210 27967 status_update_manager.cpp:177] Pausing sending status updates
I0915 12:59:01.726861 27986 state.cpp:64] Recovering state from '/tmp/Endpoint_SlaveEndpointTest_NoAuthorizer_2_UzQ1eE/meta'
I0915 12:59:01.727458 27988 status_update_manager.cpp:203] Recovering status update manager
I0915 12:59:01.727653 27988 containerizer.cpp:648] Recovering containerizer
I0915 12:59:01.729864 27976 provisioner.cpp:416] Provisioner recovery complete
I0915 12:59:01.730624 27982 slave.cpp:6298] Finished recovery
I0915 12:59:01.731501 27982 slave.cpp:6480] Querying resource estimator for oversubscribable
resources
I0915 12:59:01.731968 27971 slave.cpp:6494] Received oversubscribable resources {} from the
resource estimator
I0915 12:59:01.735118 27974 process.cpp:3929] Handling HTTP event for process 'slave(822)'
with path: '/slave(822)/containers'
I0915 12:59:01.737351 27985 http.cpp:1185] HTTP GET for /slave(822)/containers from 172.17.0.3:35156
I0915 12:59:01.737455 27985 http.cpp:976] Authorizing principal 'test-principal' to GET the
'/containers' endpoint
I0915 12:59:01.742949  6909 slave.cpp:861] Agent terminating
[       OK ] Endpoint/SlaveEndpointTest.NoAuthorizer/2 (48 ms)
[----------] 9 tests from Endpoint/SlaveEndpointTest (330 ms total)

[----------] 2 tests from ContainerizerType/DefaultContainerDNSFlagTest
[ RUN      ] ContainerizerType/DefaultContainerDNSFlagTest.ValidateFlag/0
[       OK ] ContainerizerType/DefaultContainerDNSFlagTest.ValidateFlag/0 (12 ms)
[ RUN      ] ContainerizerType/DefaultContainerDNSFlagTest.ValidateFlag/1
[       OK ] ContainerizerType/DefaultContainerDNSFlagTest.ValidateFlag/1 (11 ms)
[----------] 2 tests from ContainerizerType/DefaultContainerDNSFlagTest (23 ms total)

[----------] Global test environment tear-down
[==========] 1675 tests from 185 test cases ran. (619394 ms total)
[  PASSED  ] 1673 tests.
[  FAILED  ] 2 tests, listed below:
[  FAILED  ] ExamplesTest.TestFramework
[  FAILED  ] ExamplesTest.TestHTTPFramework

 2 FAILED TESTS
  YOU HAVE 20 DISABLED TESTS

I0915 12:59:01.841140 27989 process.cpp:1068] Failed to accept socket: future discarded
make[4]: *** [check-local] Error 1
make[4]: Leaving directory `/mesos/mesos-1.5.0/_build/src'
make[3]: *** [check-am] Error 2
make[3]: Leaving directory `/mesos/mesos-1.5.0/_build/src'
make[2]: *** [check] Error 2
make[2]: Leaving directory `/mesos/mesos-1.5.0/_build/src'
make[1]: *** [check-recursive] Error 1
make[1]: Leaving directory `/mesos/mesos-1.5.0/_build'
make: *** [distcheck] Error 1
+ docker rmi mesos-1505477206-7208
Untagged: mesos-1505477206-7208:latest
Deleted: sha256:da09926329021c0756e2ced8ff2153326ce3aceebe130fe6db701eb990cb4d30
Deleted: sha256:8b612f2b9d6e5445631dfe5edcf8c18b92a66227d3da1c135f4aa97dc5e4d867
Deleted: sha256:08d9b082d0bebed164f0d6f668cdcee1775792f1a0f131600960f00bf21893bc
Deleted: sha256:8b157c38caacf466da38c75747161f6a9eb593c4f18c76753906897b075a2f4a
Deleted: sha256:731354b488dd45349d0ad3b9d8a6b1512e445c6c4f3e26c3e86367901dd0fede
Deleted: sha256:43da1215173a1aab2292d1e03b375b7883936819195c9d46c37b06e7c497e533
Deleted: sha256:ebdb25c9764d7aef7c7fa652f1ba5bb5b5a88236cae728ed558f885083401b4e
Deleted: sha256:6899c891405a3457e0b768f6636e6edfca65c56cc7639a1d724f197d19de3912
Deleted: sha256:ee3bf2f2c335b2125cacec1392b7edac5952d3e1a3ff5484b6fcbc8a6259c32c
Deleted: sha256:19f76a8127552d1cbde2fe7f819be31cd7c8a0ce32887f1fea4f6f71d48cb9fb
Deleted: sha256:ec6f710e44e71c87b8a0a3cca57dae341a58599f1fed5538992348ff7efcbdc7
Deleted: sha256:62f5f8a80461308994b496a0c9444c051e40d0aa3c60ea7166415103eb8a7bdd
Deleted: sha256:f47cc6b374ef3b508627a7a3cea806bd0bed8479ec72ef38546ff8ca44fd31ba
Deleted: sha256:b0e6e7c90a0a62083156ba0a7efcf50a999208cb5d2e9bd13b19d66e43c05a53
Deleted: sha256:30da97bef34d0cbc4c5cda44a0e1b9d75074a045cea551a1a56831014a7c3e66
Deleted: sha256:04cca374da1a12017adeac7d26a99d23c017a6a13123ff2627ecf1a477fc13e5
Deleted: sha256:431c519a3a362699253b5b77b06b085951f5d5085c0a4ff2a52c90c60be86e5a
Deleted: sha256:17725c69436150ec3419b6e8d0dcf0bff64033cad4cc4f77ba09c45b113629dd
Deleted: sha256:3214ee8bf0db4584747b8838a4db9fab965543e5f6bf99e680cb1f99d5c9d068
Deleted: sha256:3eaeaa99c98c8567c4fa8f0fd77fdbcf2e999dda9d33a28e9157a3f046f55c0d
Deleted: sha256:2c075afd1325459f9ee6b65517c1208c31dde8c7ce480e8ae1b9209d556712b2
Deleted: sha256:dd16200a73eb0a851889fa15380ef4e116f55221374d604d5729b76021c1a3f5
Deleted: sha256:00e643af69ecdc53fe76a60b55ce2537c88391e2b448ea7e0fba1227c8080df1
Deleted: sha256:1427ea0901a36ef1ccde0c2050adc60207937564f063eaf0801566cf2b8eb429
Deleted: sha256:61219125daff08bfb70a079879a0b3733267a8d0cdffd50b1d7dbb5292c77b29
Deleted: sha256:a628707869eaa41fa5f99d41e85159efaf0f29bab744eebdd906409e58cd3d00
Deleted: sha256:818747b949b6b2926c25816653793795e46c113bab13b77d407304e2353e3b09
Deleted: sha256:a3b3c927e9119e6f747583d97ec3cd1387b4e7790eccfdc24ad6df240a14512f
Build step 'Execute shell' marked build as failure
Not sending mail to unregistered user benjamin.bannier@mesosphere.io

Mime
View raw message