mesos-builds mailing list archives

Site index · List index
Message view « Date » · « Thread »
Top « Date » · « Thread »
From Apache Jenkins Server <jenk...@builds.apache.org>
Subject Build failed in Jenkins: Mesos-Buildbot » autotools,gcc,--verbose --enable-libevent --enable-ssl,GLOG_v=1 MESOS_VERBOSE=1,centos:7,(ubuntu)&&(!ubuntu-us1)&&(!ubuntu-eu2)&&(!qnode3)&&(!H23) #4240
Date Tue, 19 Sep 2017 18:51:51 GMT
See <https://builds.apache.org/job/Mesos-Buildbot/BUILDTOOL=autotools,COMPILER=gcc,CONFIGURATION=--verbose%20--enable-libevent%20--enable-ssl,ENVIRONMENT=GLOG_v=1%20MESOS_VERBOSE=1,OS=centos%3A7,label_exp=(ubuntu)&&(!ubuntu-us1)&&(!ubuntu-eu2)&&(!qnode3)&&(!H23)/4240/display/redirect?page=changes>

Changes:

[yujie.jay] Added a link to secrets doc from container volume doc.

------------------------------------------
[...truncated 32.65 MB...]
I0919 18:51:38.248421 30820 http.cpp:1066] Creating default 'jwt' HTTP authenticator for realm
'mesos-agent-executor'
I0919 18:51:38.248651 30820 http.cpp:1045] Creating default 'basic' HTTP authenticator for
realm 'mesos-agent-readonly'
I0919 18:51:38.248801 30820 http.cpp:1066] Creating default 'jwt' HTTP authenticator for realm
'mesos-agent-readonly'
I0919 18:51:38.249009 30820 http.cpp:1045] Creating default 'basic' HTTP authenticator for
realm 'mesos-agent-readwrite'
I0919 18:51:38.249132 30820 http.cpp:1066] Creating default 'jwt' HTTP authenticator for realm
'mesos-agent-readwrite'
I0919 18:51:38.250597 30820 slave.cpp:583] Agent resources: [{"name":"cpus","scalar":{"value":2.0},"type":"SCALAR"},{"name":"mem","scalar":{"value":1024.0},"type":"SCALAR"},{"name":"disk","scalar":{"value":1024.0},"type":"SCALAR"},{"name":"ports","ranges":{"range":[{"begin":31000,"end":32000}]},"type":"RANGES"}]
I0919 18:51:38.250830 30820 slave.cpp:591] Agent attributes: [  ]
I0919 18:51:38.250845 30820 slave.cpp:600] Agent hostname: b02ce2989c25
I0919 18:51:38.250995 30818 status_update_manager.cpp:177] Pausing sending status updates
I0919 18:51:38.252535 30825 state.cpp:64] Recovering state from '/tmp/Endpoint_SlaveEndpointTest_UnauthorizedRequest_0_4EzzJd/meta'
I0919 18:51:38.252805 30825 status_update_manager.cpp:203] Recovering status update manager
I0919 18:51:38.253000 30814 containerizer.cpp:648] Recovering containerizer
I0919 18:51:38.254264 30831 provisioner.cpp:416] Provisioner recovery complete
I0919 18:51:38.254622 30818 slave.cpp:6298] Finished recovery
I0919 18:51:38.255089 30818 slave.cpp:6480] Querying resource estimator for oversubscribable
resources
I0919 18:51:38.255331 30833 slave.cpp:6494] Received oversubscribable resources {} from the
resource estimator
I0919 18:51:38.257261 30832 process.cpp:3929] Handling HTTP event for process 'slave(814)'
with path: '/slave(814)/monitor/statistics'
I0919 18:51:38.258937 30831 http.cpp:1185] HTTP GET for /slave(814)/monitor/statistics from
172.17.0.3:49992
I0919 18:51:38.259066 30831 http.cpp:976] Authorizing principal 'test-principal' to GET the
'/monitor/statistics' endpoint
I0919 18:51:38.260694 30826 slave.cpp:861] Agent terminating
[       OK ] Endpoint/SlaveEndpointTest.UnauthorizedRequest/0 (29 ms)
[ RUN      ] Endpoint/SlaveEndpointTest.UnauthorizedRequest/1
I0919 18:51:38.274854  9654 containerizer.cpp:292] Using isolation { environment_secret, posix/cpu,
posix/mem, filesystem/posix, network/cni }
W0919 18:51:38.275455  9654 backend.cpp:76] Failed to create 'aufs' backend: AufsBackend requires
root privileges
W0919 18:51:38.275565  9654 backend.cpp:76] Failed to create 'bind' backend: BindBackend requires
root privileges
I0919 18:51:38.275609  9654 provisioner.cpp:255] Using default backend 'copy'
I0919 18:51:38.279248 30812 slave.cpp:252] Mesos agent started on (815)@172.17.0.3:41430
I0919 18:51:38.279273 30812 slave.cpp:253] Flags at startup: --acls="" --appc_simple_discovery_uri_prefix="http://"
--appc_store_dir="/tmp/Endpoint_SlaveEndpointTest_UnauthorizedRequest_1_ogUq1q/store/appc"
--authenticate_http_executors="true" --authenticate_http_readonly="true" --authenticate_http_readwrite="true"
--authenticatee="crammd5" --authentication_backoff_factor="1secs" --authorizer="local" --cgroups_cpu_enable_pids_and_tids_count="false"
--cgroups_enable_cfs="false" --cgroups_hierarchy="/sys/fs/cgroup" --cgroups_limit_swap="false"
--cgroups_root="mesos" --container_disk_watch_interval="15secs" --containerizers="mesos" --credential="/tmp/Endpoint_SlaveEndpointTest_UnauthorizedRequest_1_ogUq1q/credential"
--default_role="*" --disallow_sharing_agent_pid_namespace="false" --disk_watch_interval="1mins"
--docker="docker" --docker_kill_orphans="true" --docker_registry="https://registry-1.docker.io"
--docker_remove_delay="6hrs" --docker_socket="/var/run/docker.sock" --docker_stop_timeout="0ns"
--docker_store_dir="/tmp/Endpoint_SlaveEndpointTest_UnauthorizedRequest_1_ogUq1q/store/docker"
--docker_volume_checkpoint_dir="/var/run/mesos/isolators/docker/volume" --enforce_container_disk_quota="false"
--executor_registration_timeout="1mins" --executor_reregistration_timeout="2secs" --executor_secret_key="/tmp/Endpoint_SlaveEndpointTest_UnauthorizedRequest_1_ogUq1q/executor_secret_key"
--executor_shutdown_grace_period="5secs" --fetcher_cache_dir="/tmp/Endpoint_SlaveEndpointTest_UnauthorizedRequest_1_ogUq1q/fetch"
--fetcher_cache_size="2GB" --frameworks_home="" --gc_delay="1weeks" --gc_disk_headroom="0.1"
--hadoop_home="" --help="false" --hostname_lookup="true" --http_command_executor="false" --http_credentials="/tmp/Endpoint_SlaveEndpointTest_UnauthorizedRequest_1_ogUq1q/http_credentials"
--http_heartbeat_interval="30secs" --initialize_driver_logging="true" --isolation="posix/cpu,posix/mem"
--launcher="posix" --launcher_dir="/mesos/mesos-1.5.0/_build/src" --logbufsecs="0" --logging_level="INFO"
--max_completed_executors_per_framework="150" --oversubscribed_resources_interval="15secs"
--perf_duration="10secs" --perf_interval="1mins" --port="5051" --qos_correction_interval_min="0ns"
--quiet="false" --recover="reconnect" --recovery_timeout="15mins" --registration_backoff_factor="10ms"
--resources="cpus:2;gpus:0;mem:1024;disk:1024;ports:[31000-32000]" --revocable_cpu_low_priority="true"
--runtime_dir="/tmp/Endpoint_SlaveEndpointTest_UnauthorizedRequest_1_ogUq1q" --sandbox_directory="/mnt/mesos/sandbox"
--strict="true" --switch_user="true" --systemd_enable_support="true" --systemd_runtime_directory="/run/systemd/system"
--version="false" --work_dir="/tmp/Endpoint_SlaveEndpointTest_UnauthorizedRequest_1_Gtx9ko"
--zk_session_timeout="10secs"
I0919 18:51:38.279701 30812 credentials.hpp:86] Loading credential for authentication from
'/tmp/Endpoint_SlaveEndpointTest_UnauthorizedRequest_1_ogUq1q/credential'
I0919 18:51:38.279872 30812 slave.cpp:285] Agent using credential for: test-principal
I0919 18:51:38.279897 30812 credentials.hpp:37] Loading credentials for authentication from
'/tmp/Endpoint_SlaveEndpointTest_UnauthorizedRequest_1_ogUq1q/http_credentials'
I0919 18:51:38.280226 30812 http.cpp:1045] Creating default 'basic' HTTP authenticator for
realm 'mesos-agent-executor'
I0919 18:51:38.280386 30812 http.cpp:1066] Creating default 'jwt' HTTP authenticator for realm
'mesos-agent-executor'
I0919 18:51:38.280632 30812 http.cpp:1045] Creating default 'basic' HTTP authenticator for
realm 'mesos-agent-readonly'
I0919 18:51:38.280787 30812 http.cpp:1066] Creating default 'jwt' HTTP authenticator for realm
'mesos-agent-readonly'
I0919 18:51:38.280987 30812 http.cpp:1045] Creating default 'basic' HTTP authenticator for
realm 'mesos-agent-readwrite'
I0919 18:51:38.281103 30812 http.cpp:1066] Creating default 'jwt' HTTP authenticator for realm
'mesos-agent-readwrite'
I0919 18:51:38.282618 30812 slave.cpp:583] Agent resources: [{"name":"cpus","scalar":{"value":2.0},"type":"SCALAR"},{"name":"mem","scalar":{"value":1024.0},"type":"SCALAR"},{"name":"disk","scalar":{"value":1024.0},"type":"SCALAR"},{"name":"ports","ranges":{"range":[{"begin":31000,"end":32000}]},"type":"RANGES"}]
I0919 18:51:38.282899 30812 slave.cpp:591] Agent attributes: [  ]
I0919 18:51:38.282927 30812 slave.cpp:600] Agent hostname: b02ce2989c25
I0919 18:51:38.283087 30825 status_update_manager.cpp:177] Pausing sending status updates
I0919 18:51:38.284760 30828 state.cpp:64] Recovering state from '/tmp/Endpoint_SlaveEndpointTest_UnauthorizedRequest_1_Gtx9ko/meta'
I0919 18:51:38.285105 30821 status_update_manager.cpp:203] Recovering status update manager
I0919 18:51:38.285372 30826 containerizer.cpp:648] Recovering containerizer
I0919 18:51:38.286999 30835 provisioner.cpp:416] Provisioner recovery complete
I0919 18:51:38.287379 30825 slave.cpp:6298] Finished recovery
I0919 18:51:38.287875 30825 slave.cpp:6480] Querying resource estimator for oversubscribable
resources
I0919 18:51:38.288103 30823 slave.cpp:6494] Received oversubscribable resources {} from the
resource estimator
I0919 18:51:38.290628 30831 process.cpp:3929] Handling HTTP event for process 'slave(815)'
with path: '/slave(815)/monitor/statistics.json'
I0919 18:51:38.292644 30822 http.cpp:1185] HTTP GET for /slave(815)/monitor/statistics.json
from 172.17.0.3:49994
I0919 18:51:38.292742 30822 http.cpp:976] Authorizing principal 'test-principal' to GET the
'/monitor/statistics.json' endpoint
I0919 18:51:38.294373 30818 slave.cpp:861] Agent terminating
[       OK ] Endpoint/SlaveEndpointTest.UnauthorizedRequest/1 (33 ms)
[ RUN      ] Endpoint/SlaveEndpointTest.UnauthorizedRequest/2
I0919 18:51:38.306257  9654 containerizer.cpp:292] Using isolation { environment_secret, posix/cpu,
posix/mem, filesystem/posix, network/cni }
W0919 18:51:38.306776  9654 backend.cpp:76] Failed to create 'aufs' backend: AufsBackend requires
root privileges
W0919 18:51:38.306888  9654 backend.cpp:76] Failed to create 'bind' backend: BindBackend requires
root privileges
I0919 18:51:38.306922  9654 provisioner.cpp:255] Using default backend 'copy'
I0919 18:51:38.310362 30824 slave.cpp:252] Mesos agent started on (816)@172.17.0.3:41430
I0919 18:51:38.310384 30824 slave.cpp:253] Flags at startup: --acls="" --appc_simple_discovery_uri_prefix="http://"
--appc_store_dir="/tmp/Endpoint_SlaveEndpointTest_UnauthorizedRequest_2_q7x30B/store/appc"
--authenticate_http_executors="true" --authenticate_http_readonly="true" --authenticate_http_readwrite="true"
--authenticatee="crammd5" --authentication_backoff_factor="1secs" --authorizer="local" --cgroups_cpu_enable_pids_and_tids_count="false"
--cgroups_enable_cfs="false" --cgroups_hierarchy="/sys/fs/cgroup" --cgroups_limit_swap="false"
--cgroups_root="mesos" --container_disk_watch_interval="15secs" --containerizers="mesos" --credential="/tmp/Endpoint_SlaveEndpointTest_UnauthorizedRequest_2_q7x30B/credential"
--default_role="*" --disallow_sharing_agent_pid_namespace="false" --disk_watch_interval="1mins"
--docker="docker" --docker_kill_orphans="true" --docker_registry="https://registry-1.docker.io"
--docker_remove_delay="6hrs" --docker_socket="/var/run/docker.sock" --docker_stop_timeout="0ns"
--docker_store_dir="/tmp/Endpoint_SlaveEndpointTest_UnauthorizedRequest_2_q7x30B/store/docker"
--docker_volume_checkpoint_dir="/var/run/mesos/isolators/docker/volume" --enforce_container_disk_quota="false"
--executor_registration_timeout="1mins" --executor_reregistration_timeout="2secs" --executor_secret_key="/tmp/Endpoint_SlaveEndpointTest_UnauthorizedRequest_2_q7x30B/executor_secret_key"
--executor_shutdown_grace_period="5secs" --fetcher_cache_dir="/tmp/Endpoint_SlaveEndpointTest_UnauthorizedRequest_2_q7x30B/fetch"
--fetcher_cache_size="2GB" --frameworks_home="" --gc_delay="1weeks" --gc_disk_headroom="0.1"
--hadoop_home="" --help="false" --hostname_lookup="true" --http_command_executor="false" --http_credentials="/tmp/Endpoint_SlaveEndpointTest_UnauthorizedRequest_2_q7x30B/http_credentials"
--http_heartbeat_interval="30secs" --initialize_driver_logging="true" --isolation="posix/cpu,posix/mem"
--launcher="posix" --launcher_dir="/mesos/mesos-1.5.0/_build/src" --logbufsecs="0" --logging_level="INFO"
--max_completed_executors_per_framework="150" --oversubscribed_resources_interval="15secs"
--perf_duration="10secs" --perf_interval="1mins" --port="5051" --qos_correction_interval_min="0ns"
--quiet="false" --recover="reconnect" --recovery_timeout="15mins" --registration_backoff_factor="10ms"
--resources="cpus:2;gpus:0;mem:1024;disk:1024;ports:[31000-32000]" --revocable_cpu_low_priority="true"
--runtime_dir="/tmp/Endpoint_SlaveEndpointTest_UnauthorizedRequest_2_q7x30B" --sandbox_directory="/mnt/mesos/sandbox"
--strict="true" --switch_user="true" --systemd_enable_support="true" --systemd_runtime_directory="/run/systemd/system"
--version="false" --work_dir="/tmp/Endpoint_SlaveEndpointTest_UnauthorizedRequest_2_EBzYfz"
--zk_session_timeout="10secs"
I0919 18:51:38.310781 30824 credentials.hpp:86] Loading credential for authentication from
'/tmp/Endpoint_SlaveEndpointTest_UnauthorizedRequest_2_q7x30B/credential'
I0919 18:51:38.310945 30824 slave.cpp:285] Agent using credential for: test-principal
I0919 18:51:38.310969 30824 credentials.hpp:37] Loading credentials for authentication from
'/tmp/Endpoint_SlaveEndpointTest_UnauthorizedRequest_2_q7x30B/http_credentials'
I0919 18:51:38.311269 30824 http.cpp:1045] Creating default 'basic' HTTP authenticator for
realm 'mesos-agent-executor'
I0919 18:51:38.311415 30824 http.cpp:1066] Creating default 'jwt' HTTP authenticator for realm
'mesos-agent-executor'
I0919 18:51:38.311643 30824 http.cpp:1045] Creating default 'basic' HTTP authenticator for
realm 'mesos-agent-readonly'
I0919 18:51:38.311755 30824 http.cpp:1066] Creating default 'jwt' HTTP authenticator for realm
'mesos-agent-readonly'
I0919 18:51:38.311954 30824 http.cpp:1045] Creating default 'basic' HTTP authenticator for
realm 'mesos-agent-readwrite'
I0919 18:51:38.312079 30824 http.cpp:1066] Creating default 'jwt' HTTP authenticator for realm
'mesos-agent-readwrite'
I0919 18:51:38.313527 30824 slave.cpp:583] Agent resources: [{"name":"cpus","scalar":{"value":2.0},"type":"SCALAR"},{"name":"mem","scalar":{"value":1024.0},"type":"SCALAR"},{"name":"disk","scalar":{"value":1024.0},"type":"SCALAR"},{"name":"ports","ranges":{"range":[{"begin":31000,"end":32000}]},"type":"RANGES"}]
I0919 18:51:38.313763 30824 slave.cpp:591] Agent attributes: [  ]
I0919 18:51:38.313788 30824 slave.cpp:600] Agent hostname: b02ce2989c25
I0919 18:51:38.313947 30816 status_update_manager.cpp:177] Pausing sending status updates
I0919 18:51:38.315475 30820 state.cpp:64] Recovering state from '/tmp/Endpoint_SlaveEndpointTest_UnauthorizedRequest_2_EBzYfz/meta'
I0919 18:51:38.315752 30819 status_update_manager.cpp:203] Recovering status update manager
I0919 18:51:38.315948 30818 containerizer.cpp:648] Recovering containerizer
I0919 18:51:38.317231 30831 provisioner.cpp:416] Provisioner recovery complete
I0919 18:51:38.317538 30816 slave.cpp:6298] Finished recovery
I0919 18:51:38.318020 30816 slave.cpp:6480] Querying resource estimator for oversubscribable
resources
I0919 18:51:38.318254 30817 slave.cpp:6494] Received oversubscribable resources {} from the
resource estimator
I0919 18:51:38.320410 30833 process.cpp:3929] Handling HTTP event for process 'slave(816)'
with path: '/slave(816)/containers'
I0919 18:51:38.322188 30823 http.cpp:1185] HTTP GET for /slave(816)/containers from 172.17.0.3:49996
I0919 18:51:38.322263 30823 http.cpp:976] Authorizing principal 'test-principal' to GET the
'/containers' endpoint
I0919 18:51:38.323985 30830 slave.cpp:861] Agent terminating
[       OK ] Endpoint/SlaveEndpointTest.UnauthorizedRequest/2 (29 ms)
[ RUN      ] Endpoint/SlaveEndpointTest.NoAuthorizer/0
I0919 18:51:38.339843  9654 containerizer.cpp:292] Using isolation { environment_secret, posix/cpu,
posix/mem, filesystem/posix, network/cni }
W0919 18:51:38.340672  9654 backend.cpp:76] Failed to create 'aufs' backend: AufsBackend requires
root privileges
W0919 18:51:38.340870  9654 backend.cpp:76] Failed to create 'bind' backend: BindBackend requires
root privileges
I0919 18:51:38.340915  9654 provisioner.cpp:255] Using default backend 'copy'
I0919 18:51:38.343760  9654 cluster.cpp:448] Creating default 'local' authorizer
I0919 18:51:38.346917 30828 slave.cpp:252] Mesos agent started on (817)@172.17.0.3:41430
I0919 18:51:38.346943 30828 slave.cpp:253] Flags at startup: --acls="" --appc_simple_discovery_uri_prefix="http://"
--appc_store_dir="/tmp/Endpoint_SlaveEndpointTest_NoAuthorizer_0_LdCXiN/store/appc" --authenticate_http_executors="true"
--authenticate_http_readonly="true" --authenticate_http_readwrite="true" --authenticatee="crammd5"
--authentication_backoff_factor="1secs" --authorizer="local" --cgroups_cpu_enable_pids_and_tids_count="false"
--cgroups_enable_cfs="false" --cgroups_hierarchy="/sys/fs/cgroup" --cgroups_limit_swap="false"
--cgroups_root="mesos" --container_disk_watch_interval="15secs" --containerizers="mesos" --credential="/tmp/Endpoint_SlaveEndpointTest_NoAuthorizer_0_LdCXiN/credential"
--default_role="*" --disallow_sharing_agent_pid_namespace="false" --disk_watch_interval="1mins"
--docker="docker" --docker_kill_orphans="true" --docker_registry="https://registry-1.docker.io"
--docker_remove_delay="6hrs" --docker_socket="/var/run/docker.sock" --docker_stop_timeout="0ns"
--docker_store_dir="/tmp/Endpoint_SlaveEndpointTest_NoAuthorizer_0_LdCXiN/store/docker" --docker_volume_checkpoint_dir="/var/run/mesos/isolators/docker/volume"
--enforce_container_disk_quota="false" --executor_registration_timeout="1mins" --executor_reregistration_timeout="2secs"
--executor_secret_key="/tmp/Endpoint_SlaveEndpointTest_NoAuthorizer_0_LdCXiN/executor_secret_key"
--executor_shutdown_grace_period="5secs" --fetcher_cache_dir="/tmp/Endpoint_SlaveEndpointTest_NoAuthorizer_0_LdCXiN/fetch"
--fetcher_cache_size="2GB" --frameworks_home="" --gc_delay="1weeks" --gc_disk_headroom="0.1"
--hadoop_home="" --help="false" --hostname_lookup="true" --http_command_executor="false" --http_credentials="/tmp/Endpoint_SlaveEndpointTest_NoAuthorizer_0_LdCXiN/http_credentials"
--http_heartbeat_interval="30secs" --initialize_driver_logging="true" --isolation="posix/cpu,posix/mem"
--launcher="posix" --launcher_dir="/mesos/mesos-1.5.0/_build/src" --logbufsecs="0" --logging_level="INFO"
--max_completed_executors_per_framework="150" --oversubscribed_resources_interval="15secs"
--perf_duration="10secs" --perf_interval="1mins" --port="5051" --qos_correction_interval_min="0ns"
--quiet="false" --recover="reconnect" --recovery_timeout="15mins" --registration_backoff_factor="10ms"
--resources="cpus:2;gpus:0;mem:1024;disk:1024;ports:[31000-32000]" --revocable_cpu_low_priority="true"
--runtime_dir="/tmp/Endpoint_SlaveEndpointTest_NoAuthorizer_0_LdCXiN" --sandbox_directory="/mnt/mesos/sandbox"
--strict="true" --switch_user="true" --systemd_enable_support="true" --systemd_runtime_directory="/run/systemd/system"
--version="false" --work_dir="/tmp/Endpoint_SlaveEndpointTest_NoAuthorizer_0_ZgrctK" --zk_session_timeout="10secs"
I0919 18:51:38.347501 30828 credentials.hpp:86] Loading credential for authentication from
'/tmp/Endpoint_SlaveEndpointTest_NoAuthorizer_0_LdCXiN/credential'
I0919 18:51:38.347700 30828 slave.cpp:285] Agent using credential for: test-principal
I0919 18:51:38.347724 30828 credentials.hpp:37] Loading credentials for authentication from
'/tmp/Endpoint_SlaveEndpointTest_NoAuthorizer_0_LdCXiN/http_credentials'
I0919 18:51:38.348019 30828 http.cpp:1045] Creating default 'basic' HTTP authenticator for
realm 'mesos-agent-executor'
I0919 18:51:38.348160 30828 http.cpp:1066] Creating default 'jwt' HTTP authenticator for realm
'mesos-agent-executor'
I0919 18:51:38.348368 30828 http.cpp:1045] Creating default 'basic' HTTP authenticator for
realm 'mesos-agent-readonly'
I0919 18:51:38.348485 30828 http.cpp:1066] Creating default 'jwt' HTTP authenticator for realm
'mesos-agent-readonly'
I0919 18:51:38.348675 30828 http.cpp:1045] Creating default 'basic' HTTP authenticator for
realm 'mesos-agent-readwrite'
I0919 18:51:38.348801 30828 http.cpp:1066] Creating default 'jwt' HTTP authenticator for realm
'mesos-agent-readwrite'
I0919 18:51:38.350262 30828 slave.cpp:583] Agent resources: [{"name":"cpus","scalar":{"value":2.0},"type":"SCALAR"},{"name":"mem","scalar":{"value":1024.0},"type":"SCALAR"},{"name":"disk","scalar":{"value":1024.0},"type":"SCALAR"},{"name":"ports","ranges":{"range":[{"begin":31000,"end":32000}]},"type":"RANGES"}]
I0919 18:51:38.350512 30828 slave.cpp:591] Agent attributes: [  ]
I0919 18:51:38.350529 30828 slave.cpp:600] Agent hostname: b02ce2989c25
I0919 18:51:38.350668 30827 status_update_manager.cpp:177] Pausing sending status updates
I0919 18:51:38.352212 30825 state.cpp:64] Recovering state from '/tmp/Endpoint_SlaveEndpointTest_NoAuthorizer_0_ZgrctK/meta'
I0919 18:51:38.352519 30821 status_update_manager.cpp:203] Recovering status update manager
I0919 18:51:38.352857 30818 containerizer.cpp:648] Recovering containerizer
I0919 18:51:38.354652 30832 provisioner.cpp:416] Provisioner recovery complete
I0919 18:51:38.354980 30827 slave.cpp:6298] Finished recovery
I0919 18:51:38.355563 30827 slave.cpp:6480] Querying resource estimator for oversubscribable
resources
I0919 18:51:38.355826 30830 slave.cpp:6494] Received oversubscribable resources {} from the
resource estimator
I0919 18:51:38.357892 30826 process.cpp:3929] Handling HTTP event for process 'slave(817)'
with path: '/slave(817)/monitor/statistics'
I0919 18:51:38.359938 30832 http.cpp:1185] HTTP GET for /slave(817)/monitor/statistics from
172.17.0.3:49998
I0919 18:51:38.360019 30832 http.cpp:976] Authorizing principal 'test-principal' to GET the
'/monitor/statistics' endpoint
I0919 18:51:38.362504 30835 slave.cpp:861] Agent terminating
[       OK ] Endpoint/SlaveEndpointTest.NoAuthorizer/0 (38 ms)
[ RUN      ] Endpoint/SlaveEndpointTest.NoAuthorizer/1
I0919 18:51:38.376274  9654 containerizer.cpp:292] Using isolation { environment_secret, posix/cpu,
posix/mem, filesystem/posix, network/cni }
W0919 18:51:38.376888  9654 backend.cpp:76] Failed to create 'aufs' backend: AufsBackend requires
root privileges
W0919 18:51:38.377027  9654 backend.cpp:76] Failed to create 'bind' backend: BindBackend requires
root privileges
I0919 18:51:38.377063  9654 provisioner.cpp:255] Using default backend 'copy'
I0919 18:51:38.379250  9654 cluster.cpp:448] Creating default 'local' authorizer
I0919 18:51:38.381788 30819 slave.cpp:252] Mesos agent started on (818)@172.17.0.3:41430
I0919 18:51:38.381814 30819 slave.cpp:253] Flags at startup: --acls="" --appc_simple_discovery_uri_prefix="http://"
--appc_store_dir="/tmp/Endpoint_SlaveEndpointTest_NoAuthorizer_1_2edlXY/store/appc" --authenticate_http_executors="true"
--authenticate_http_readonly="true" --authenticate_http_readwrite="true" --authenticatee="crammd5"
--authentication_backoff_factor="1secs" --authorizer="local" --cgroups_cpu_enable_pids_and_tids_count="false"
--cgroups_enable_cfs="false" --cgroups_hierarchy="/sys/fs/cgroup" --cgroups_limit_swap="false"
--cgroups_root="mesos" --container_disk_watch_interval="15secs" --containerizers="mesos" --credential="/tmp/Endpoint_SlaveEndpointTest_NoAuthorizer_1_2edlXY/credential"
--default_role="*" --disallow_sharing_agent_pid_namespace="false" --disk_watch_interval="1mins"
--docker="docker" --docker_kill_orphans="true" --docker_registry="https://registry-1.docker.io"
--docker_remove_delay="6hrs" --docker_socket="/var/run/docker.sock" --docker_stop_timeout="0ns"
--docker_store_dir="/tmp/Endpoint_SlaveEndpointTest_NoAuthorizer_1_2edlXY/store/docker" --docker_volume_checkpoint_dir="/var/run/mesos/isolators/docker/volume"
--enforce_container_disk_quota="false" --executor_registration_timeout="1mins" --executor_reregistration_timeout="2secs"
--executor_secret_key="/tmp/Endpoint_SlaveEndpointTest_NoAuthorizer_1_2edlXY/executor_secret_key"
--executor_shutdown_grace_period="5secs" --fetcher_cache_dir="/tmp/Endpoint_SlaveEndpointTest_NoAuthorizer_1_2edlXY/fetch"
--fetcher_cache_size="2GB" --frameworks_home="" --gc_delay="1weeks" --gc_disk_headroom="0.1"
--hadoop_home="" --help="false" --hostname_lookup="true" --http_command_executor="false" --http_credentials="/tmp/Endpoint_SlaveEndpointTest_NoAuthorizer_1_2edlXY/http_credentials"
--http_heartbeat_interval="30secs" --initialize_driver_logging="true" --isolation="posix/cpu,posix/mem"
--launcher="posix" --launcher_dir="/mesos/mesos-1.5.0/_build/src" --logbufsecs="0" --logging_level="INFO"
--max_completed_executors_per_framework="150" --oversubscribed_resources_interval="15secs"
--perf_duration="10secs" --perf_interval="1mins" --port="5051" --qos_correction_interval_min="0ns"
--quiet="false" --recover="reconnect" --recovery_timeout="15mins" --registration_backoff_factor="10ms"
--resources="cpus:2;gpus:0;mem:1024;disk:1024;ports:[31000-32000]" --revocable_cpu_low_priority="true"
--runtime_dir="/tmp/Endpoint_SlaveEndpointTest_NoAuthorizer_1_2edlXY" --sandbox_directory="/mnt/mesos/sandbox"
--strict="true" --switch_user="true" --systemd_enable_support="true" --systemd_runtime_directory="/run/systemd/system"
--version="false" --work_dir="/tmp/Endpoint_SlaveEndpointTest_NoAuthorizer_1_fe6Z1V" --zk_session_timeout="10secs"
I0919 18:51:38.382292 30819 credentials.hpp:86] Loading credential for authentication from
'/tmp/Endpoint_SlaveEndpointTest_NoAuthorizer_1_2edlXY/credential'
I0919 18:51:38.382448 30819 slave.cpp:285] Agent using credential for: test-principal
I0919 18:51:38.382477 30819 credentials.hpp:37] Loading credentials for authentication from
'/tmp/Endpoint_SlaveEndpointTest_NoAuthorizer_1_2edlXY/http_credentials'
I0919 18:51:38.382766 30819 http.cpp:1045] Creating default 'basic' HTTP authenticator for
realm 'mesos-agent-executor'
I0919 18:51:38.382882 30819 http.cpp:1066] Creating default 'jwt' HTTP authenticator for realm
'mesos-agent-executor'
I0919 18:51:38.383074 30819 http.cpp:1045] Creating default 'basic' HTTP authenticator for
realm 'mesos-agent-readonly'
I0919 18:51:38.383195 30819 http.cpp:1066] Creating default 'jwt' HTTP authenticator for realm
'mesos-agent-readonly'
I0919 18:51:38.383376 30819 http.cpp:1045] Creating default 'basic' HTTP authenticator for
realm 'mesos-agent-readwrite'
I0919 18:51:38.383481 30819 http.cpp:1066] Creating default 'jwt' HTTP authenticator for realm
'mesos-agent-readwrite'
I0919 18:51:38.384904 30819 slave.cpp:583] Agent resources: [{"name":"cpus","scalar":{"value":2.0},"type":"SCALAR"},{"name":"mem","scalar":{"value":1024.0},"type":"SCALAR"},{"name":"disk","scalar":{"value":1024.0},"type":"SCALAR"},{"name":"ports","ranges":{"range":[{"begin":31000,"end":32000}]},"type":"RANGES"}]
I0919 18:51:38.385136 30819 slave.cpp:591] Agent attributes: [  ]
I0919 18:51:38.385151 30819 slave.cpp:600] Agent hostname: b02ce2989c25
I0919 18:51:38.385304 30834 status_update_manager.cpp:177] Pausing sending status updates
I0919 18:51:38.386838 30835 state.cpp:64] Recovering state from '/tmp/Endpoint_SlaveEndpointTest_NoAuthorizer_1_fe6Z1V/meta'
I0919 18:51:38.387190 30822 status_update_manager.cpp:203] Recovering status update manager
I0919 18:51:38.387363 30814 containerizer.cpp:648] Recovering containerizer
I0919 18:51:38.388574 30826 provisioner.cpp:416] Provisioner recovery complete
I0919 18:51:38.388892 30834 slave.cpp:6298] Finished recovery
I0919 18:51:38.389365 30834 slave.cpp:6480] Querying resource estimator for oversubscribable
resources
I0919 18:51:38.389575 30817 slave.cpp:6494] Received oversubscribable resources {} from the
resource estimator
I0919 18:51:38.393138 30831 process.cpp:3929] Handling HTTP event for process 'slave(818)'
with path: '/slave(818)/monitor/statistics.json'
I0919 18:51:38.395922 30826 http.cpp:1185] HTTP GET for /slave(818)/monitor/statistics.json
from 172.17.0.3:50000
I0919 18:51:38.396069 30826 http.cpp:976] Authorizing principal 'test-principal' to GET the
'/monitor/statistics.json' endpoint
I0919 18:51:38.400087  9654 slave.cpp:861] Agent terminating
[       OK ] Endpoint/SlaveEndpointTest.NoAuthorizer/1 (39 ms)
[ RUN      ] Endpoint/SlaveEndpointTest.NoAuthorizer/2
I0919 18:51:38.414824  9654 containerizer.cpp:292] Using isolation { environment_secret, posix/cpu,
posix/mem, filesystem/posix, network/cni }
W0919 18:51:38.415383  9654 backend.cpp:76] Failed to create 'aufs' backend: AufsBackend requires
root privileges
W0919 18:51:38.415515  9654 backend.cpp:76] Failed to create 'bind' backend: BindBackend requires
root privileges
I0919 18:51:38.415554  9654 provisioner.cpp:255] Using default backend 'copy'
I0919 18:51:38.417388  9654 cluster.cpp:448] Creating default 'local' authorizer
I0919 18:51:38.419406 30826 slave.cpp:252] Mesos agent started on (819)@172.17.0.3:41430
I0919 18:51:38.419430 30826 slave.cpp:253] Flags at startup: --acls="" --appc_simple_discovery_uri_prefix="http://"
--appc_store_dir="/tmp/Endpoint_SlaveEndpointTest_NoAuthorizer_2_wybjYa/store/appc" --authenticate_http_executors="true"
--authenticate_http_readonly="true" --authenticate_http_readwrite="true" --authenticatee="crammd5"
--authentication_backoff_factor="1secs" --authorizer="local" --cgroups_cpu_enable_pids_and_tids_count="false"
--cgroups_enable_cfs="false" --cgroups_hierarchy="/sys/fs/cgroup" --cgroups_limit_swap="false"
--cgroups_root="mesos" --container_disk_watch_interval="15secs" --containerizers="mesos" --credential="/tmp/Endpoint_SlaveEndpointTest_NoAuthorizer_2_wybjYa/credential"
--default_role="*" --disallow_sharing_agent_pid_namespace="false" --disk_watch_interval="1mins"
--docker="docker" --docker_kill_orphans="true" --docker_registry="https://registry-1.docker.io"
--docker_remove_delay="6hrs" --docker_socket="/var/run/docker.sock" --docker_stop_timeout="0ns"
--docker_store_dir="/tmp/Endpoint_SlaveEndpointTest_NoAuthorizer_2_wybjYa/store/docker" --docker_volume_checkpoint_dir="/var/run/mesos/isolators/docker/volume"
--enforce_container_disk_quota="false" --executor_registration_timeout="1mins" --executor_reregistration_timeout="2secs"
--executor_secret_key="/tmp/Endpoint_SlaveEndpointTest_NoAuthorizer_2_wybjYa/executor_secret_key"
--executor_shutdown_grace_period="5secs" --fetcher_cache_dir="/tmp/Endpoint_SlaveEndpointTest_NoAuthorizer_2_wybjYa/fetch"
--fetcher_cache_size="2GB" --frameworks_home="" --gc_delay="1weeks" --gc_disk_headroom="0.1"
--hadoop_home="" --help="false" --hostname_lookup="true" --http_command_executor="false" --http_credentials="/tmp/Endpoint_SlaveEndpointTest_NoAuthorizer_2_wybjYa/http_credentials"
--http_heartbeat_interval="30secs" --initialize_driver_logging="true" --isolation="posix/cpu,posix/mem"
--launcher="posix" --launcher_dir="/mesos/mesos-1.5.0/_build/src" --logbufsecs="0" --logging_level="INFO"
--max_completed_executors_per_framework="150" --oversubscribed_resources_interval="15secs"
--perf_duration="10secs" --perf_interval="1mins" --port="5051" --qos_correction_interval_min="0ns"
--quiet="false" --recover="reconnect" --recovery_timeout="15mins" --registration_backoff_factor="10ms"
--resources="cpus:2;gpus:0;mem:1024;disk:1024;ports:[31000-32000]" --revocable_cpu_low_priority="true"
--runtime_dir="/tmp/Endpoint_SlaveEndpointTest_NoAuthorizer_2_wybjYa" --sandbox_directory="/mnt/mesos/sandbox"
--strict="true" --switch_user="true" --systemd_enable_support="true" --systemd_runtime_directory="/run/systemd/system"
--version="false" --work_dir="/tmp/Endpoint_SlaveEndpointTest_NoAuthorizer_2_s1h9W7" --zk_session_timeout="10secs"
I0919 18:51:38.419895 30826 credentials.hpp:86] Loading credential for authentication from
'/tmp/Endpoint_SlaveEndpointTest_NoAuthorizer_2_wybjYa/credential'
I0919 18:51:38.420155 30826 slave.cpp:285] Agent using credential for: test-principal
I0919 18:51:38.420183 30826 credentials.hpp:37] Loading credentials for authentication from
'/tmp/Endpoint_SlaveEndpointTest_NoAuthorizer_2_wybjYa/http_credentials'
I0919 18:51:38.420585 30826 http.cpp:1045] Creating default 'basic' HTTP authenticator for
realm 'mesos-agent-executor'
I0919 18:51:38.420819 30826 http.cpp:1066] Creating default 'jwt' HTTP authenticator for realm
'mesos-agent-executor'
I0919 18:51:38.421146 30826 http.cpp:1045] Creating default 'basic' HTTP authenticator for
realm 'mesos-agent-readonly'
I0919 18:51:38.421288 30826 http.cpp:1066] Creating default 'jwt' HTTP authenticator for realm
'mesos-agent-readonly'
I0919 18:51:38.421541 30826 http.cpp:1045] Creating default 'basic' HTTP authenticator for
realm 'mesos-agent-readwrite'
I0919 18:51:38.421667 30826 http.cpp:1066] Creating default 'jwt' HTTP authenticator for realm
'mesos-agent-readwrite'
I0919 18:51:38.423410 30826 slave.cpp:583] Agent resources: [{"name":"cpus","scalar":{"value":2.0},"type":"SCALAR"},{"name":"mem","scalar":{"value":1024.0},"type":"SCALAR"},{"name":"disk","scalar":{"value":1024.0},"type":"SCALAR"},{"name":"ports","ranges":{"range":[{"begin":31000,"end":32000}]},"type":"RANGES"}]
I0919 18:51:38.423846 30826 slave.cpp:591] Agent attributes: [  ]
I0919 18:51:38.423883 30826 slave.cpp:600] Agent hostname: b02ce2989c25
I0919 18:51:38.424100 30815 status_update_manager.cpp:177] Pausing sending status updates
I0919 18:51:38.426722 30818 state.cpp:64] Recovering state from '/tmp/Endpoint_SlaveEndpointTest_NoAuthorizer_2_s1h9W7/meta'
I0919 18:51:38.427112 30812 status_update_manager.cpp:203] Recovering status update manager
I0919 18:51:38.427392 30823 containerizer.cpp:648] Recovering containerizer
I0919 18:51:38.429180 30825 provisioner.cpp:416] Provisioner recovery complete
I0919 18:51:38.429658 30830 slave.cpp:6298] Finished recovery
I0919 18:51:38.430166 30830 slave.cpp:6480] Querying resource estimator for oversubscribable
resources
I0919 18:51:38.430444 30824 slave.cpp:6494] Received oversubscribable resources {} from the
resource estimator
I0919 18:51:38.432816 30817 process.cpp:3929] Handling HTTP event for process 'slave(819)'
with path: '/slave(819)/containers'
I0919 18:51:38.435004 30821 http.cpp:1185] HTTP GET for /slave(819)/containers from 172.17.0.3:50002
I0919 18:51:38.435138 30821 http.cpp:976] Authorizing principal 'test-principal' to GET the
'/containers' endpoint
I0919 18:51:38.439206 30835 slave.cpp:861] Agent terminating
[       OK ] Endpoint/SlaveEndpointTest.NoAuthorizer/2 (37 ms)
[----------] 9 tests from Endpoint/SlaveEndpointTest (309 ms total)

[----------] 2 tests from ContainerizerType/DefaultContainerDNSFlagTest
[ RUN      ] ContainerizerType/DefaultContainerDNSFlagTest.ValidateFlag/0
[       OK ] ContainerizerType/DefaultContainerDNSFlagTest.ValidateFlag/0 (11 ms)
[ RUN      ] ContainerizerType/DefaultContainerDNSFlagTest.ValidateFlag/1
[       OK ] ContainerizerType/DefaultContainerDNSFlagTest.ValidateFlag/1 (10 ms)
[----------] 2 tests from ContainerizerType/DefaultContainerDNSFlagTest (21 ms total)

[----------] Global test environment tear-down
[==========] 1672 tests from 185 test cases ran. (688366 ms total)
[  PASSED  ] 1667 tests.
[  FAILED  ] 5 tests, listed below:
[  FAILED  ] CommandExecutorCheckTest.CommandCheckDeliveredAndReconciled
[  FAILED  ] DefaultExecutorCheckTest.CommandCheckDeliveredAndReconciled
[  FAILED  ] DefaultExecutorCheckTest.CommandCheckStatusChange
[  FAILED  ] DefaultExecutorCheckTest.CommandCheckSeesParentsEnv
[  FAILED  ] DefaultExecutorCheckTest.CommandCheckSharesWorkDirWithTask

 5 FAILED TESTS
  YOU HAVE 20 DISABLED TESTS

I0919 18:51:38.532500 30836 process.cpp:1068] Failed to accept socket: future discarded
make[4]: *** [check-local] Error 1
make[4]: Leaving directory `/mesos/mesos-1.5.0/_build/src'
make[3]: *** [check-am] Error 2
make[3]: Leaving directory `/mesos/mesos-1.5.0/_build/src'
make[2]: *** [check] Error 2
make[2]: Leaving directory `/mesos/mesos-1.5.0/_build/src'
make[1]: *** [check-recursive] Error 1
make[1]: Leaving directory `/mesos/mesos-1.5.0/_build'
make: *** [distcheck] Error 1
+ docker rmi mesos-1505844301-22942
Untagged: mesos-1505844301-22942:latest
Deleted: sha256:2594021fd7bcafaf7d364dcd9cab19f920f67a9380097db54a59e17142192fbf
Deleted: sha256:79950fb6791f97da5e282cdc47fc4e9088528f3a47ad99435d957609937f85c3
Deleted: sha256:4911765faf5147b1af7bfb150f3783cc70000c78bb2c068e78ac13c52a445266
Deleted: sha256:1481f0616254d182213b9782d16d874b41e1b5f782ec2a14f2fb3a51784e9afe
Deleted: sha256:a57609fe8447bcc7b1142b9fca7a0b8b0558139eeea448fe7053f5a28a8023f5
Deleted: sha256:c194f24cbdbfe6ad144e9767bab8a4a221a6c87ac035945fb7eeb4b44614a14b
Deleted: sha256:29dc832bbcfd7077c071c0eb7a2588c63556dda7106b9655d6a6a815c63f3604
Deleted: sha256:b3fd214df4238a801bdbfd4074df853eaaa83f0c05b34177789817de0676a4fe
Deleted: sha256:5073c8aef366648d27a32bd120bd56fcdc37f1c772d83a124de942336784acca
Deleted: sha256:c78db31ca8188f55b4621b9a7b4fc9fbc0a65da967f46d04f61fbac640195136
Deleted: sha256:fdf1d69b5384c7a4018af3f834736d66d32712fd07fb048ec9125b04da681e05
Deleted: sha256:f9ad4f0ed5ac15428a36188f8a702b4c7df3a18f78bd7f8ee04a476778b65a2c
Deleted: sha256:f862f812311cd44a160b9c701868a1faf8ecd82a951a8a917dc5c0a635adeebe
Deleted: sha256:9346aeff7f493db082f8b75d83acfd5d32c4763a8881bbd6ebb18ec4b80f4801
Deleted: sha256:0af9f38532cbe6a312fecf293883966ba30b9f66984da1c18bf4e48308724475
Deleted: sha256:6a77b644a4639626a7671724eeec1b2a102679a351dbc139ee590eccef5dac85
Deleted: sha256:7e250f8ed9eee007eb14543e1952c1c5f9efb118ed5ac921970f13657243cc0b
Deleted: sha256:1126e7cd508ae70a1d698fbbaff7d5f0a3a11263b497c7d6d99dc9c138ef797c
Deleted: sha256:69f1745f763563751331ba6afc30e5867080c912aa931d9b7185b480303cc85c
Deleted: sha256:368ef25e8dd731a2df92880a1fc881692bb03b84a8ac01b82e1a9a07d6f36118
Deleted: sha256:14bf55e7226e5c1efd6ccddb2af5893779a832d29b1896e69082d6fe17ab4e18
Deleted: sha256:495e621904a52be919d667cdbfb18d31979219f8fc02855d05befa500eedd09d
Deleted: sha256:d0c5eb195ff86a7c096cda04eb9af94c584541ce66e981b96112b28f247f40c4
Deleted: sha256:a121f769232e4a01487e394253c1d7400c258f6126ad376343c1a5dd19b739d3
Deleted: sha256:6b72489c0ef6c08042f2852c8c2aab7fec58bd66f556c93898a8de20291796b8
Deleted: sha256:9f570b1367026dfec94e346195238e030d469b3e7ddadc81483dbc9cd6bc0d2b
Deleted: sha256:c60365ce853d0e2a73bfe1843bd551c69e17e0bc01034bb95d2dec1f0506907d
Deleted: sha256:a201aaacc263907c24fda315f58bd3965889e0bda42609f1534e92aaac520a47
Deleted: sha256:643229d70283c6d4d9653043c64574705342622eab15fd8148faae88789462b1
Build step 'Execute shell' marked build as failure
Not sending mail to unregistered user yujie.jay@gmail.com

Mime
View raw message