mesos-builds mailing list archives

Site index · List index
Message view « Date » · « Thread »
Top « Date » · « Thread »
From Apache Jenkins Server <jenk...@builds.apache.org>
Subject Build failed in Jenkins: Mesos-Buildbot » autotools,gcc,--verbose --enable-libevent --enable-ssl,GLOG_v=1 MESOS_VERBOSE=1,ubuntu:14.04,(ubuntu)&&(!ubuntu-us1)&&(!ubuntu-eu2)&&(!qnode3)&&(!H23) #4256
Date Fri, 22 Sep 2017 16:05:25 GMT
See <https://builds.apache.org/job/Mesos-Buildbot/BUILDTOOL=autotools,COMPILER=gcc,CONFIGURATION=--verbose%20--enable-libevent%20--enable-ssl,ENVIRONMENT=GLOG_v=1%20MESOS_VERBOSE=1,OS=ubuntu%3A14.04,label_exp=(ubuntu)&&(!ubuntu-us1)&&(!ubuntu-eu2)&&(!qnode3)&&(!H23)/4256/display/redirect?page=changes>

Changes:

[klueska] Updated Python linter to work with multiple directories.

------------------------------------------
[...truncated 33.10 MB...]
I0922 16:05:14.722472 30322 slave.cpp:254] Mesos agent started on (817)@172.17.0.2:40823
I0922 16:05:14.722512 30322 slave.cpp:255] Flags at startup: --acls="" --appc_simple_discovery_uri_prefix="http://"
--appc_store_dir="/tmp/Endpoint_SlaveEndpointTest_UnauthorizedRequest_0_ZGfiGW/store/appc"
--authenticate_http_executors="true" --authenticate_http_readonly="true" --authenticate_http_readwrite="true"
--authenticatee="crammd5" --authentication_backoff_factor="1secs" --authorizer="local" --cgroups_cpu_enable_pids_and_tids_count="false"
--cgroups_enable_cfs="false" --cgroups_hierarchy="/sys/fs/cgroup" --cgroups_limit_swap="false"
--cgroups_root="mesos" --container_disk_watch_interval="15secs" --containerizers="mesos" --credential="/tmp/Endpoint_SlaveEndpointTest_UnauthorizedRequest_0_ZGfiGW/credential"
--default_role="*" --disallow_sharing_agent_pid_namespace="false" --disk_watch_interval="1mins"
--docker="docker" --docker_kill_orphans="true" --docker_registry="https://registry-1.docker.io"
--docker_remove_delay="6hrs" --docker_socket="/var/run/docker.sock" --docker_stop_timeout="0ns"
--docker_store_dir="/tmp/Endpoint_SlaveEndpointTest_UnauthorizedRequest_0_ZGfiGW/store/docker"
--docker_volume_checkpoint_dir="/var/run/mesos/isolators/docker/volume" --enforce_container_disk_quota="false"
--executor_registration_timeout="1mins" --executor_reregistration_timeout="2secs" --executor_secret_key="/tmp/Endpoint_SlaveEndpointTest_UnauthorizedRequest_0_ZGfiGW/executor_secret_key"
--executor_shutdown_grace_period="5secs" --fetcher_cache_dir="/tmp/Endpoint_SlaveEndpointTest_UnauthorizedRequest_0_ZGfiGW/fetch"
--fetcher_cache_size="2GB" --frameworks_home="" --gc_delay="1weeks" --gc_disk_headroom="0.1"
--hadoop_home="" --help="false" --hostname_lookup="true" --http_command_executor="false" --http_credentials="/tmp/Endpoint_SlaveEndpointTest_UnauthorizedRequest_0_ZGfiGW/http_credentials"
--http_heartbeat_interval="30secs" --initialize_driver_logging="true" --isolation="posix/cpu,posix/mem"
--launcher="posix" --launcher_dir="/mesos/mesos-1.5.0/_build/src" --logbufsecs="0" --logging_level="INFO"
--max_completed_executors_per_framework="150" --oversubscribed_resources_interval="15secs"
--perf_duration="10secs" --perf_interval="1mins" --port="5051" --qos_correction_interval_min="0ns"
--quiet="false" --recover="reconnect" --recovery_timeout="15mins" --registration_backoff_factor="10ms"
--resources="cpus:2;gpus:0;mem:1024;disk:1024;ports:[31000-32000]" --revocable_cpu_low_priority="true"
--runtime_dir="/tmp/Endpoint_SlaveEndpointTest_UnauthorizedRequest_0_ZGfiGW" --sandbox_directory="/mnt/mesos/sandbox"
--strict="true" --switch_user="true" --systemd_enable_support="true" --systemd_runtime_directory="/run/systemd/system"
--version="false" --work_dir="/tmp/Endpoint_SlaveEndpointTest_UnauthorizedRequest_0_GCB4mY"
--zk_session_timeout="10secs"
I0922 16:05:14.723004 30322 credentials.hpp:86] Loading credential for authentication from
'/tmp/Endpoint_SlaveEndpointTest_UnauthorizedRequest_0_ZGfiGW/credential'
I0922 16:05:14.723229 30322 slave.cpp:287] Agent using credential for: test-principal
I0922 16:05:14.723251 30322 credentials.hpp:37] Loading credentials for authentication from
'/tmp/Endpoint_SlaveEndpointTest_UnauthorizedRequest_0_ZGfiGW/http_credentials'
I0922 16:05:14.723536 30322 http.cpp:1045] Creating default 'basic' HTTP authenticator for
realm 'mesos-agent-executor'
I0922 16:05:14.723677 30322 http.cpp:1066] Creating default 'jwt' HTTP authenticator for realm
'mesos-agent-executor'
I0922 16:05:14.723892 30322 http.cpp:1045] Creating default 'basic' HTTP authenticator for
realm 'mesos-agent-readonly'
I0922 16:05:14.723980 30322 http.cpp:1066] Creating default 'jwt' HTTP authenticator for realm
'mesos-agent-readonly'
I0922 16:05:14.724145 30322 http.cpp:1045] Creating default 'basic' HTTP authenticator for
realm 'mesos-agent-readwrite'
I0922 16:05:14.724234 30322 http.cpp:1066] Creating default 'jwt' HTTP authenticator for realm
'mesos-agent-readwrite'
I0922 16:05:14.725649 30322 slave.cpp:585] Agent resources: [{"name":"cpus","scalar":{"value":2.0},"type":"SCALAR"},{"name":"mem","scalar":{"value":1024.0},"type":"SCALAR"},{"name":"disk","scalar":{"value":1024.0},"type":"SCALAR"},{"name":"ports","ranges":{"range":[{"begin":31000,"end":32000}]},"type":"RANGES"}]
I0922 16:05:14.725880 30322 slave.cpp:593] Agent attributes: [  ]
I0922 16:05:14.725895 30322 slave.cpp:602] Agent hostname: 93b31c0039be
I0922 16:05:14.726084 30332 status_update_manager.cpp:177] Pausing sending status updates
I0922 16:05:14.727721 30323 state.cpp:64] Recovering state from '/tmp/Endpoint_SlaveEndpointTest_UnauthorizedRequest_0_GCB4mY/meta'
I0922 16:05:14.728108 30318 status_update_manager.cpp:203] Recovering status update manager
I0922 16:05:14.728329 30340 containerizer.cpp:648] Recovering containerizer
I0922 16:05:14.729765 30341 provisioner.cpp:416] Provisioner recovery complete
I0922 16:05:14.730093 30332 slave.cpp:6322] Finished recovery
I0922 16:05:14.730758 30332 slave.cpp:6504] Querying resource estimator for oversubscribable
resources
I0922 16:05:14.731086 30338 slave.cpp:6518] Received oversubscribable resources {} from the
resource estimator
I0922 16:05:14.733472 30336 process.cpp:3929] Handling HTTP event for process 'slave(817)'
with path: '/slave(817)/monitor/statistics'
I0922 16:05:14.735450 30341 http.cpp:1185] HTTP GET for /slave(817)/monitor/statistics from
172.17.0.2:47092
I0922 16:05:14.735575 30341 http.cpp:976] Authorizing principal 'test-principal' to GET the
'/monitor/statistics' endpoint
I0922 16:05:14.737344  8671 slave.cpp:869] Agent terminating
[       OK ] Endpoint/SlaveEndpointTest.UnauthorizedRequest/0 (30 ms)
[ RUN      ] Endpoint/SlaveEndpointTest.UnauthorizedRequest/1
I0922 16:05:14.747503  8671 containerizer.cpp:292] Using isolation { environment_secret, posix/cpu,
posix/mem, filesystem/posix, network/cni }
W0922 16:05:14.747992  8671 backend.cpp:76] Failed to create 'aufs' backend: AufsBackend requires
root privileges
W0922 16:05:14.748111  8671 backend.cpp:76] Failed to create 'bind' backend: BindBackend requires
root privileges
I0922 16:05:14.748162  8671 provisioner.cpp:255] Using default backend 'copy'
I0922 16:05:14.751366 30338 slave.cpp:254] Mesos agent started on (818)@172.17.0.2:40823
I0922 16:05:14.751436 30338 slave.cpp:255] Flags at startup: --acls="" --appc_simple_discovery_uri_prefix="http://"
--appc_store_dir="/tmp/Endpoint_SlaveEndpointTest_UnauthorizedRequest_1_RxokaQ/store/appc"
--authenticate_http_executors="true" --authenticate_http_readonly="true" --authenticate_http_readwrite="true"
--authenticatee="crammd5" --authentication_backoff_factor="1secs" --authorizer="local" --cgroups_cpu_enable_pids_and_tids_count="false"
--cgroups_enable_cfs="false" --cgroups_hierarchy="/sys/fs/cgroup" --cgroups_limit_swap="false"
--cgroups_root="mesos" --container_disk_watch_interval="15secs" --containerizers="mesos" --credential="/tmp/Endpoint_SlaveEndpointTest_UnauthorizedRequest_1_RxokaQ/credential"
--default_role="*" --disallow_sharing_agent_pid_namespace="false" --disk_watch_interval="1mins"
--docker="docker" --docker_kill_orphans="true" --docker_registry="https://registry-1.docker.io"
--docker_remove_delay="6hrs" --docker_socket="/var/run/docker.sock" --docker_stop_timeout="0ns"
--docker_store_dir="/tmp/Endpoint_SlaveEndpointTest_UnauthorizedRequest_1_RxokaQ/store/docker"
--docker_volume_checkpoint_dir="/var/run/mesos/isolators/docker/volume" --enforce_container_disk_quota="false"
--executor_registration_timeout="1mins" --executor_reregistration_timeout="2secs" --executor_secret_key="/tmp/Endpoint_SlaveEndpointTest_UnauthorizedRequest_1_RxokaQ/executor_secret_key"
--executor_shutdown_grace_period="5secs" --fetcher_cache_dir="/tmp/Endpoint_SlaveEndpointTest_UnauthorizedRequest_1_RxokaQ/fetch"
--fetcher_cache_size="2GB" --frameworks_home="" --gc_delay="1weeks" --gc_disk_headroom="0.1"
--hadoop_home="" --help="false" --hostname_lookup="true" --http_command_executor="false" --http_credentials="/tmp/Endpoint_SlaveEndpointTest_UnauthorizedRequest_1_RxokaQ/http_credentials"
--http_heartbeat_interval="30secs" --initialize_driver_logging="true" --isolation="posix/cpu,posix/mem"
--launcher="posix" --launcher_dir="/mesos/mesos-1.5.0/_build/src" --logbufsecs="0" --logging_level="INFO"
--max_completed_executors_per_framework="150" --oversubscribed_resources_interval="15secs"
--perf_duration="10secs" --perf_interval="1mins" --port="5051" --qos_correction_interval_min="0ns"
--quiet="false" --recover="reconnect" --recovery_timeout="15mins" --registration_backoff_factor="10ms"
--resources="cpus:2;gpus:0;mem:1024;disk:1024;ports:[31000-32000]" --revocable_cpu_low_priority="true"
--runtime_dir="/tmp/Endpoint_SlaveEndpointTest_UnauthorizedRequest_1_RxokaQ" --sandbox_directory="/mnt/mesos/sandbox"
--strict="true" --switch_user="true" --systemd_enable_support="true" --systemd_runtime_directory="/run/systemd/system"
--version="false" --work_dir="/tmp/Endpoint_SlaveEndpointTest_UnauthorizedRequest_1_uEAHMR"
--zk_session_timeout="10secs"
I0922 16:05:14.751989 30338 credentials.hpp:86] Loading credential for authentication from
'/tmp/Endpoint_SlaveEndpointTest_UnauthorizedRequest_1_RxokaQ/credential'
I0922 16:05:14.752264 30338 slave.cpp:287] Agent using credential for: test-principal
I0922 16:05:14.752302 30338 credentials.hpp:37] Loading credentials for authentication from
'/tmp/Endpoint_SlaveEndpointTest_UnauthorizedRequest_1_RxokaQ/http_credentials'
I0922 16:05:14.752663 30338 http.cpp:1045] Creating default 'basic' HTTP authenticator for
realm 'mesos-agent-executor'
I0922 16:05:14.752931 30338 http.cpp:1066] Creating default 'jwt' HTTP authenticator for realm
'mesos-agent-executor'
I0922 16:05:14.753201 30338 http.cpp:1045] Creating default 'basic' HTTP authenticator for
realm 'mesos-agent-readonly'
I0922 16:05:14.753291 30338 http.cpp:1066] Creating default 'jwt' HTTP authenticator for realm
'mesos-agent-readonly'
I0922 16:05:14.753470 30338 http.cpp:1045] Creating default 'basic' HTTP authenticator for
realm 'mesos-agent-readwrite'
I0922 16:05:14.753568 30338 http.cpp:1066] Creating default 'jwt' HTTP authenticator for realm
'mesos-agent-readwrite'
I0922 16:05:14.755126 30338 slave.cpp:585] Agent resources: [{"name":"cpus","scalar":{"value":2.0},"type":"SCALAR"},{"name":"mem","scalar":{"value":1024.0},"type":"SCALAR"},{"name":"disk","scalar":{"value":1024.0},"type":"SCALAR"},{"name":"ports","ranges":{"range":[{"begin":31000,"end":32000}]},"type":"RANGES"}]
I0922 16:05:14.755358 30338 slave.cpp:593] Agent attributes: [  ]
I0922 16:05:14.755373 30338 slave.cpp:602] Agent hostname: 93b31c0039be
I0922 16:05:14.755537 30333 status_update_manager.cpp:177] Pausing sending status updates
I0922 16:05:14.757336 30339 state.cpp:64] Recovering state from '/tmp/Endpoint_SlaveEndpointTest_UnauthorizedRequest_1_uEAHMR/meta'
I0922 16:05:14.757688 30321 status_update_manager.cpp:203] Recovering status update manager
I0922 16:05:14.757902 30330 containerizer.cpp:648] Recovering containerizer
I0922 16:05:14.759354 30327 provisioner.cpp:416] Provisioner recovery complete
I0922 16:05:14.759699 30333 slave.cpp:6322] Finished recovery
I0922 16:05:14.760318 30333 slave.cpp:6504] Querying resource estimator for oversubscribable
resources
I0922 16:05:14.760618 30328 slave.cpp:6518] Received oversubscribable resources {} from the
resource estimator
I0922 16:05:14.763013 30320 process.cpp:3929] Handling HTTP event for process 'slave(818)'
with path: '/slave(818)/monitor/statistics.json'
I0922 16:05:14.765211 30327 http.cpp:1185] HTTP GET for /slave(818)/monitor/statistics.json
from 172.17.0.2:47094
I0922 16:05:14.765295 30327 http.cpp:976] Authorizing principal 'test-principal' to GET the
'/monitor/statistics.json' endpoint
I0922 16:05:14.767349 30324 slave.cpp:869] Agent terminating
[       OK ] Endpoint/SlaveEndpointTest.UnauthorizedRequest/1 (31 ms)
[ RUN      ] Endpoint/SlaveEndpointTest.UnauthorizedRequest/2
I0922 16:05:14.778995  8671 containerizer.cpp:292] Using isolation { environment_secret, posix/cpu,
posix/mem, filesystem/posix, network/cni }
W0922 16:05:14.779505  8671 backend.cpp:76] Failed to create 'aufs' backend: AufsBackend requires
root privileges
W0922 16:05:14.779616  8671 backend.cpp:76] Failed to create 'bind' backend: BindBackend requires
root privileges
I0922 16:05:14.779700  8671 provisioner.cpp:255] Using default backend 'copy'
I0922 16:05:14.783079 30337 slave.cpp:254] Mesos agent started on (819)@172.17.0.2:40823
I0922 16:05:14.783146 30337 slave.cpp:255] Flags at startup: --acls="" --appc_simple_discovery_uri_prefix="http://"
--appc_store_dir="/tmp/Endpoint_SlaveEndpointTest_UnauthorizedRequest_2_mRYKWJ/store/appc"
--authenticate_http_executors="true" --authenticate_http_readonly="true" --authenticate_http_readwrite="true"
--authenticatee="crammd5" --authentication_backoff_factor="1secs" --authorizer="local" --cgroups_cpu_enable_pids_and_tids_count="false"
--cgroups_enable_cfs="false" --cgroups_hierarchy="/sys/fs/cgroup" --cgroups_limit_swap="false"
--cgroups_root="mesos" --container_disk_watch_interval="15secs" --containerizers="mesos" --credential="/tmp/Endpoint_SlaveEndpointTest_UnauthorizedRequest_2_mRYKWJ/credential"
--default_role="*" --disallow_sharing_agent_pid_namespace="false" --disk_watch_interval="1mins"
--docker="docker" --docker_kill_orphans="true" --docker_registry="https://registry-1.docker.io"
--docker_remove_delay="6hrs" --docker_socket="/var/run/docker.sock" --docker_stop_timeout="0ns"
--docker_store_dir="/tmp/Endpoint_SlaveEndpointTest_UnauthorizedRequest_2_mRYKWJ/store/docker"
--docker_volume_checkpoint_dir="/var/run/mesos/isolators/docker/volume" --enforce_container_disk_quota="false"
--executor_registration_timeout="1mins" --executor_reregistration_timeout="2secs" --executor_secret_key="/tmp/Endpoint_SlaveEndpointTest_UnauthorizedRequest_2_mRYKWJ/executor_secret_key"
--executor_shutdown_grace_period="5secs" --fetcher_cache_dir="/tmp/Endpoint_SlaveEndpointTest_UnauthorizedRequest_2_mRYKWJ/fetch"
--fetcher_cache_size="2GB" --frameworks_home="" --gc_delay="1weeks" --gc_disk_headroom="0.1"
--hadoop_home="" --help="false" --hostname_lookup="true" --http_command_executor="false" --http_credentials="/tmp/Endpoint_SlaveEndpointTest_UnauthorizedRequest_2_mRYKWJ/http_credentials"
--http_heartbeat_interval="30secs" --initialize_driver_logging="true" --isolation="posix/cpu,posix/mem"
--launcher="posix" --launcher_dir="/mesos/mesos-1.5.0/_build/src" --logbufsecs="0" --logging_level="INFO"
--max_completed_executors_per_framework="150" --oversubscribed_resources_interval="15secs"
--perf_duration="10secs" --perf_interval="1mins" --port="5051" --qos_correction_interval_min="0ns"
--quiet="false" --recover="reconnect" --recovery_timeout="15mins" --registration_backoff_factor="10ms"
--resources="cpus:2;gpus:0;mem:1024;disk:1024;ports:[31000-32000]" --revocable_cpu_low_priority="true"
--runtime_dir="/tmp/Endpoint_SlaveEndpointTest_UnauthorizedRequest_2_mRYKWJ" --sandbox_directory="/mnt/mesos/sandbox"
--strict="true" --switch_user="true" --systemd_enable_support="true" --systemd_runtime_directory="/run/systemd/system"
--version="false" --work_dir="/tmp/Endpoint_SlaveEndpointTest_UnauthorizedRequest_2_owXsuL"
--zk_session_timeout="10secs"
I0922 16:05:14.783831 30337 credentials.hpp:86] Loading credential for authentication from
'/tmp/Endpoint_SlaveEndpointTest_UnauthorizedRequest_2_mRYKWJ/credential'
I0922 16:05:14.784121 30337 slave.cpp:287] Agent using credential for: test-principal
I0922 16:05:14.784142 30337 credentials.hpp:37] Loading credentials for authentication from
'/tmp/Endpoint_SlaveEndpointTest_UnauthorizedRequest_2_mRYKWJ/http_credentials'
I0922 16:05:14.784507 30337 http.cpp:1045] Creating default 'basic' HTTP authenticator for
realm 'mesos-agent-executor'
I0922 16:05:14.784760 30337 http.cpp:1066] Creating default 'jwt' HTTP authenticator for realm
'mesos-agent-executor'
I0922 16:05:14.785050 30337 http.cpp:1045] Creating default 'basic' HTTP authenticator for
realm 'mesos-agent-readonly'
I0922 16:05:14.785166 30337 http.cpp:1066] Creating default 'jwt' HTTP authenticator for realm
'mesos-agent-readonly'
I0922 16:05:14.785471 30337 http.cpp:1045] Creating default 'basic' HTTP authenticator for
realm 'mesos-agent-readwrite'
I0922 16:05:14.785765 30337 http.cpp:1066] Creating default 'jwt' HTTP authenticator for realm
'mesos-agent-readwrite'
I0922 16:05:14.788033 30337 slave.cpp:585] Agent resources: [{"name":"cpus","scalar":{"value":2.0},"type":"SCALAR"},{"name":"mem","scalar":{"value":1024.0},"type":"SCALAR"},{"name":"disk","scalar":{"value":1024.0},"type":"SCALAR"},{"name":"ports","ranges":{"range":[{"begin":31000,"end":32000}]},"type":"RANGES"}]
I0922 16:05:14.788667 30337 slave.cpp:593] Agent attributes: [  ]
I0922 16:05:14.788750 30337 slave.cpp:602] Agent hostname: 93b31c0039be
I0922 16:05:14.788997 30336 status_update_manager.cpp:177] Pausing sending status updates
I0922 16:05:14.791322 30327 state.cpp:64] Recovering state from '/tmp/Endpoint_SlaveEndpointTest_UnauthorizedRequest_2_owXsuL/meta'
I0922 16:05:14.791740 30322 status_update_manager.cpp:203] Recovering status update manager
I0922 16:05:14.791987 30340 containerizer.cpp:648] Recovering containerizer
I0922 16:05:14.793488 30338 provisioner.cpp:416] Provisioner recovery complete
I0922 16:05:14.793813 30323 slave.cpp:6322] Finished recovery
I0922 16:05:14.794421 30323 slave.cpp:6504] Querying resource estimator for oversubscribable
resources
I0922 16:05:14.794776 30330 slave.cpp:6518] Received oversubscribable resources {} from the
resource estimator
I0922 16:05:14.798220 30321 process.cpp:3929] Handling HTTP event for process 'slave(819)'
with path: '/slave(819)/containers'
I0922 16:05:14.800637 30338 http.cpp:1185] HTTP GET for /slave(819)/containers from 172.17.0.2:47096
I0922 16:05:14.800705 30338 http.cpp:976] Authorizing principal 'test-principal' to GET the
'/containers' endpoint
I0922 16:05:14.803737  8671 slave.cpp:869] Agent terminating
[       OK ] Endpoint/SlaveEndpointTest.UnauthorizedRequest/2 (35 ms)
[ RUN      ] Endpoint/SlaveEndpointTest.NoAuthorizer/0
I0922 16:05:14.814221  8671 containerizer.cpp:292] Using isolation { environment_secret, posix/cpu,
posix/mem, filesystem/posix, network/cni }
W0922 16:05:14.814685  8671 backend.cpp:76] Failed to create 'aufs' backend: AufsBackend requires
root privileges
W0922 16:05:14.814800  8671 backend.cpp:76] Failed to create 'bind' backend: BindBackend requires
root privileges
I0922 16:05:14.814865  8671 provisioner.cpp:255] Using default backend 'copy'
I0922 16:05:14.816325  8671 cluster.cpp:448] Creating default 'local' authorizer
I0922 16:05:14.818047 30321 slave.cpp:254] Mesos agent started on (820)@172.17.0.2:40823
I0922 16:05:14.818321 30321 slave.cpp:255] Flags at startup: --acls="" --appc_simple_discovery_uri_prefix="http://"
--appc_store_dir="/tmp/Endpoint_SlaveEndpointTest_NoAuthorizer_0_Nmu23D/store/appc" --authenticate_http_executors="true"
--authenticate_http_readonly="true" --authenticate_http_readwrite="true" --authenticatee="crammd5"
--authentication_backoff_factor="1secs" --authorizer="local" --cgroups_cpu_enable_pids_and_tids_count="false"
--cgroups_enable_cfs="false" --cgroups_hierarchy="/sys/fs/cgroup" --cgroups_limit_swap="false"
--cgroups_root="mesos" --container_disk_watch_interval="15secs" --containerizers="mesos" --credential="/tmp/Endpoint_SlaveEndpointTest_NoAuthorizer_0_Nmu23D/credential"
--default_role="*" --disallow_sharing_agent_pid_namespace="false" --disk_watch_interval="1mins"
--docker="docker" --docker_kill_orphans="true" --docker_registry="https://registry-1.docker.io"
--docker_remove_delay="6hrs" --docker_socket="/var/run/docker.sock" --docker_stop_timeout="0ns"
--docker_store_dir="/tmp/Endpoint_SlaveEndpointTest_NoAuthorizer_0_Nmu23D/store/docker" --docker_volume_checkpoint_dir="/var/run/mesos/isolators/docker/volume"
--enforce_container_disk_quota="false" --executor_registration_timeout="1mins" --executor_reregistration_timeout="2secs"
--executor_secret_key="/tmp/Endpoint_SlaveEndpointTest_NoAuthorizer_0_Nmu23D/executor_secret_key"
--executor_shutdown_grace_period="5secs" --fetcher_cache_dir="/tmp/Endpoint_SlaveEndpointTest_NoAuthorizer_0_Nmu23D/fetch"
--fetcher_cache_size="2GB" --frameworks_home="" --gc_delay="1weeks" --gc_disk_headroom="0.1"
--hadoop_home="" --help="false" --hostname_lookup="true" --http_command_executor="false" --http_credentials="/tmp/Endpoint_SlaveEndpointTest_NoAuthorizer_0_Nmu23D/http_credentials"
--http_heartbeat_interval="30secs" --initialize_driver_logging="true" --isolation="posix/cpu,posix/mem"
--launcher="posix" --launcher_dir="/mesos/mesos-1.5.0/_build/src" --logbufsecs="0" --logging_level="INFO"
--max_completed_executors_per_framework="150" --oversubscribed_resources_interval="15secs"
--perf_duration="10secs" --perf_interval="1mins" --port="5051" --qos_correction_interval_min="0ns"
--quiet="false" --recover="reconnect" --recovery_timeout="15mins" --registration_backoff_factor="10ms"
--resources="cpus:2;gpus:0;mem:1024;disk:1024;ports:[31000-32000]" --revocable_cpu_low_priority="true"
--runtime_dir="/tmp/Endpoint_SlaveEndpointTest_NoAuthorizer_0_Nmu23D" --sandbox_directory="/mnt/mesos/sandbox"
--strict="true" --switch_user="true" --systemd_enable_support="true" --systemd_runtime_directory="/run/systemd/system"
--version="false" --work_dir="/tmp/Endpoint_SlaveEndpointTest_NoAuthorizer_0_XbZuwF" --zk_session_timeout="10secs"
I0922 16:05:14.819195 30321 credentials.hpp:86] Loading credential for authentication from
'/tmp/Endpoint_SlaveEndpointTest_NoAuthorizer_0_Nmu23D/credential'
I0922 16:05:14.819610 30321 slave.cpp:287] Agent using credential for: test-principal
I0922 16:05:14.819715 30321 credentials.hpp:37] Loading credentials for authentication from
'/tmp/Endpoint_SlaveEndpointTest_NoAuthorizer_0_Nmu23D/http_credentials'
I0922 16:05:14.820215 30321 http.cpp:1045] Creating default 'basic' HTTP authenticator for
realm 'mesos-agent-executor'
I0922 16:05:14.820619 30321 http.cpp:1066] Creating default 'jwt' HTTP authenticator for realm
'mesos-agent-executor'
I0922 16:05:14.821051 30321 http.cpp:1045] Creating default 'basic' HTTP authenticator for
realm 'mesos-agent-readonly'
I0922 16:05:14.821305 30321 http.cpp:1066] Creating default 'jwt' HTTP authenticator for realm
'mesos-agent-readonly'
I0922 16:05:14.821646 30321 http.cpp:1045] Creating default 'basic' HTTP authenticator for
realm 'mesos-agent-readwrite'
I0922 16:05:14.821903 30321 http.cpp:1066] Creating default 'jwt' HTTP authenticator for realm
'mesos-agent-readwrite'
I0922 16:05:14.823895 30321 slave.cpp:585] Agent resources: [{"name":"cpus","scalar":{"value":2.0},"type":"SCALAR"},{"name":"mem","scalar":{"value":1024.0},"type":"SCALAR"},{"name":"disk","scalar":{"value":1024.0},"type":"SCALAR"},{"name":"ports","ranges":{"range":[{"begin":31000,"end":32000}]},"type":"RANGES"}]
I0922 16:05:14.824388 30321 slave.cpp:593] Agent attributes: [  ]
I0922 16:05:14.824468 30321 slave.cpp:602] Agent hostname: 93b31c0039be
I0922 16:05:14.824715 30334 status_update_manager.cpp:177] Pausing sending status updates
I0922 16:05:14.826670 30338 state.cpp:64] Recovering state from '/tmp/Endpoint_SlaveEndpointTest_NoAuthorizer_0_XbZuwF/meta'
I0922 16:05:14.826930 30328 status_update_manager.cpp:203] Recovering status update manager
I0922 16:05:14.827127 30335 containerizer.cpp:648] Recovering containerizer
I0922 16:05:14.828543 30329 provisioner.cpp:416] Provisioner recovery complete
I0922 16:05:14.828855 30339 slave.cpp:6322] Finished recovery
I0922 16:05:14.829222 30339 slave.cpp:6504] Querying resource estimator for oversubscribable
resources
I0922 16:05:14.829447 30336 slave.cpp:6518] Received oversubscribable resources {} from the
resource estimator
I0922 16:05:14.831389 30330 process.cpp:3929] Handling HTTP event for process 'slave(820)'
with path: '/slave(820)/monitor/statistics'
I0922 16:05:14.833554 30334 http.cpp:1185] HTTP GET for /slave(820)/monitor/statistics from
172.17.0.2:47098
I0922 16:05:14.833613 30334 http.cpp:976] Authorizing principal 'test-principal' to GET the
'/monitor/statistics' endpoint
I0922 16:05:14.846556  8671 slave.cpp:869] Agent terminating
[       OK ] Endpoint/SlaveEndpointTest.NoAuthorizer/0 (43 ms)
[ RUN      ] Endpoint/SlaveEndpointTest.NoAuthorizer/1
I0922 16:05:14.857452  8671 containerizer.cpp:292] Using isolation { environment_secret, posix/cpu,
posix/mem, filesystem/posix, network/cni }
W0922 16:05:14.857902  8671 backend.cpp:76] Failed to create 'aufs' backend: AufsBackend requires
root privileges
W0922 16:05:14.858006  8671 backend.cpp:76] Failed to create 'bind' backend: BindBackend requires
root privileges
I0922 16:05:14.858052  8671 provisioner.cpp:255] Using default backend 'copy'
I0922 16:05:14.859489  8671 cluster.cpp:448] Creating default 'local' authorizer
I0922 16:05:14.861126 30324 slave.cpp:254] Mesos agent started on (821)@172.17.0.2:40823
I0922 16:05:14.861150 30324 slave.cpp:255] Flags at startup: --acls="" --appc_simple_discovery_uri_prefix="http://"
--appc_store_dir="/tmp/Endpoint_SlaveEndpointTest_NoAuthorizer_1_xSRNzy/store/appc" --authenticate_http_executors="true"
--authenticate_http_readonly="true" --authenticate_http_readwrite="true" --authenticatee="crammd5"
--authentication_backoff_factor="1secs" --authorizer="local" --cgroups_cpu_enable_pids_and_tids_count="false"
--cgroups_enable_cfs="false" --cgroups_hierarchy="/sys/fs/cgroup" --cgroups_limit_swap="false"
--cgroups_root="mesos" --container_disk_watch_interval="15secs" --containerizers="mesos" --credential="/tmp/Endpoint_SlaveEndpointTest_NoAuthorizer_1_xSRNzy/credential"
--default_role="*" --disallow_sharing_agent_pid_namespace="false" --disk_watch_interval="1mins"
--docker="docker" --docker_kill_orphans="true" --docker_registry="https://registry-1.docker.io"
--docker_remove_delay="6hrs" --docker_socket="/var/run/docker.sock" --docker_stop_timeout="0ns"
--docker_store_dir="/tmp/Endpoint_SlaveEndpointTest_NoAuthorizer_1_xSRNzy/store/docker" --docker_volume_checkpoint_dir="/var/run/mesos/isolators/docker/volume"
--enforce_container_disk_quota="false" --executor_registration_timeout="1mins" --executor_reregistration_timeout="2secs"
--executor_secret_key="/tmp/Endpoint_SlaveEndpointTest_NoAuthorizer_1_xSRNzy/executor_secret_key"
--executor_shutdown_grace_period="5secs" --fetcher_cache_dir="/tmp/Endpoint_SlaveEndpointTest_NoAuthorizer_1_xSRNzy/fetch"
--fetcher_cache_size="2GB" --frameworks_home="" --gc_delay="1weeks" --gc_disk_headroom="0.1"
--hadoop_home="" --help="false" --hostname_lookup="true" --http_command_executor="false" --http_credentials="/tmp/Endpoint_SlaveEndpointTest_NoAuthorizer_1_xSRNzy/http_credentials"
--http_heartbeat_interval="30secs" --initialize_driver_logging="true" --isolation="posix/cpu,posix/mem"
--launcher="posix" --launcher_dir="/mesos/mesos-1.5.0/_build/src" --logbufsecs="0" --logging_level="INFO"
--max_completed_executors_per_framework="150" --oversubscribed_resources_interval="15secs"
--perf_duration="10secs" --perf_interval="1mins" --port="5051" --qos_correction_interval_min="0ns"
--quiet="false" --recover="reconnect" --recovery_timeout="15mins" --registration_backoff_factor="10ms"
--resources="cpus:2;gpus:0;mem:1024;disk:1024;ports:[31000-32000]" --revocable_cpu_low_priority="true"
--runtime_dir="/tmp/Endpoint_SlaveEndpointTest_NoAuthorizer_1_xSRNzy" --sandbox_directory="/mnt/mesos/sandbox"
--strict="true" --switch_user="true" --systemd_enable_support="true" --systemd_runtime_directory="/run/systemd/system"
--version="false" --work_dir="/tmp/Endpoint_SlaveEndpointTest_NoAuthorizer_1_ZRVPVz" --zk_session_timeout="10secs"
I0922 16:05:14.861623 30324 credentials.hpp:86] Loading credential for authentication from
'/tmp/Endpoint_SlaveEndpointTest_NoAuthorizer_1_xSRNzy/credential'
I0922 16:05:14.861778 30324 slave.cpp:287] Agent using credential for: test-principal
I0922 16:05:14.861805 30324 credentials.hpp:37] Loading credentials for authentication from
'/tmp/Endpoint_SlaveEndpointTest_NoAuthorizer_1_xSRNzy/http_credentials'
I0922 16:05:14.862121 30324 http.cpp:1045] Creating default 'basic' HTTP authenticator for
realm 'mesos-agent-executor'
I0922 16:05:14.862246 30324 http.cpp:1066] Creating default 'jwt' HTTP authenticator for realm
'mesos-agent-executor'
I0922 16:05:14.862469 30324 http.cpp:1045] Creating default 'basic' HTTP authenticator for
realm 'mesos-agent-readonly'
I0922 16:05:14.862572 30324 http.cpp:1066] Creating default 'jwt' HTTP authenticator for realm
'mesos-agent-readonly'
I0922 16:05:14.862756 30324 http.cpp:1045] Creating default 'basic' HTTP authenticator for
realm 'mesos-agent-readwrite'
I0922 16:05:14.862855 30324 http.cpp:1066] Creating default 'jwt' HTTP authenticator for realm
'mesos-agent-readwrite'
I0922 16:05:14.864328 30324 slave.cpp:585] Agent resources: [{"name":"cpus","scalar":{"value":2.0},"type":"SCALAR"},{"name":"mem","scalar":{"value":1024.0},"type":"SCALAR"},{"name":"disk","scalar":{"value":1024.0},"type":"SCALAR"},{"name":"ports","ranges":{"range":[{"begin":31000,"end":32000}]},"type":"RANGES"}]
I0922 16:05:14.864576 30324 slave.cpp:593] Agent attributes: [  ]
I0922 16:05:14.864589 30324 slave.cpp:602] Agent hostname: 93b31c0039be
I0922 16:05:14.864740 30340 status_update_manager.cpp:177] Pausing sending status updates
I0922 16:05:14.866098 30327 state.cpp:64] Recovering state from '/tmp/Endpoint_SlaveEndpointTest_NoAuthorizer_1_ZRVPVz/meta'
I0922 16:05:14.866698 30328 status_update_manager.cpp:203] Recovering status update manager
I0922 16:05:14.866961 30326 containerizer.cpp:648] Recovering containerizer
I0922 16:05:14.868588 30321 provisioner.cpp:416] Provisioner recovery complete
I0922 16:05:14.868991 30329 slave.cpp:6322] Finished recovery
I0922 16:05:14.869778 30329 slave.cpp:6504] Querying resource estimator for oversubscribable
resources
I0922 16:05:14.870157 30329 slave.cpp:6518] Received oversubscribable resources {} from the
resource estimator
I0922 16:05:14.873883 30320 process.cpp:3929] Handling HTTP event for process 'slave(821)'
with path: '/slave(821)/monitor/statistics.json'
I0922 16:05:14.876579 30321 http.cpp:1185] HTTP GET for /slave(821)/monitor/statistics.json
from 172.17.0.2:47100
I0922 16:05:14.876687 30321 http.cpp:976] Authorizing principal 'test-principal' to GET the
'/monitor/statistics.json' endpoint
I0922 16:05:14.882087 30337 slave.cpp:869] Agent terminating
[       OK ] Endpoint/SlaveEndpointTest.NoAuthorizer/1 (37 ms)
[ RUN      ] Endpoint/SlaveEndpointTest.NoAuthorizer/2
I0922 16:05:14.894832  8671 containerizer.cpp:292] Using isolation { environment_secret, posix/cpu,
posix/mem, filesystem/posix, network/cni }
W0922 16:05:14.895468  8671 backend.cpp:76] Failed to create 'aufs' backend: AufsBackend requires
root privileges
W0922 16:05:14.895612  8671 backend.cpp:76] Failed to create 'bind' backend: BindBackend requires
root privileges
I0922 16:05:14.895659  8671 provisioner.cpp:255] Using default backend 'copy'
I0922 16:05:14.897418  8671 cluster.cpp:448] Creating default 'local' authorizer
I0922 16:05:14.899904 30321 slave.cpp:254] Mesos agent started on (822)@172.17.0.2:40823
I0922 16:05:14.899936 30321 slave.cpp:255] Flags at startup: --acls="" --appc_simple_discovery_uri_prefix="http://"
--appc_store_dir="/tmp/Endpoint_SlaveEndpointTest_NoAuthorizer_2_X0n5rt/store/appc" --authenticate_http_executors="true"
--authenticate_http_readonly="true" --authenticate_http_readwrite="true" --authenticatee="crammd5"
--authentication_backoff_factor="1secs" --authorizer="local" --cgroups_cpu_enable_pids_and_tids_count="false"
--cgroups_enable_cfs="false" --cgroups_hierarchy="/sys/fs/cgroup" --cgroups_limit_swap="false"
--cgroups_root="mesos" --container_disk_watch_interval="15secs" --containerizers="mesos" --credential="/tmp/Endpoint_SlaveEndpointTest_NoAuthorizer_2_X0n5rt/credential"
--default_role="*" --disallow_sharing_agent_pid_namespace="false" --disk_watch_interval="1mins"
--docker="docker" --docker_kill_orphans="true" --docker_registry="https://registry-1.docker.io"
--docker_remove_delay="6hrs" --docker_socket="/var/run/docker.sock" --docker_stop_timeout="0ns"
--docker_store_dir="/tmp/Endpoint_SlaveEndpointTest_NoAuthorizer_2_X0n5rt/store/docker" --docker_volume_checkpoint_dir="/var/run/mesos/isolators/docker/volume"
--enforce_container_disk_quota="false" --executor_registration_timeout="1mins" --executor_reregistration_timeout="2secs"
--executor_secret_key="/tmp/Endpoint_SlaveEndpointTest_NoAuthorizer_2_X0n5rt/executor_secret_key"
--executor_shutdown_grace_period="5secs" --fetcher_cache_dir="/tmp/Endpoint_SlaveEndpointTest_NoAuthorizer_2_X0n5rt/fetch"
--fetcher_cache_size="2GB" --frameworks_home="" --gc_delay="1weeks" --gc_disk_headroom="0.1"
--hadoop_home="" --help="false" --hostname_lookup="true" --http_command_executor="false" --http_credentials="/tmp/Endpoint_SlaveEndpointTest_NoAuthorizer_2_X0n5rt/http_credentials"
--http_heartbeat_interval="30secs" --initialize_driver_logging="true" --isolation="posix/cpu,posix/mem"
--launcher="posix" --launcher_dir="/mesos/mesos-1.5.0/_build/src" --logbufsecs="0" --logging_level="INFO"
--max_completed_executors_per_framework="150" --oversubscribed_resources_interval="15secs"
--perf_duration="10secs" --perf_interval="1mins" --port="5051" --qos_correction_interval_min="0ns"
--quiet="false" --recover="reconnect" --recovery_timeout="15mins" --registration_backoff_factor="10ms"
--resources="cpus:2;gpus:0;mem:1024;disk:1024;ports:[31000-32000]" --revocable_cpu_low_priority="true"
--runtime_dir="/tmp/Endpoint_SlaveEndpointTest_NoAuthorizer_2_X0n5rt" --sandbox_directory="/mnt/mesos/sandbox"
--strict="true" --switch_user="true" --systemd_enable_support="true" --systemd_runtime_directory="/run/systemd/system"
--version="false" --work_dir="/tmp/Endpoint_SlaveEndpointTest_NoAuthorizer_2_G77AIu" --zk_session_timeout="10secs"
I0922 16:05:14.900413 30321 credentials.hpp:86] Loading credential for authentication from
'/tmp/Endpoint_SlaveEndpointTest_NoAuthorizer_2_X0n5rt/credential'
I0922 16:05:14.900645 30321 slave.cpp:287] Agent using credential for: test-principal
I0922 16:05:14.900665 30321 credentials.hpp:37] Loading credentials for authentication from
'/tmp/Endpoint_SlaveEndpointTest_NoAuthorizer_2_X0n5rt/http_credentials'
I0922 16:05:14.900992 30321 http.cpp:1045] Creating default 'basic' HTTP authenticator for
realm 'mesos-agent-executor'
I0922 16:05:14.901139 30321 http.cpp:1066] Creating default 'jwt' HTTP authenticator for realm
'mesos-agent-executor'
I0922 16:05:14.901365 30321 http.cpp:1045] Creating default 'basic' HTTP authenticator for
realm 'mesos-agent-readonly'
I0922 16:05:14.901466 30321 http.cpp:1066] Creating default 'jwt' HTTP authenticator for realm
'mesos-agent-readonly'
I0922 16:05:14.901655 30321 http.cpp:1045] Creating default 'basic' HTTP authenticator for
realm 'mesos-agent-readwrite'
I0922 16:05:14.901758 30321 http.cpp:1066] Creating default 'jwt' HTTP authenticator for realm
'mesos-agent-readwrite'
I0922 16:05:14.903445 30321 slave.cpp:585] Agent resources: [{"name":"cpus","scalar":{"value":2.0},"type":"SCALAR"},{"name":"mem","scalar":{"value":1024.0},"type":"SCALAR"},{"name":"disk","scalar":{"value":1024.0},"type":"SCALAR"},{"name":"ports","ranges":{"range":[{"begin":31000,"end":32000}]},"type":"RANGES"}]
I0922 16:05:14.903758 30321 slave.cpp:593] Agent attributes: [  ]
I0922 16:05:14.903775 30321 slave.cpp:602] Agent hostname: 93b31c0039be
I0922 16:05:14.903961 30326 status_update_manager.cpp:177] Pausing sending status updates
I0922 16:05:14.905735 30340 state.cpp:64] Recovering state from '/tmp/Endpoint_SlaveEndpointTest_NoAuthorizer_2_G77AIu/meta'
I0922 16:05:14.906074 30337 status_update_manager.cpp:203] Recovering status update manager
I0922 16:05:14.906330 30325 containerizer.cpp:648] Recovering containerizer
I0922 16:05:14.908124 30330 provisioner.cpp:416] Provisioner recovery complete
I0922 16:05:14.908473 30326 slave.cpp:6322] Finished recovery
I0922 16:05:14.909217 30326 slave.cpp:6504] Querying resource estimator for oversubscribable
resources
I0922 16:05:14.909507 30334 slave.cpp:6518] Received oversubscribable resources {} from the
resource estimator
I0922 16:05:14.913137 30324 process.cpp:3929] Handling HTTP event for process 'slave(822)'
with path: '/slave(822)/containers'
I0922 16:05:14.915102 30330 http.cpp:1185] HTTP GET for /slave(822)/containers from 172.17.0.2:47102
I0922 16:05:14.915179 30330 http.cpp:976] Authorizing principal 'test-principal' to GET the
'/containers' endpoint
I0922 16:05:14.920723  8671 slave.cpp:869] Agent terminating
[       OK ] Endpoint/SlaveEndpointTest.NoAuthorizer/2 (38 ms)
[----------] 9 tests from Endpoint/SlaveEndpointTest (358 ms total)

[----------] 2 tests from ContainerizerType/DefaultContainerDNSFlagTest
[ RUN      ] ContainerizerType/DefaultContainerDNSFlagTest.ValidateFlag/0
[       OK ] ContainerizerType/DefaultContainerDNSFlagTest.ValidateFlag/0 (11 ms)
[ RUN      ] ContainerizerType/DefaultContainerDNSFlagTest.ValidateFlag/1
[       OK ] ContainerizerType/DefaultContainerDNSFlagTest.ValidateFlag/1 (11 ms)
[----------] 2 tests from ContainerizerType/DefaultContainerDNSFlagTest (22 ms total)

[----------] Global test environment tear-down
[==========] 1684 tests from 186 test cases ran. (592629 ms total)
[  PASSED  ] 1683 tests.
[  FAILED  ] 1 test, listed below:
[  FAILED  ] SlaveTest.UnreachableAgentReregisterAfterFailover

 1 FAILED TEST
  YOU HAVE 20 DISABLED TESTS

I0922 16:05:15.005637 30342 process.cpp:1068] Failed to accept socket: future discarded
make[4]: *** [check-local] Error 1
make[4]: Leaving directory `/mesos/mesos-1.5.0/_build/src'
make[3]: *** [check-am] Error 2
make[3]: Leaving directory `/mesos/mesos-1.5.0/_build/src'
make[2]: *** [check] Error 2
make[2]: Leaving directory `/mesos/mesos-1.5.0/_build/src'
make[1]: *** [check-recursive] Error 1
make[1]: Leaving directory `/mesos/mesos-1.5.0/_build'
make: *** [distcheck] Error 1
+ docker rmi mesos-1506092649-23383
Untagged: mesos-1506092649-23383:latest
Deleted: sha256:9440ad7237cc8dcc750a0083a63ab43559149d21d1c5eb3a8597f941bafc013c
Deleted: sha256:056d28d9c7467abdb1873c72c54489f3147d54e38cc9c5f8f7ff128bc6203325
Deleted: sha256:0c2d060dcb05046f8513e817c66192464058d5f23b4f1600228d23ea61c3cdaa
Deleted: sha256:03830f0a805a5ebbfa204f8d52df1234c657d2718397043b9567ddf6f89660ec
Deleted: sha256:dd03061c88b23ae4e49fa3cd8421a86b722b68b7a7e5a5cb9af2a6d0d4d6bae7
Deleted: sha256:7d5205ea58e8db5990676a35ea50dbe41d8739bdcb3453cb45fe0589d392d814
Deleted: sha256:62c8d09b70b26f7a84462799b94ff9988bd80a079ab252788141b415cd069c34
Deleted: sha256:b2dc09d71e41c5e49f508c7a37fce492e2cc6289c3ec97ae3c2967bfac17580e
Deleted: sha256:6c5934f2dd701f1544f262c45b42de177450bf5a0fc44aae05166aa2756e995b
Deleted: sha256:72b66592b8c70083d73b55366156f9ce486d0b009d80f85aba7523ff511bffca
Deleted: sha256:8f2637f297914f51da734f1b0e3c86dcd90e2028cc4c721af10fdd7abbde33e8
Deleted: sha256:66bde8eca2e30ff2e2897757d1c9d38983e1ee85e8e5b1a9942c18829c6a41ca
Deleted: sha256:2e65dbb4d31134983619d9c5d864257f816875e5a26bce2780904bdfd6d27f3b
Deleted: sha256:9534722396bead9de0b3c8d66a05cf4d6e03319caf2972a0bdbbefb1d8fe2692
Deleted: sha256:e4e4401927be43bc0dcbb3e0cf80643191c2a19a13ff340f9c665c6e02156543
Deleted: sha256:5e9453deca5bea2e61a3dcdc5eeea0b119a02873ad60cfffb3ebc22dff0949dd
Deleted: sha256:4b00b6e0614718f093a975dc540f3861b1eb15a4236942fb11f2ce11a90a086f
Deleted: sha256:c86505d57ba6bf90b57a6dc69955836d9e160d2c46fcc7cb294388f7999afd0c
Deleted: sha256:6f1f23e583bc6f5997727138ee2beef4602a5aac230c4c3dc67e693fbe309ff4
Deleted: sha256:ff8ef8ab7f39841c21aefb41a311c4011ef3bb953242ae893e7cffe20d4808f8
Deleted: sha256:0c018ac4287174928fa9bcd078ba236c43915a9495e9066aefab22935607ba98
Deleted: sha256:1763a6e27fab11b5d075acd01d93ff6ccfdfaac640f2b735b570bf16afa7d20c
Deleted: sha256:e6caf8a3bd1ec80d3a6164a2f2d7abb7bf6edfabbb6bf8e5171b32f6b9411bcd
Deleted: sha256:8505c3ef9aa1904dc9caf16f3c54a96b89c75260d5984a4c648a458ac7c28988
Deleted: sha256:e9f895aa19389d0a5a278340276f45080cc3054d70fb46c7384e770b35368467
Deleted: sha256:cc36262b0a941d4bb96772841d6fe53da6f75c4bccb20bad22a62f0ccf77d1f4
Deleted: sha256:0a0d0aff6f07d410150794dbca5f90892e85f4ae6dba608795c9f2205c534c70
Deleted: sha256:0596e18f5e25c0e544b162e1cada348ad1f296273ff9d1cbdc5410d87c2823f8
Build step 'Execute shell' marked build as failure

Mime
View raw message