mesos-builds mailing list archives

Site index · List index
Message view « Date » · « Thread »
Top « Date » · « Thread »
From Apache Jenkins Server <jenk...@builds.apache.org>
Subject Build failed in Jenkins: Mesos-Buildbot » autotools,clang,--verbose --enable-libevent --enable-ssl,GLOG_v=1 MESOS_VERBOSE=1,ubuntu:14.04,(ubuntu)&&(!ubuntu-us1)&&(!ubuntu-eu2)&&(!qnode3)&&(!H23) #4226
Date Fri, 15 Sep 2017 11:52:44 GMT
See <https://builds.apache.org/job/Mesos-Buildbot/BUILDTOOL=autotools,COMPILER=clang,CONFIGURATION=--verbose%20--enable-libevent%20--enable-ssl,ENVIRONMENT=GLOG_v=1%20MESOS_VERBOSE=1,OS=ubuntu%3A14.04,label_exp=(ubuntu)&&(!ubuntu-us1)&&(!ubuntu-eu2)&&(!qnode3)&&(!H23)/4226/display/redirect?page=changes>

Changes:

[alexr] Added workaround for a docker bug in docker build helper.

------------------------------------------
[...truncated 32.33 MB...]
I0915 11:52:33.204169 27553 credentials.hpp:86] Loading credential for authentication from
'/tmp/Endpoint_SlaveEndpointTest_UnauthorizedRequest_0_dHWw6w/credential'
I0915 11:52:33.204407 27553 slave.cpp:285] Agent using credential for: test-principal
I0915 11:52:33.204433 27553 credentials.hpp:37] Loading credentials for authentication from
'/tmp/Endpoint_SlaveEndpointTest_UnauthorizedRequest_0_dHWw6w/http_credentials'
I0915 11:52:33.204859 27553 http.cpp:1045] Creating default 'basic' HTTP authenticator for
realm 'mesos-agent-executor'
I0915 11:52:33.205080 27553 http.cpp:1066] Creating default 'jwt' HTTP authenticator for realm
'mesos-agent-executor'
I0915 11:52:33.205379 27553 http.cpp:1045] Creating default 'basic' HTTP authenticator for
realm 'mesos-agent-readonly'
I0915 11:52:33.205492 27553 http.cpp:1066] Creating default 'jwt' HTTP authenticator for realm
'mesos-agent-readonly'
I0915 11:52:33.205715 27553 http.cpp:1045] Creating default 'basic' HTTP authenticator for
realm 'mesos-agent-readwrite'
I0915 11:52:33.205838 27553 http.cpp:1066] Creating default 'jwt' HTTP authenticator for realm
'mesos-agent-readwrite'
I0915 11:52:33.207790 27553 slave.cpp:583] Agent resources: [{"name":"cpus","scalar":{"value":2.0},"type":"SCALAR"},{"name":"mem","scalar":{"value":1024.0},"type":"SCALAR"},{"name":"disk","scalar":{"value":1024.0},"type":"SCALAR"},{"name":"ports","ranges":{"range":[{"begin":31000,"end":32000}]},"type":"RANGES"}]
I0915 11:52:33.208089 27553 slave.cpp:591] Agent attributes: [  ]
I0915 11:52:33.208106 27553 slave.cpp:600] Agent hostname: ced56766cf69
I0915 11:52:33.208308 27550 status_update_manager.cpp:177] Pausing sending status updates
I0915 11:52:33.209894 27547 state.cpp:64] Recovering state from '/tmp/Endpoint_SlaveEndpointTest_UnauthorizedRequest_0_ReDYLy/meta'
I0915 11:52:33.210281 27544 status_update_manager.cpp:203] Recovering status update manager
I0915 11:52:33.210460 27544 containerizer.cpp:648] Recovering containerizer
I0915 11:52:33.211746 27551 provisioner.cpp:416] Provisioner recovery complete
I0915 11:52:33.212148 27538 slave.cpp:6298] Finished recovery
I0915 11:52:33.212641 27538 slave.cpp:6480] Querying resource estimator for oversubscribable
resources
I0915 11:52:33.212913 27548 slave.cpp:6494] Received oversubscribable resources {} from the
resource estimator
I0915 11:52:33.215196 27555 process.cpp:3929] Handling HTTP event for process 'slave(817)'
with path: '/slave(817)/monitor/statistics'
I0915 11:52:33.217321 27551 http.cpp:1185] HTTP GET for /slave(817)/monitor/statistics from
172.17.0.3:44600
I0915 11:52:33.217417 27551 http.cpp:976] Authorizing principal 'test-principal' to GET the
'/monitor/statistics' endpoint
I0915 11:52:33.219698  6902 slave.cpp:861] Agent terminating
[       OK ] Endpoint/SlaveEndpointTest.UnauthorizedRequest/0 (34 ms)
[ RUN      ] Endpoint/SlaveEndpointTest.UnauthorizedRequest/1
I0915 11:52:33.231389  6902 containerizer.cpp:292] Using isolation { environment_secret, posix/cpu,
posix/mem, filesystem/posix, network/cni }
W0915 11:52:33.231837  6902 backend.cpp:76] Failed to create 'aufs' backend: AufsBackend requires
root privileges
W0915 11:52:33.231945  6902 backend.cpp:76] Failed to create 'bind' backend: BindBackend requires
root privileges
I0915 11:52:33.231981  6902 provisioner.cpp:255] Using default backend 'copy'
I0915 11:52:33.235272 27555 slave.cpp:252] Mesos agent started on (818)@172.17.0.3:43114
I0915 11:52:33.235311 27555 slave.cpp:253] Flags at startup: --acls="" --appc_simple_discovery_uri_prefix="http://"
--appc_store_dir="/tmp/Endpoint_SlaveEndpointTest_UnauthorizedRequest_1_VJc9Hq/store/appc"
--authenticate_http_executors="true" --authenticate_http_readonly="true" --authenticate_http_readwrite="true"
--authenticatee="crammd5" --authentication_backoff_factor="1secs" --authorizer="local" --cgroups_cpu_enable_pids_and_tids_count="false"
--cgroups_enable_cfs="false" --cgroups_hierarchy="/sys/fs/cgroup" --cgroups_limit_swap="false"
--cgroups_root="mesos" --container_disk_watch_interval="15secs" --containerizers="mesos" --credential="/tmp/Endpoint_SlaveEndpointTest_UnauthorizedRequest_1_VJc9Hq/credential"
--default_role="*" --disallow_sharing_agent_pid_namespace="false" --disk_watch_interval="1mins"
--docker="docker" --docker_kill_orphans="true" --docker_registry="https://registry-1.docker.io"
--docker_remove_delay="6hrs" --docker_socket="/var/run/docker.sock" --docker_stop_timeout="0ns"
--docker_store_dir="/tmp/Endpoint_SlaveEndpointTest_UnauthorizedRequest_1_VJc9Hq/store/docker"
--docker_volume_checkpoint_dir="/var/run/mesos/isolators/docker/volume" --enforce_container_disk_quota="false"
--executor_registration_timeout="1mins" --executor_reregistration_timeout="2secs" --executor_secret_key="/tmp/Endpoint_SlaveEndpointTest_UnauthorizedRequest_1_VJc9Hq/executor_secret_key"
--executor_shutdown_grace_period="5secs" --fetcher_cache_dir="/tmp/Endpoint_SlaveEndpointTest_UnauthorizedRequest_1_VJc9Hq/fetch"
--fetcher_cache_size="2GB" --frameworks_home="" --gc_delay="1weeks" --gc_disk_headroom="0.1"
--hadoop_home="" --help="false" --hostname_lookup="true" --http_command_executor="false" --http_credentials="/tmp/Endpoint_SlaveEndpointTest_UnauthorizedRequest_1_VJc9Hq/http_credentials"
--http_heartbeat_interval="30secs" --initialize_driver_logging="true" --isolation="posix/cpu,posix/mem"
--launcher="posix" --launcher_dir="/mesos/mesos-1.5.0/_build/src" --logbufsecs="0" --logging_level="INFO"
--max_completed_executors_per_framework="150" --oversubscribed_resources_interval="15secs"
--perf_duration="10secs" --perf_interval="1mins" --port="5051" --qos_correction_interval_min="0ns"
--quiet="false" --recover="reconnect" --recovery_timeout="15mins" --registration_backoff_factor="10ms"
--resources="cpus:2;gpus:0;mem:1024;disk:1024;ports:[31000-32000]" --revocable_cpu_low_priority="true"
--runtime_dir="/tmp/Endpoint_SlaveEndpointTest_UnauthorizedRequest_1_VJc9Hq" --sandbox_directory="/mnt/mesos/sandbox"
--strict="true" --switch_user="true" --systemd_enable_support="true" --systemd_runtime_directory="/run/systemd/system"
--version="false" --work_dir="/tmp/Endpoint_SlaveEndpointTest_UnauthorizedRequest_1_tCDyis"
--zk_session_timeout="10secs"
I0915 11:52:33.235671 27555 credentials.hpp:86] Loading credential for authentication from
'/tmp/Endpoint_SlaveEndpointTest_UnauthorizedRequest_1_VJc9Hq/credential'
I0915 11:52:33.235815 27555 slave.cpp:285] Agent using credential for: test-principal
I0915 11:52:33.235837 27555 credentials.hpp:37] Loading credentials for authentication from
'/tmp/Endpoint_SlaveEndpointTest_UnauthorizedRequest_1_VJc9Hq/http_credentials'
I0915 11:52:33.236152 27555 http.cpp:1045] Creating default 'basic' HTTP authenticator for
realm 'mesos-agent-executor'
I0915 11:52:33.236326 27555 http.cpp:1066] Creating default 'jwt' HTTP authenticator for realm
'mesos-agent-executor'
I0915 11:52:33.236557 27555 http.cpp:1045] Creating default 'basic' HTTP authenticator for
realm 'mesos-agent-readonly'
I0915 11:52:33.236672 27555 http.cpp:1066] Creating default 'jwt' HTTP authenticator for realm
'mesos-agent-readonly'
I0915 11:52:33.236894 27555 http.cpp:1045] Creating default 'basic' HTTP authenticator for
realm 'mesos-agent-readwrite'
I0915 11:52:33.236991 27555 http.cpp:1066] Creating default 'jwt' HTTP authenticator for realm
'mesos-agent-readwrite'
I0915 11:52:33.239094 27555 slave.cpp:583] Agent resources: [{"name":"cpus","scalar":{"value":2.0},"type":"SCALAR"},{"name":"mem","scalar":{"value":1024.0},"type":"SCALAR"},{"name":"disk","scalar":{"value":1024.0},"type":"SCALAR"},{"name":"ports","ranges":{"range":[{"begin":31000,"end":32000}]},"type":"RANGES"}]
I0915 11:52:33.239485 27555 slave.cpp:591] Agent attributes: [  ]
I0915 11:52:33.239517 27555 slave.cpp:600] Agent hostname: ced56766cf69
I0915 11:52:33.239784 27542 status_update_manager.cpp:177] Pausing sending status updates
I0915 11:52:33.241581 27537 state.cpp:64] Recovering state from '/tmp/Endpoint_SlaveEndpointTest_UnauthorizedRequest_1_tCDyis/meta'
I0915 11:52:33.241858 27558 status_update_manager.cpp:203] Recovering status update manager
I0915 11:52:33.242130 27544 containerizer.cpp:648] Recovering containerizer
I0915 11:52:33.243456 27549 provisioner.cpp:416] Provisioner recovery complete
I0915 11:52:33.243731 27542 slave.cpp:6298] Finished recovery
I0915 11:52:33.244164 27542 slave.cpp:6480] Querying resource estimator for oversubscribable
resources
I0915 11:52:33.244392 27552 slave.cpp:6494] Received oversubscribable resources {} from the
resource estimator
I0915 11:52:33.246414 27560 process.cpp:3929] Handling HTTP event for process 'slave(818)'
with path: '/slave(818)/monitor/statistics.json'
I0915 11:52:33.248316 27559 http.cpp:1185] HTTP GET for /slave(818)/monitor/statistics.json
from 172.17.0.3:44602
I0915 11:52:33.248383 27559 http.cpp:976] Authorizing principal 'test-principal' to GET the
'/monitor/statistics.json' endpoint
I0915 11:52:33.249882 27547 slave.cpp:861] Agent terminating
[       OK ] Endpoint/SlaveEndpointTest.UnauthorizedRequest/1 (29 ms)
[ RUN      ] Endpoint/SlaveEndpointTest.UnauthorizedRequest/2
I0915 11:52:33.262213  6902 containerizer.cpp:292] Using isolation { environment_secret, posix/cpu,
posix/mem, filesystem/posix, network/cni }
W0915 11:52:33.262778  6902 backend.cpp:76] Failed to create 'aufs' backend: AufsBackend requires
root privileges
W0915 11:52:33.262907  6902 backend.cpp:76] Failed to create 'bind' backend: BindBackend requires
root privileges
I0915 11:52:33.262943  6902 provisioner.cpp:255] Using default backend 'copy'
I0915 11:52:33.266652 27555 slave.cpp:252] Mesos agent started on (819)@172.17.0.3:43114
I0915 11:52:33.266688 27555 slave.cpp:253] Flags at startup: --acls="" --appc_simple_discovery_uri_prefix="http://"
--appc_store_dir="/tmp/Endpoint_SlaveEndpointTest_UnauthorizedRequest_2_p7OpBk/store/appc"
--authenticate_http_executors="true" --authenticate_http_readonly="true" --authenticate_http_readwrite="true"
--authenticatee="crammd5" --authentication_backoff_factor="1secs" --authorizer="local" --cgroups_cpu_enable_pids_and_tids_count="false"
--cgroups_enable_cfs="false" --cgroups_hierarchy="/sys/fs/cgroup" --cgroups_limit_swap="false"
--cgroups_root="mesos" --container_disk_watch_interval="15secs" --containerizers="mesos" --credential="/tmp/Endpoint_SlaveEndpointTest_UnauthorizedRequest_2_p7OpBk/credential"
--default_role="*" --disallow_sharing_agent_pid_namespace="false" --disk_watch_interval="1mins"
--docker="docker" --docker_kill_orphans="true" --docker_registry="https://registry-1.docker.io"
--docker_remove_delay="6hrs" --docker_socket="/var/run/docker.sock" --docker_stop_timeout="0ns"
--docker_store_dir="/tmp/Endpoint_SlaveEndpointTest_UnauthorizedRequest_2_p7OpBk/store/docker"
--docker_volume_checkpoint_dir="/var/run/mesos/isolators/docker/volume" --enforce_container_disk_quota="false"
--executor_registration_timeout="1mins" --executor_reregistration_timeout="2secs" --executor_secret_key="/tmp/Endpoint_SlaveEndpointTest_UnauthorizedRequest_2_p7OpBk/executor_secret_key"
--executor_shutdown_grace_period="5secs" --fetcher_cache_dir="/tmp/Endpoint_SlaveEndpointTest_UnauthorizedRequest_2_p7OpBk/fetch"
--fetcher_cache_size="2GB" --frameworks_home="" --gc_delay="1weeks" --gc_disk_headroom="0.1"
--hadoop_home="" --help="false" --hostname_lookup="true" --http_command_executor="false" --http_credentials="/tmp/Endpoint_SlaveEndpointTest_UnauthorizedRequest_2_p7OpBk/http_credentials"
--http_heartbeat_interval="30secs" --initialize_driver_logging="true" --isolation="posix/cpu,posix/mem"
--launcher="posix" --launcher_dir="/mesos/mesos-1.5.0/_build/src" --logbufsecs="0" --logging_level="INFO"
--max_completed_executors_per_framework="150" --oversubscribed_resources_interval="15secs"
--perf_duration="10secs" --perf_interval="1mins" --port="5051" --qos_correction_interval_min="0ns"
--quiet="false" --recover="reconnect" --recovery_timeout="15mins" --registration_backoff_factor="10ms"
--resources="cpus:2;gpus:0;mem:1024;disk:1024;ports:[31000-32000]" --revocable_cpu_low_priority="true"
--runtime_dir="/tmp/Endpoint_SlaveEndpointTest_UnauthorizedRequest_2_p7OpBk" --sandbox_directory="/mnt/mesos/sandbox"
--strict="true" --switch_user="true" --systemd_enable_support="true" --systemd_runtime_directory="/run/systemd/system"
--version="false" --work_dir="/tmp/Endpoint_SlaveEndpointTest_UnauthorizedRequest_2_h4tv7l"
--zk_session_timeout="10secs"
I0915 11:52:33.267091 27555 credentials.hpp:86] Loading credential for authentication from
'/tmp/Endpoint_SlaveEndpointTest_UnauthorizedRequest_2_p7OpBk/credential'
I0915 11:52:33.267259 27555 slave.cpp:285] Agent using credential for: test-principal
I0915 11:52:33.267289 27555 credentials.hpp:37] Loading credentials for authentication from
'/tmp/Endpoint_SlaveEndpointTest_UnauthorizedRequest_2_p7OpBk/http_credentials'
I0915 11:52:33.267597 27555 http.cpp:1045] Creating default 'basic' HTTP authenticator for
realm 'mesos-agent-executor'
I0915 11:52:33.267736 27555 http.cpp:1066] Creating default 'jwt' HTTP authenticator for realm
'mesos-agent-executor'
I0915 11:52:33.267957 27555 http.cpp:1045] Creating default 'basic' HTTP authenticator for
realm 'mesos-agent-readonly'
I0915 11:52:33.268066 27555 http.cpp:1066] Creating default 'jwt' HTTP authenticator for realm
'mesos-agent-readonly'
I0915 11:52:33.268271 27555 http.cpp:1045] Creating default 'basic' HTTP authenticator for
realm 'mesos-agent-readwrite'
I0915 11:52:33.268389 27555 http.cpp:1066] Creating default 'jwt' HTTP authenticator for realm
'mesos-agent-readwrite'
I0915 11:52:33.269871 27555 slave.cpp:583] Agent resources: [{"name":"cpus","scalar":{"value":2.0},"type":"SCALAR"},{"name":"mem","scalar":{"value":1024.0},"type":"SCALAR"},{"name":"disk","scalar":{"value":1024.0},"type":"SCALAR"},{"name":"ports","ranges":{"range":[{"begin":31000,"end":32000}]},"type":"RANGES"}]
I0915 11:52:33.270117 27555 slave.cpp:591] Agent attributes: [  ]
I0915 11:52:33.270133 27555 slave.cpp:600] Agent hostname: ced56766cf69
I0915 11:52:33.270429 27544 status_update_manager.cpp:177] Pausing sending status updates
I0915 11:52:33.271857 27539 state.cpp:64] Recovering state from '/tmp/Endpoint_SlaveEndpointTest_UnauthorizedRequest_2_h4tv7l/meta'
I0915 11:52:33.272203 27539 status_update_manager.cpp:203] Recovering status update manager
I0915 11:52:33.272501 27554 containerizer.cpp:648] Recovering containerizer
I0915 11:52:33.273967 27552 provisioner.cpp:416] Provisioner recovery complete
I0915 11:52:33.274346 27550 slave.cpp:6298] Finished recovery
I0915 11:52:33.274886 27550 slave.cpp:6480] Querying resource estimator for oversubscribable
resources
I0915 11:52:33.275130 27540 slave.cpp:6494] Received oversubscribable resources {} from the
resource estimator
I0915 11:52:33.277582 27553 process.cpp:3929] Handling HTTP event for process 'slave(819)'
with path: '/slave(819)/containers'
I0915 11:52:33.279347 27544 http.cpp:1185] HTTP GET for /slave(819)/containers from 172.17.0.3:44604
I0915 11:52:33.279426 27544 http.cpp:976] Authorizing principal 'test-principal' to GET the
'/containers' endpoint
I0915 11:52:33.281348 27551 slave.cpp:861] Agent terminating
[       OK ] Endpoint/SlaveEndpointTest.UnauthorizedRequest/2 (31 ms)
[ RUN      ] Endpoint/SlaveEndpointTest.NoAuthorizer/0
I0915 11:52:33.292482  6902 containerizer.cpp:292] Using isolation { environment_secret, posix/cpu,
posix/mem, filesystem/posix, network/cni }
W0915 11:52:33.292954  6902 backend.cpp:76] Failed to create 'aufs' backend: AufsBackend requires
root privileges
W0915 11:52:33.293067  6902 backend.cpp:76] Failed to create 'bind' backend: BindBackend requires
root privileges
I0915 11:52:33.293105  6902 provisioner.cpp:255] Using default backend 'copy'
I0915 11:52:33.294790  6902 cluster.cpp:448] Creating default 'local' authorizer
I0915 11:52:33.296663 27541 slave.cpp:252] Mesos agent started on (820)@172.17.0.3:43114
I0915 11:52:33.296701 27541 slave.cpp:253] Flags at startup: --acls="" --appc_simple_discovery_uri_prefix="http://"
--appc_store_dir="/tmp/Endpoint_SlaveEndpointTest_NoAuthorizer_0_zkwnNe/store/appc" --authenticate_http_executors="true"
--authenticate_http_readonly="true" --authenticate_http_readwrite="true" --authenticatee="crammd5"
--authentication_backoff_factor="1secs" --authorizer="local" --cgroups_cpu_enable_pids_and_tids_count="false"
--cgroups_enable_cfs="false" --cgroups_hierarchy="/sys/fs/cgroup" --cgroups_limit_swap="false"
--cgroups_root="mesos" --container_disk_watch_interval="15secs" --containerizers="mesos" --credential="/tmp/Endpoint_SlaveEndpointTest_NoAuthorizer_0_zkwnNe/credential"
--default_role="*" --disallow_sharing_agent_pid_namespace="false" --disk_watch_interval="1mins"
--docker="docker" --docker_kill_orphans="true" --docker_registry="https://registry-1.docker.io"
--docker_remove_delay="6hrs" --docker_socket="/var/run/docker.sock" --docker_stop_timeout="0ns"
--docker_store_dir="/tmp/Endpoint_SlaveEndpointTest_NoAuthorizer_0_zkwnNe/store/docker" --docker_volume_checkpoint_dir="/var/run/mesos/isolators/docker/volume"
--enforce_container_disk_quota="false" --executor_registration_timeout="1mins" --executor_reregistration_timeout="2secs"
--executor_secret_key="/tmp/Endpoint_SlaveEndpointTest_NoAuthorizer_0_zkwnNe/executor_secret_key"
--executor_shutdown_grace_period="5secs" --fetcher_cache_dir="/tmp/Endpoint_SlaveEndpointTest_NoAuthorizer_0_zkwnNe/fetch"
--fetcher_cache_size="2GB" --frameworks_home="" --gc_delay="1weeks" --gc_disk_headroom="0.1"
--hadoop_home="" --help="false" --hostname_lookup="true" --http_command_executor="false" --http_credentials="/tmp/Endpoint_SlaveEndpointTest_NoAuthorizer_0_zkwnNe/http_credentials"
--http_heartbeat_interval="30secs" --initialize_driver_logging="true" --isolation="posix/cpu,posix/mem"
--launcher="posix" --launcher_dir="/mesos/mesos-1.5.0/_build/src" --logbufsecs="0" --logging_level="INFO"
--max_completed_executors_per_framework="150" --oversubscribed_resources_interval="15secs"
--perf_duration="10secs" --perf_interval="1mins" --port="5051" --qos_correction_interval_min="0ns"
--quiet="false" --recover="reconnect" --recovery_timeout="15mins" --registration_backoff_factor="10ms"
--resources="cpus:2;gpus:0;mem:1024;disk:1024;ports:[31000-32000]" --revocable_cpu_low_priority="true"
--runtime_dir="/tmp/Endpoint_SlaveEndpointTest_NoAuthorizer_0_zkwnNe" --sandbox_directory="/mnt/mesos/sandbox"
--strict="true" --switch_user="true" --systemd_enable_support="true" --systemd_runtime_directory="/run/systemd/system"
--version="false" --work_dir="/tmp/Endpoint_SlaveEndpointTest_NoAuthorizer_0_Z70Keg" --zk_session_timeout="10secs"
I0915 11:52:33.297098 27541 credentials.hpp:86] Loading credential for authentication from
'/tmp/Endpoint_SlaveEndpointTest_NoAuthorizer_0_zkwnNe/credential'
I0915 11:52:33.297274 27541 slave.cpp:285] Agent using credential for: test-principal
I0915 11:52:33.297298 27541 credentials.hpp:37] Loading credentials for authentication from
'/tmp/Endpoint_SlaveEndpointTest_NoAuthorizer_0_zkwnNe/http_credentials'
I0915 11:52:33.297572 27541 http.cpp:1045] Creating default 'basic' HTTP authenticator for
realm 'mesos-agent-executor'
I0915 11:52:33.297700 27541 http.cpp:1066] Creating default 'jwt' HTTP authenticator for realm
'mesos-agent-executor'
I0915 11:52:33.297924 27541 http.cpp:1045] Creating default 'basic' HTTP authenticator for
realm 'mesos-agent-readonly'
I0915 11:52:33.298029 27541 http.cpp:1066] Creating default 'jwt' HTTP authenticator for realm
'mesos-agent-readonly'
I0915 11:52:33.298214 27541 http.cpp:1045] Creating default 'basic' HTTP authenticator for
realm 'mesos-agent-readwrite'
I0915 11:52:33.298318 27541 http.cpp:1066] Creating default 'jwt' HTTP authenticator for realm
'mesos-agent-readwrite'
I0915 11:52:33.299727 27541 slave.cpp:583] Agent resources: [{"name":"cpus","scalar":{"value":2.0},"type":"SCALAR"},{"name":"mem","scalar":{"value":1024.0},"type":"SCALAR"},{"name":"disk","scalar":{"value":1024.0},"type":"SCALAR"},{"name":"ports","ranges":{"range":[{"begin":31000,"end":32000}]},"type":"RANGES"}]
I0915 11:52:33.299947 27541 slave.cpp:591] Agent attributes: [  ]
I0915 11:52:33.299963 27541 slave.cpp:600] Agent hostname: ced56766cf69
I0915 11:52:33.300113 27547 status_update_manager.cpp:177] Pausing sending status updates
I0915 11:52:33.301589 27544 state.cpp:64] Recovering state from '/tmp/Endpoint_SlaveEndpointTest_NoAuthorizer_0_Z70Keg/meta'
I0915 11:52:33.301897 27556 status_update_manager.cpp:203] Recovering status update manager
I0915 11:52:33.302181 27543 containerizer.cpp:648] Recovering containerizer
I0915 11:52:33.303436 27549 provisioner.cpp:416] Provisioner recovery complete
I0915 11:52:33.303782 27547 slave.cpp:6298] Finished recovery
I0915 11:52:33.304297 27547 slave.cpp:6480] Querying resource estimator for oversubscribable
resources
I0915 11:52:33.304520 27546 slave.cpp:6494] Received oversubscribable resources {} from the
resource estimator
I0915 11:52:33.306670 27540 process.cpp:3929] Handling HTTP event for process 'slave(820)'
with path: '/slave(820)/monitor/statistics'
I0915 11:52:33.308302 27549 http.cpp:1185] HTTP GET for /slave(820)/monitor/statistics from
172.17.0.3:44606
I0915 11:52:33.308370 27549 http.cpp:976] Authorizing principal 'test-principal' to GET the
'/monitor/statistics' endpoint
I0915 11:52:33.310819 27543 slave.cpp:861] Agent terminating
[       OK ] Endpoint/SlaveEndpointTest.NoAuthorizer/0 (28 ms)
[ RUN      ] Endpoint/SlaveEndpointTest.NoAuthorizer/1
I0915 11:52:33.321415  6902 containerizer.cpp:292] Using isolation { environment_secret, posix/cpu,
posix/mem, filesystem/posix, network/cni }
W0915 11:52:33.321866  6902 backend.cpp:76] Failed to create 'aufs' backend: AufsBackend requires
root privileges
W0915 11:52:33.322002  6902 backend.cpp:76] Failed to create 'bind' backend: BindBackend requires
root privileges
I0915 11:52:33.322046  6902 provisioner.cpp:255] Using default backend 'copy'
I0915 11:52:33.323681  6902 cluster.cpp:448] Creating default 'local' authorizer
I0915 11:52:33.325563 27553 slave.cpp:252] Mesos agent started on (821)@172.17.0.3:43114
I0915 11:52:33.325603 27553 slave.cpp:253] Flags at startup: --acls="" --appc_simple_discovery_uri_prefix="http://"
--appc_store_dir="/tmp/Endpoint_SlaveEndpointTest_NoAuthorizer_1_5bYHg9/store/appc" --authenticate_http_executors="true"
--authenticate_http_readonly="true" --authenticate_http_readwrite="true" --authenticatee="crammd5"
--authentication_backoff_factor="1secs" --authorizer="local" --cgroups_cpu_enable_pids_and_tids_count="false"
--cgroups_enable_cfs="false" --cgroups_hierarchy="/sys/fs/cgroup" --cgroups_limit_swap="false"
--cgroups_root="mesos" --container_disk_watch_interval="15secs" --containerizers="mesos" --credential="/tmp/Endpoint_SlaveEndpointTest_NoAuthorizer_1_5bYHg9/credential"
--default_role="*" --disallow_sharing_agent_pid_namespace="false" --disk_watch_interval="1mins"
--docker="docker" --docker_kill_orphans="true" --docker_registry="https://registry-1.docker.io"
--docker_remove_delay="6hrs" --docker_socket="/var/run/docker.sock" --docker_stop_timeout="0ns"
--docker_store_dir="/tmp/Endpoint_SlaveEndpointTest_NoAuthorizer_1_5bYHg9/store/docker" --docker_volume_checkpoint_dir="/var/run/mesos/isolators/docker/volume"
--enforce_container_disk_quota="false" --executor_registration_timeout="1mins" --executor_reregistration_timeout="2secs"
--executor_secret_key="/tmp/Endpoint_SlaveEndpointTest_NoAuthorizer_1_5bYHg9/executor_secret_key"
--executor_shutdown_grace_period="5secs" --fetcher_cache_dir="/tmp/Endpoint_SlaveEndpointTest_NoAuthorizer_1_5bYHg9/fetch"
--fetcher_cache_size="2GB" --frameworks_home="" --gc_delay="1weeks" --gc_disk_headroom="0.1"
--hadoop_home="" --help="false" --hostname_lookup="true" --http_command_executor="false" --http_credentials="/tmp/Endpoint_SlaveEndpointTest_NoAuthorizer_1_5bYHg9/http_credentials"
--http_heartbeat_interval="30secs" --initialize_driver_logging="true" --isolation="posix/cpu,posix/mem"
--launcher="posix" --launcher_dir="/mesos/mesos-1.5.0/_build/src" --logbufsecs="0" --logging_level="INFO"
--max_completed_executors_per_framework="150" --oversubscribed_resources_interval="15secs"
--perf_duration="10secs" --perf_interval="1mins" --port="5051" --qos_correction_interval_min="0ns"
--quiet="false" --recover="reconnect" --recovery_timeout="15mins" --registration_backoff_factor="10ms"
--resources="cpus:2;gpus:0;mem:1024;disk:1024;ports:[31000-32000]" --revocable_cpu_low_priority="true"
--runtime_dir="/tmp/Endpoint_SlaveEndpointTest_NoAuthorizer_1_5bYHg9" --sandbox_directory="/mnt/mesos/sandbox"
--strict="true" --switch_user="true" --systemd_enable_support="true" --systemd_runtime_directory="/run/systemd/system"
--version="false" --work_dir="/tmp/Endpoint_SlaveEndpointTest_NoAuthorizer_1_tqgLDa" --zk_session_timeout="10secs"
I0915 11:52:33.326019 27553 credentials.hpp:86] Loading credential for authentication from
'/tmp/Endpoint_SlaveEndpointTest_NoAuthorizer_1_5bYHg9/credential'
I0915 11:52:33.326177 27553 slave.cpp:285] Agent using credential for: test-principal
I0915 11:52:33.326200 27553 credentials.hpp:37] Loading credentials for authentication from
'/tmp/Endpoint_SlaveEndpointTest_NoAuthorizer_1_5bYHg9/http_credentials'
I0915 11:52:33.326477 27553 http.cpp:1045] Creating default 'basic' HTTP authenticator for
realm 'mesos-agent-executor'
I0915 11:52:33.326599 27553 http.cpp:1066] Creating default 'jwt' HTTP authenticator for realm
'mesos-agent-executor'
I0915 11:52:33.326794 27553 http.cpp:1045] Creating default 'basic' HTTP authenticator for
realm 'mesos-agent-readonly'
I0915 11:52:33.326895 27553 http.cpp:1066] Creating default 'jwt' HTTP authenticator for realm
'mesos-agent-readonly'
I0915 11:52:33.327075 27553 http.cpp:1045] Creating default 'basic' HTTP authenticator for
realm 'mesos-agent-readwrite'
I0915 11:52:33.327174 27553 http.cpp:1066] Creating default 'jwt' HTTP authenticator for realm
'mesos-agent-readwrite'
I0915 11:52:33.328615 27553 slave.cpp:583] Agent resources: [{"name":"cpus","scalar":{"value":2.0},"type":"SCALAR"},{"name":"mem","scalar":{"value":1024.0},"type":"SCALAR"},{"name":"disk","scalar":{"value":1024.0},"type":"SCALAR"},{"name":"ports","ranges":{"range":[{"begin":31000,"end":32000}]},"type":"RANGES"}]
I0915 11:52:33.328835 27553 slave.cpp:591] Agent attributes: [  ]
I0915 11:52:33.328850 27553 slave.cpp:600] Agent hostname: ced56766cf69
I0915 11:52:33.328985 27551 status_update_manager.cpp:177] Pausing sending status updates
I0915 11:52:33.330613 27545 state.cpp:64] Recovering state from '/tmp/Endpoint_SlaveEndpointTest_NoAuthorizer_1_tqgLDa/meta'
I0915 11:52:33.330859 27549 status_update_manager.cpp:203] Recovering status update manager
I0915 11:52:33.331058 27555 containerizer.cpp:648] Recovering containerizer
I0915 11:52:33.332358 27537 provisioner.cpp:416] Provisioner recovery complete
I0915 11:52:33.332669 27551 slave.cpp:6298] Finished recovery
I0915 11:52:33.333155 27551 slave.cpp:6480] Querying resource estimator for oversubscribable
resources
I0915 11:52:33.333365 27541 slave.cpp:6494] Received oversubscribable resources {} from the
resource estimator
I0915 11:52:33.335374 27544 process.cpp:3929] Handling HTTP event for process 'slave(821)'
with path: '/slave(821)/monitor/statistics.json'
I0915 11:52:33.337285 27537 http.cpp:1185] HTTP GET for /slave(821)/monitor/statistics.json
from 172.17.0.3:44608
I0915 11:52:33.337354 27537 http.cpp:976] Authorizing principal 'test-principal' to GET the
'/monitor/statistics.json' endpoint
I0915 11:52:33.340530 27559 slave.cpp:861] Agent terminating
[       OK ] Endpoint/SlaveEndpointTest.NoAuthorizer/1 (29 ms)
[ RUN      ] Endpoint/SlaveEndpointTest.NoAuthorizer/2
I0915 11:52:33.351366  6902 containerizer.cpp:292] Using isolation { environment_secret, posix/cpu,
posix/mem, filesystem/posix, network/cni }
W0915 11:52:33.351815  6902 backend.cpp:76] Failed to create 'aufs' backend: AufsBackend requires
root privileges
W0915 11:52:33.351936  6902 backend.cpp:76] Failed to create 'bind' backend: BindBackend requires
root privileges
I0915 11:52:33.351979  6902 provisioner.cpp:255] Using default backend 'copy'
I0915 11:52:33.353637  6902 cluster.cpp:448] Creating default 'local' authorizer
I0915 11:52:33.355428 27537 slave.cpp:252] Mesos agent started on (822)@172.17.0.3:43114
I0915 11:52:33.355468 27537 slave.cpp:253] Flags at startup: --acls="" --appc_simple_discovery_uri_prefix="http://"
--appc_store_dir="/tmp/Endpoint_SlaveEndpointTest_NoAuthorizer_2_ttQI13/store/appc" --authenticate_http_executors="true"
--authenticate_http_readonly="true" --authenticate_http_readwrite="true" --authenticatee="crammd5"
--authentication_backoff_factor="1secs" --authorizer="local" --cgroups_cpu_enable_pids_and_tids_count="false"
--cgroups_enable_cfs="false" --cgroups_hierarchy="/sys/fs/cgroup" --cgroups_limit_swap="false"
--cgroups_root="mesos" --container_disk_watch_interval="15secs" --containerizers="mesos" --credential="/tmp/Endpoint_SlaveEndpointTest_NoAuthorizer_2_ttQI13/credential"
--default_role="*" --disallow_sharing_agent_pid_namespace="false" --disk_watch_interval="1mins"
--docker="docker" --docker_kill_orphans="true" --docker_registry="https://registry-1.docker.io"
--docker_remove_delay="6hrs" --docker_socket="/var/run/docker.sock" --docker_stop_timeout="0ns"
--docker_store_dir="/tmp/Endpoint_SlaveEndpointTest_NoAuthorizer_2_ttQI13/store/docker" --docker_volume_checkpoint_dir="/var/run/mesos/isolators/docker/volume"
--enforce_container_disk_quota="false" --executor_registration_timeout="1mins" --executor_reregistration_timeout="2secs"
--executor_secret_key="/tmp/Endpoint_SlaveEndpointTest_NoAuthorizer_2_ttQI13/executor_secret_key"
--executor_shutdown_grace_period="5secs" --fetcher_cache_dir="/tmp/Endpoint_SlaveEndpointTest_NoAuthorizer_2_ttQI13/fetch"
--fetcher_cache_size="2GB" --frameworks_home="" --gc_delay="1weeks" --gc_disk_headroom="0.1"
--hadoop_home="" --help="false" --hostname_lookup="true" --http_command_executor="false" --http_credentials="/tmp/Endpoint_SlaveEndpointTest_NoAuthorizer_2_ttQI13/http_credentials"
--http_heartbeat_interval="30secs" --initialize_driver_logging="true" --isolation="posix/cpu,posix/mem"
--launcher="posix" --launcher_dir="/mesos/mesos-1.5.0/_build/src" --logbufsecs="0" --logging_level="INFO"
--max_completed_executors_per_framework="150" --oversubscribed_resources_interval="15secs"
--perf_duration="10secs" --perf_interval="1mins" --port="5051" --qos_correction_interval_min="0ns"
--quiet="false" --recover="reconnect" --recovery_timeout="15mins" --registration_backoff_factor="10ms"
--resources="cpus:2;gpus:0;mem:1024;disk:1024;ports:[31000-32000]" --revocable_cpu_low_priority="true"
--runtime_dir="/tmp/Endpoint_SlaveEndpointTest_NoAuthorizer_2_ttQI13" --sandbox_directory="/mnt/mesos/sandbox"
--strict="true" --switch_user="true" --systemd_enable_support="true" --systemd_runtime_directory="/run/systemd/system"
--version="false" --work_dir="/tmp/Endpoint_SlaveEndpointTest_NoAuthorizer_2_7IBjk5" --zk_session_timeout="10secs"
I0915 11:52:33.355919 27537 credentials.hpp:86] Loading credential for authentication from
'/tmp/Endpoint_SlaveEndpointTest_NoAuthorizer_2_ttQI13/credential'
I0915 11:52:33.356088 27537 slave.cpp:285] Agent using credential for: test-principal
I0915 11:52:33.356112 27537 credentials.hpp:37] Loading credentials for authentication from
'/tmp/Endpoint_SlaveEndpointTest_NoAuthorizer_2_ttQI13/http_credentials'
I0915 11:52:33.356397 27537 http.cpp:1045] Creating default 'basic' HTTP authenticator for
realm 'mesos-agent-executor'
I0915 11:52:33.356539 27537 http.cpp:1066] Creating default 'jwt' HTTP authenticator for realm
'mesos-agent-executor'
I0915 11:52:33.356751 27537 http.cpp:1045] Creating default 'basic' HTTP authenticator for
realm 'mesos-agent-readonly'
I0915 11:52:33.356863 27537 http.cpp:1066] Creating default 'jwt' HTTP authenticator for realm
'mesos-agent-readonly'
I0915 11:52:33.357062 27537 http.cpp:1045] Creating default 'basic' HTTP authenticator for
realm 'mesos-agent-readwrite'
I0915 11:52:33.357172 27537 http.cpp:1066] Creating default 'jwt' HTTP authenticator for realm
'mesos-agent-readwrite'
I0915 11:52:33.358603 27537 slave.cpp:583] Agent resources: [{"name":"cpus","scalar":{"value":2.0},"type":"SCALAR"},{"name":"mem","scalar":{"value":1024.0},"type":"SCALAR"},{"name":"disk","scalar":{"value":1024.0},"type":"SCALAR"},{"name":"ports","ranges":{"range":[{"begin":31000,"end":32000}]},"type":"RANGES"}]
I0915 11:52:33.358819 27537 slave.cpp:591] Agent attributes: [  ]
I0915 11:52:33.358835 27537 slave.cpp:600] Agent hostname: ced56766cf69
I0915 11:52:33.358992 27558 status_update_manager.cpp:177] Pausing sending status updates
I0915 11:52:33.360473 27550 state.cpp:64] Recovering state from '/tmp/Endpoint_SlaveEndpointTest_NoAuthorizer_2_7IBjk5/meta'
I0915 11:52:33.360734 27540 status_update_manager.cpp:203] Recovering status update manager
I0915 11:52:33.360904 27559 containerizer.cpp:648] Recovering containerizer
I0915 11:52:33.362118 27554 provisioner.cpp:416] Provisioner recovery complete
I0915 11:52:33.362489 27558 slave.cpp:6298] Finished recovery
I0915 11:52:33.362944 27558 slave.cpp:6480] Querying resource estimator for oversubscribable
resources
I0915 11:52:33.363204 27538 slave.cpp:6494] Received oversubscribable resources {} from the
resource estimator
I0915 11:52:33.365041 27548 process.cpp:3929] Handling HTTP event for process 'slave(822)'
with path: '/slave(822)/containers'
I0915 11:52:33.366665 27554 http.cpp:1185] HTTP GET for /slave(822)/containers from 172.17.0.3:44610
I0915 11:52:33.366741 27554 http.cpp:976] Authorizing principal 'test-principal' to GET the
'/containers' endpoint
I0915 11:52:33.369932 27547 slave.cpp:861] Agent terminating
[       OK ] Endpoint/SlaveEndpointTest.NoAuthorizer/2 (30 ms)
[----------] 9 tests from Endpoint/SlaveEndpointTest (292 ms total)

[----------] 2 tests from ContainerizerType/DefaultContainerDNSFlagTest
[ RUN      ] ContainerizerType/DefaultContainerDNSFlagTest.ValidateFlag/0
[       OK ] ContainerizerType/DefaultContainerDNSFlagTest.ValidateFlag/0 (9 ms)
[ RUN      ] ContainerizerType/DefaultContainerDNSFlagTest.ValidateFlag/1
[       OK ] ContainerizerType/DefaultContainerDNSFlagTest.ValidateFlag/1 (10 ms)
[----------] 2 tests from ContainerizerType/DefaultContainerDNSFlagTest (19 ms total)

[----------] Global test environment tear-down
[==========] 1675 tests from 185 test cases ran. (639326 ms total)
[  PASSED  ] 1673 tests.
[  FAILED  ] 2 tests, listed below:
[  FAILED  ] ExamplesTest.PersistentVolumeFramework
[  FAILED  ] ExamplesTest.JavaFramework

 2 FAILED TESTS
  YOU HAVE 20 DISABLED TESTS

I0915 11:52:33.456748 27561 process.cpp:1068] Failed to accept socket: future discarded
make[4]: *** [check-local] Error 1
make[4]: Leaving directory `/mesos/mesos-1.5.0/_build/src'
make[3]: *** [check-am] Error 2
make[3]: Leaving directory `/mesos/mesos-1.5.0/_build/src'
make[2]: *** [check] Error 2
make[2]: Leaving directory `/mesos/mesos-1.5.0/_build/src'
make[1]: *** [check-recursive] Error 1
make[1]: Leaving directory `/mesos/mesos-1.5.0/_build'
make: *** [distcheck] Error 1
+ docker rmi mesos-1505473110-13853
Untagged: mesos-1505473110-13853:latest
Deleted: sha256:4fb3db7b8cebce76906a810592798bd0038ee69fa55a2e01e02b34c56a6f37f3
Deleted: sha256:6480238a0fb873d15b5b70e20aafdfa86776bfa2331fd5bf899ca29cd63570ea
Deleted: sha256:2da6a7887e77cc64be9726ea7dbb26422ea5db6cdb1347c2087bb2dca0f95625
Deleted: sha256:eb4e953bbd9e77b020b7bf40511cb70c28de812a0d0355c5b7772b6e5c41ab3d
Deleted: sha256:df3d0023e30118ad56ad2abc79fa03677c586a92eb9f9a7c2640cf10027fa25c
Deleted: sha256:5a21bc78821ebe770e694ef35616088446d65e3293e3edb3b23d906680348c23
Deleted: sha256:bc52843921b30188d2280a928331b75983a22528c6925dbe276dd511a31fa202
Deleted: sha256:a251f8bac3ce2934763b9ccdfcd95a9b37a81ef2dad0365770f3b141e14abfa6
Deleted: sha256:69231ec51fed0f48ae80017a15b6146154d216151a18e208d7fafe03065e76cd
Deleted: sha256:ab1e6b8f7ad7b828e36a3e56a4d0393fa2d12d3c124ee6322ca8a34ddc9f3464
Deleted: sha256:30cccd59e71572a0f4df19728ea17b3b36f833536e5c783480de8c56fef96060
Deleted: sha256:64af382d6eea13bddaaa253b12424aa52e887892b936e435d0af88b2bb03a0dc
Deleted: sha256:c91e3fda785ed71c37de07ee80a40f97e3a79133fef90e4a3f47ec606782a96b
Deleted: sha256:f0f24c91fa7d07d6a0ee62344482db68c063b72141d4f86c23bfa177b8484267
Deleted: sha256:98054708d920605498140382c29ddbc0de9cd36730a59f578b74f58a506feeb5
Deleted: sha256:ec222b97f22b648f022ba1f479922fdd6ac94f858d6d5c9846b2b22d117b7a90
Deleted: sha256:fe305ac8f56d4cd802f41dc2579177fc06c735bd810c85ae1cb66ef5f955ea5f
Deleted: sha256:3c2623193f410ed893162b4feba10473ecd88e749ad3cdc1683ed3b550f53472
Deleted: sha256:94fa5e4a4e364bd27e340777b9e0b37bc657800ce60e92008503d0cde756258f
Deleted: sha256:44f254e941eec5e32abdfa09f9c6e5d950dc5e77fa1cd54f00089b5686663406
Deleted: sha256:2475d311891af01a0b00cda0faf0bff73aa68c08b5aedcea0d99f9e379d3df00
Deleted: sha256:e498b7dd8eb8a2ddf1de08ac7e30e422a959866b26b826456df7df7d38b32e6b
Deleted: sha256:fde1370c997441281c2281ce734e8dd9ee9a5f338cf81d3765ecaa56c4ea0e90
Deleted: sha256:25dfc3762e933606fcc1ecaa1b5f5b161199ca7af8dee444f4ee6d05e19ca56f
Deleted: sha256:8fa960651a42fc6b10227774c1bed3d0c3d13fd53b165ccff4db9f5cb5298a70
Deleted: sha256:1c1fa98704417aec823043801560f3fa431e6f2a0a3b314b9344e812aa1f9278
Deleted: sha256:99d4e302838b9318a02f76c7b56613b77bff0d45223c43cbd1465359392d9ba7
Deleted: sha256:2a2efac8d27ed1b6a85b46718ecfcbe2c7bbfd90888c6b1a972086759eb72aa2
Build step 'Execute shell' marked build as failure
Not sending mail to unregistered user benjamin.bannier@mesosphere.io

Mime
View raw message