mesos-builds mailing list archives

Site index · List index
Message view « Date » · « Thread »
Top « Date » · « Thread »
From Apache Jenkins Server <jenk...@builds.apache.org>
Subject Build failed in Jenkins: Mesos-Reviewbot #19289
Date Fri, 08 Sep 2017 11:54:25 GMT
See <https://builds.apache.org/job/Mesos-Reviewbot/19289/display/redirect>

------------------------------------------
[...truncated 31.08 MB...]
I0908 11:54:19.053993  5799 credentials.hpp:37] Loading credentials for authentication from
'/tmp/Endpoint_SlaveEndpointTest_AuthorizedRequest_2_XuGSXr/http_credentials'
I0908 11:54:19.054298  5799 http.cpp:1045] Creating default 'basic' HTTP authenticator for
realm 'mesos-agent-readonly'
I0908 11:54:19.054497  5799 http.cpp:1045] Creating default 'basic' HTTP authenticator for
realm 'mesos-agent-readwrite'
I0908 11:54:19.056056  5799 slave.cpp:583] Agent resources: [{"name":"cpus","scalar":{"value":2.0},"type":"SCALAR"},{"name":"mem","scalar":{"value":1024.0},"type":"SCALAR"},{"name":"disk","scalar":{"value":1024.0},"type":"SCALAR"},{"name":"ports","ranges":{"range":[{"begin":31000,"end":32000}]},"type":"RANGES"}]
I0908 11:54:19.056382  5799 slave.cpp:591] Agent attributes: [  ]
I0908 11:54:19.056434  5799 slave.cpp:600] Agent hostname: 66c21ad50261
I0908 11:54:19.056587  5795 status_update_manager.cpp:177] Pausing sending status updates
I0908 11:54:19.057986  5808 state.cpp:64] Recovering state from '/tmp/Endpoint_SlaveEndpointTest_AuthorizedRequest_2_MAJLZU/meta'
I0908 11:54:19.058209  5808 status_update_manager.cpp:203] Recovering status update manager
I0908 11:54:19.058387  5803 containerizer.cpp:648] Recovering containerizer
I0908 11:54:19.059564  5813 provisioner.cpp:416] Provisioner recovery complete
I0908 11:54:19.060009  5813 slave.cpp:6298] Finished recovery
I0908 11:54:19.060506  5813 slave.cpp:6480] Querying resource estimator for oversubscribable
resources
I0908 11:54:19.060719  5804 slave.cpp:6494] Received oversubscribable resources {} from the
resource estimator
I0908 11:54:19.062788  5811 process.cpp:3929] Handling HTTP event for process 'slave(810)'
with path: '/slave(810)/containers'
I0908 11:54:19.063871  5816 http.cpp:1185] HTTP GET for /slave(810)/containers from 172.17.0.7:44014
I0908 11:54:19.063959  5816 http.cpp:976] Authorizing principal 'test-principal' to GET the
'/containers' endpoint
I0908 11:54:19.067270  5775 slave.cpp:861] Agent terminating
[       OK ] Endpoint/SlaveEndpointTest.AuthorizedRequest/2 (32 ms)
[ RUN      ] Endpoint/SlaveEndpointTest.UnauthorizedRequest/0
I0908 11:54:19.081570  5775 containerizer.cpp:292] Using isolation { environment_secret, posix/cpu,
posix/mem, filesystem/posix, network/cni }
W0908 11:54:19.082178  5775 backend.cpp:76] Failed to create 'aufs' backend: AufsBackend requires
root privileges
W0908 11:54:19.082293  5775 backend.cpp:76] Failed to create 'bind' backend: BindBackend requires
root privileges
I0908 11:54:19.082326  5775 provisioner.cpp:255] Using default backend 'copy'
I0908 11:54:19.085929  5796 slave.cpp:252] Mesos agent started on (811)@172.17.0.7:43721
I0908 11:54:19.085953  5796 slave.cpp:253] Flags at startup: --acls="" --appc_simple_discovery_uri_prefix="http://"
--appc_store_dir="/tmp/Endpoint_SlaveEndpointTest_UnauthorizedRequest_0_GyCO6z/store/appc"
--authenticate_http_readonly="true" --authenticate_http_readwrite="true" --authenticatee="crammd5"
--authentication_backoff_factor="1secs" --authorizer="local" --cgroups_cpu_enable_pids_and_tids_count="false"
--cgroups_enable_cfs="false" --cgroups_hierarchy="/sys/fs/cgroup" --cgroups_limit_swap="false"
--cgroups_root="mesos" --container_disk_watch_interval="15secs" --containerizers="mesos" --credential="/tmp/Endpoint_SlaveEndpointTest_UnauthorizedRequest_0_GyCO6z/credential"
--default_role="*" --disallow_sharing_agent_pid_namespace="false" --disk_watch_interval="1mins"
--docker="docker" --docker_kill_orphans="true" --docker_registry="https://registry-1.docker.io"
--docker_remove_delay="6hrs" --docker_socket="/var/run/docker.sock" --docker_stop_timeout="0ns"
--docker_store_dir="/tmp/Endpoint_SlaveEndpointTest_UnauthorizedRequest_0_GyCO6z/store/docker"
--docker_volume_checkpoint_dir="/var/run/mesos/isolators/docker/volume" --enforce_container_disk_quota="false"
--executor_registration_timeout="1mins" --executor_reregistration_timeout="2secs" --executor_shutdown_grace_period="5secs"
--fetcher_cache_dir="/tmp/Endpoint_SlaveEndpointTest_UnauthorizedRequest_0_GyCO6z/fetch" --fetcher_cache_size="2GB"
--frameworks_home="" --gc_delay="1weeks" --gc_disk_headroom="0.1" --hadoop_home="" --help="false"
--hostname_lookup="true" --http_command_executor="false" --http_credentials="/tmp/Endpoint_SlaveEndpointTest_UnauthorizedRequest_0_GyCO6z/http_credentials"
--http_heartbeat_interval="30secs" --initialize_driver_logging="true" --isolation="posix/cpu,posix/mem"
--launcher="posix" --launcher_dir="/mesos/mesos-1.5.0/_build/src" --logbufsecs="0" --logging_level="INFO"
--max_completed_executors_per_framework="150" --oversubscribed_resources_interval="15secs"
--perf_duration="10secs" --perf_interval="1mins" --port="5051" --qos_correction_interval_min="0ns"
--quiet="false" --recover="reconnect" --recovery_timeout="15mins" --registration_backoff_factor="10ms"
--resources="cpus:2;gpus:0;mem:1024;disk:1024;ports:[31000-32000]" --revocable_cpu_low_priority="true"
--runtime_dir="/tmp/Endpoint_SlaveEndpointTest_UnauthorizedRequest_0_GyCO6z" --sandbox_directory="/mnt/mesos/sandbox"
--strict="true" --switch_user="true" --systemd_enable_support="true" --systemd_runtime_directory="/run/systemd/system"
--version="false" --work_dir="/tmp/Endpoint_SlaveEndpointTest_UnauthorizedRequest_0_ZDjO32"
--zk_session_timeout="10secs"
I0908 11:54:19.086366  5796 credentials.hpp:86] Loading credential for authentication from
'/tmp/Endpoint_SlaveEndpointTest_UnauthorizedRequest_0_GyCO6z/credential'
I0908 11:54:19.086516  5796 slave.cpp:285] Agent using credential for: test-principal
I0908 11:54:19.086541  5796 credentials.hpp:37] Loading credentials for authentication from
'/tmp/Endpoint_SlaveEndpointTest_UnauthorizedRequest_0_GyCO6z/http_credentials'
I0908 11:54:19.086807  5796 http.cpp:1045] Creating default 'basic' HTTP authenticator for
realm 'mesos-agent-readonly'
I0908 11:54:19.086954  5796 http.cpp:1045] Creating default 'basic' HTTP authenticator for
realm 'mesos-agent-readwrite'
I0908 11:54:19.088441  5796 slave.cpp:583] Agent resources: [{"name":"cpus","scalar":{"value":2.0},"type":"SCALAR"},{"name":"mem","scalar":{"value":1024.0},"type":"SCALAR"},{"name":"disk","scalar":{"value":1024.0},"type":"SCALAR"},{"name":"ports","ranges":{"range":[{"begin":31000,"end":32000}]},"type":"RANGES"}]
I0908 11:54:19.088713  5796 slave.cpp:591] Agent attributes: [  ]
I0908 11:54:19.088732  5796 slave.cpp:600] Agent hostname: 66c21ad50261
I0908 11:54:19.088856  5795 status_update_manager.cpp:177] Pausing sending status updates
I0908 11:54:19.090236  5816 state.cpp:64] Recovering state from '/tmp/Endpoint_SlaveEndpointTest_UnauthorizedRequest_0_ZDjO32/meta'
I0908 11:54:19.090471  5794 status_update_manager.cpp:203] Recovering status update manager
I0908 11:54:19.090652  5809 containerizer.cpp:648] Recovering containerizer
I0908 11:54:19.091809  5800 provisioner.cpp:416] Provisioner recovery complete
I0908 11:54:19.092238  5795 slave.cpp:6298] Finished recovery
I0908 11:54:19.092674  5795 slave.cpp:6480] Querying resource estimator for oversubscribable
resources
I0908 11:54:19.092924  5816 slave.cpp:6494] Received oversubscribable resources {} from the
resource estimator
I0908 11:54:19.095017  5802 process.cpp:3929] Handling HTTP event for process 'slave(811)'
with path: '/slave(811)/monitor/statistics'
I0908 11:54:19.096351  5805 http.cpp:1185] HTTP GET for /slave(811)/monitor/statistics from
172.17.0.7:44016
I0908 11:54:19.096423  5805 http.cpp:976] Authorizing principal 'test-principal' to GET the
'/monitor/statistics' endpoint
I0908 11:54:19.098117  5809 slave.cpp:861] Agent terminating
[       OK ] Endpoint/SlaveEndpointTest.UnauthorizedRequest/0 (30 ms)
[ RUN      ] Endpoint/SlaveEndpointTest.UnauthorizedRequest/1
I0908 11:54:19.111919  5775 containerizer.cpp:292] Using isolation { environment_secret, posix/cpu,
posix/mem, filesystem/posix, network/cni }
W0908 11:54:19.112527  5775 backend.cpp:76] Failed to create 'aufs' backend: AufsBackend requires
root privileges
W0908 11:54:19.112639  5775 backend.cpp:76] Failed to create 'bind' backend: BindBackend requires
root privileges
I0908 11:54:19.112675  5775 provisioner.cpp:255] Using default backend 'copy'
I0908 11:54:19.116248  5804 slave.cpp:252] Mesos agent started on (812)@172.17.0.7:43721
I0908 11:54:19.116271  5804 slave.cpp:253] Flags at startup: --acls="" --appc_simple_discovery_uri_prefix="http://"
--appc_store_dir="/tmp/Endpoint_SlaveEndpointTest_UnauthorizedRequest_1_Xc65xI/store/appc"
--authenticate_http_readonly="true" --authenticate_http_readwrite="true" --authenticatee="crammd5"
--authentication_backoff_factor="1secs" --authorizer="local" --cgroups_cpu_enable_pids_and_tids_count="false"
--cgroups_enable_cfs="false" --cgroups_hierarchy="/sys/fs/cgroup" --cgroups_limit_swap="false"
--cgroups_root="mesos" --container_disk_watch_interval="15secs" --containerizers="mesos" --credential="/tmp/Endpoint_SlaveEndpointTest_UnauthorizedRequest_1_Xc65xI/credential"
--default_role="*" --disallow_sharing_agent_pid_namespace="false" --disk_watch_interval="1mins"
--docker="docker" --docker_kill_orphans="true" --docker_registry="https://registry-1.docker.io"
--docker_remove_delay="6hrs" --docker_socket="/var/run/docker.sock" --docker_stop_timeout="0ns"
--docker_store_dir="/tmp/Endpoint_SlaveEndpointTest_UnauthorizedRequest_1_Xc65xI/store/docker"
--docker_volume_checkpoint_dir="/var/run/mesos/isolators/docker/volume" --enforce_container_disk_quota="false"
--executor_registration_timeout="1mins" --executor_reregistration_timeout="2secs" --executor_shutdown_grace_period="5secs"
--fetcher_cache_dir="/tmp/Endpoint_SlaveEndpointTest_UnauthorizedRequest_1_Xc65xI/fetch" --fetcher_cache_size="2GB"
--frameworks_home="" --gc_delay="1weeks" --gc_disk_headroom="0.1" --hadoop_home="" --help="false"
--hostname_lookup="true" --http_command_executor="false" --http_credentials="/tmp/Endpoint_SlaveEndpointTest_UnauthorizedRequest_1_Xc65xI/http_credentials"
--http_heartbeat_interval="30secs" --initialize_driver_logging="true" --isolation="posix/cpu,posix/mem"
--launcher="posix" --launcher_dir="/mesos/mesos-1.5.0/_build/src" --logbufsecs="0" --logging_level="INFO"
--max_completed_executors_per_framework="150" --oversubscribed_resources_interval="15secs"
--perf_duration="10secs" --perf_interval="1mins" --port="5051" --qos_correction_interval_min="0ns"
--quiet="false" --recover="reconnect" --recovery_timeout="15mins" --registration_backoff_factor="10ms"
--resources="cpus:2;gpus:0;mem:1024;disk:1024;ports:[31000-32000]" --revocable_cpu_low_priority="true"
--runtime_dir="/tmp/Endpoint_SlaveEndpointTest_UnauthorizedRequest_1_Xc65xI" --sandbox_directory="/mnt/mesos/sandbox"
--strict="true" --switch_user="true" --systemd_enable_support="true" --systemd_runtime_directory="/run/systemd/system"
--version="false" --work_dir="/tmp/Endpoint_SlaveEndpointTest_UnauthorizedRequest_1_NNGzqb"
--zk_session_timeout="10secs"
I0908 11:54:19.116677  5804 credentials.hpp:86] Loading credential for authentication from
'/tmp/Endpoint_SlaveEndpointTest_UnauthorizedRequest_1_Xc65xI/credential'
I0908 11:54:19.116842  5804 slave.cpp:285] Agent using credential for: test-principal
I0908 11:54:19.116866  5804 credentials.hpp:37] Loading credentials for authentication from
'/tmp/Endpoint_SlaveEndpointTest_UnauthorizedRequest_1_Xc65xI/http_credentials'
I0908 11:54:19.117127  5804 http.cpp:1045] Creating default 'basic' HTTP authenticator for
realm 'mesos-agent-readonly'
I0908 11:54:19.117267  5804 http.cpp:1045] Creating default 'basic' HTTP authenticator for
realm 'mesos-agent-readwrite'
I0908 11:54:19.118726  5804 slave.cpp:583] Agent resources: [{"name":"cpus","scalar":{"value":2.0},"type":"SCALAR"},{"name":"mem","scalar":{"value":1024.0},"type":"SCALAR"},{"name":"disk","scalar":{"value":1024.0},"type":"SCALAR"},{"name":"ports","ranges":{"range":[{"begin":31000,"end":32000}]},"type":"RANGES"}]
I0908 11:54:19.118995  5804 slave.cpp:591] Agent attributes: [  ]
I0908 11:54:19.119014  5804 slave.cpp:600] Agent hostname: 66c21ad50261
I0908 11:54:19.119127  5803 status_update_manager.cpp:177] Pausing sending status updates
I0908 11:54:19.120550  5817 state.cpp:64] Recovering state from '/tmp/Endpoint_SlaveEndpointTest_UnauthorizedRequest_1_NNGzqb/meta'
I0908 11:54:19.120771  5817 status_update_manager.cpp:203] Recovering status update manager
I0908 11:54:19.120918  5809 containerizer.cpp:648] Recovering containerizer
I0908 11:54:19.122088  5808 provisioner.cpp:416] Provisioner recovery complete
I0908 11:54:19.122788  5813 slave.cpp:6298] Finished recovery
I0908 11:54:19.123198  5813 slave.cpp:6480] Querying resource estimator for oversubscribable
resources
I0908 11:54:19.123417  5806 slave.cpp:6494] Received oversubscribable resources {} from the
resource estimator
I0908 11:54:19.125552  5795 process.cpp:3929] Handling HTTP event for process 'slave(812)'
with path: '/slave(812)/monitor/statistics.json'
I0908 11:54:19.126531  5808 http.cpp:1185] HTTP GET for /slave(812)/monitor/statistics.json
from 172.17.0.7:44018
I0908 11:54:19.126590  5808 http.cpp:976] Authorizing principal 'test-principal' to GET the
'/monitor/statistics.json' endpoint
I0908 11:54:19.128680  5775 slave.cpp:861] Agent terminating
[       OK ] Endpoint/SlaveEndpointTest.UnauthorizedRequest/1 (32 ms)
[ RUN      ] Endpoint/SlaveEndpointTest.UnauthorizedRequest/2
I0908 11:54:19.144342  5775 containerizer.cpp:292] Using isolation { environment_secret, posix/cpu,
posix/mem, filesystem/posix, network/cni }
W0908 11:54:19.144996  5775 backend.cpp:76] Failed to create 'aufs' backend: AufsBackend requires
root privileges
W0908 11:54:19.145169  5775 backend.cpp:76] Failed to create 'bind' backend: BindBackend requires
root privileges
I0908 11:54:19.145202  5775 provisioner.cpp:255] Using default backend 'copy'
I0908 11:54:19.148607  5814 slave.cpp:252] Mesos agent started on (813)@172.17.0.7:43721
I0908 11:54:19.148629  5814 slave.cpp:253] Flags at startup: --acls="" --appc_simple_discovery_uri_prefix="http://"
--appc_store_dir="/tmp/Endpoint_SlaveEndpointTest_UnauthorizedRequest_2_QQeqiR/store/appc"
--authenticate_http_readonly="true" --authenticate_http_readwrite="true" --authenticatee="crammd5"
--authentication_backoff_factor="1secs" --authorizer="local" --cgroups_cpu_enable_pids_and_tids_count="false"
--cgroups_enable_cfs="false" --cgroups_hierarchy="/sys/fs/cgroup" --cgroups_limit_swap="false"
--cgroups_root="mesos" --container_disk_watch_interval="15secs" --containerizers="mesos" --credential="/tmp/Endpoint_SlaveEndpointTest_UnauthorizedRequest_2_QQeqiR/credential"
--default_role="*" --disallow_sharing_agent_pid_namespace="false" --disk_watch_interval="1mins"
--docker="docker" --docker_kill_orphans="true" --docker_registry="https://registry-1.docker.io"
--docker_remove_delay="6hrs" --docker_socket="/var/run/docker.sock" --docker_stop_timeout="0ns"
--docker_store_dir="/tmp/Endpoint_SlaveEndpointTest_UnauthorizedRequest_2_QQeqiR/store/docker"
--docker_volume_checkpoint_dir="/var/run/mesos/isolators/docker/volume" --enforce_container_disk_quota="false"
--executor_registration_timeout="1mins" --executor_reregistration_timeout="2secs" --executor_shutdown_grace_period="5secs"
--fetcher_cache_dir="/tmp/Endpoint_SlaveEndpointTest_UnauthorizedRequest_2_QQeqiR/fetch" --fetcher_cache_size="2GB"
--frameworks_home="" --gc_delay="1weeks" --gc_disk_headroom="0.1" --hadoop_home="" --help="false"
--hostname_lookup="true" --http_command_executor="false" --http_credentials="/tmp/Endpoint_SlaveEndpointTest_UnauthorizedRequest_2_QQeqiR/http_credentials"
--http_heartbeat_interval="30secs" --initialize_driver_logging="true" --isolation="posix/cpu,posix/mem"
--launcher="posix" --launcher_dir="/mesos/mesos-1.5.0/_build/src" --logbufsecs="0" --logging_level="INFO"
--max_completed_executors_per_framework="150" --oversubscribed_resources_interval="15secs"
--perf_duration="10secs" --perf_interval="1mins" --port="5051" --qos_correction_interval_min="0ns"
--quiet="false" --recover="reconnect" --recovery_timeout="15mins" --registration_backoff_factor="10ms"
--resources="cpus:2;gpus:0;mem:1024;disk:1024;ports:[31000-32000]" --revocable_cpu_low_priority="true"
--runtime_dir="/tmp/Endpoint_SlaveEndpointTest_UnauthorizedRequest_2_QQeqiR" --sandbox_directory="/mnt/mesos/sandbox"
--strict="true" --switch_user="true" --systemd_enable_support="true" --systemd_runtime_directory="/run/systemd/system"
--version="false" --work_dir="/tmp/Endpoint_SlaveEndpointTest_UnauthorizedRequest_2_L4935j"
--zk_session_timeout="10secs"
I0908 11:54:19.149070  5814 credentials.hpp:86] Loading credential for authentication from
'/tmp/Endpoint_SlaveEndpointTest_UnauthorizedRequest_2_QQeqiR/credential'
I0908 11:54:19.149222  5814 slave.cpp:285] Agent using credential for: test-principal
I0908 11:54:19.149241  5814 credentials.hpp:37] Loading credentials for authentication from
'/tmp/Endpoint_SlaveEndpointTest_UnauthorizedRequest_2_QQeqiR/http_credentials'
I0908 11:54:19.149497  5814 http.cpp:1045] Creating default 'basic' HTTP authenticator for
realm 'mesos-agent-readonly'
I0908 11:54:19.149636  5814 http.cpp:1045] Creating default 'basic' HTTP authenticator for
realm 'mesos-agent-readwrite'
I0908 11:54:19.151078  5814 slave.cpp:583] Agent resources: [{"name":"cpus","scalar":{"value":2.0},"type":"SCALAR"},{"name":"mem","scalar":{"value":1024.0},"type":"SCALAR"},{"name":"disk","scalar":{"value":1024.0},"type":"SCALAR"},{"name":"ports","ranges":{"range":[{"begin":31000,"end":32000}]},"type":"RANGES"}]
I0908 11:54:19.151347  5814 slave.cpp:591] Agent attributes: [  ]
I0908 11:54:19.151365  5814 slave.cpp:600] Agent hostname: 66c21ad50261
I0908 11:54:19.151486  5809 status_update_manager.cpp:177] Pausing sending status updates
I0908 11:54:19.152842  5795 state.cpp:64] Recovering state from '/tmp/Endpoint_SlaveEndpointTest_UnauthorizedRequest_2_L4935j/meta'
I0908 11:54:19.153072  5816 status_update_manager.cpp:203] Recovering status update manager
I0908 11:54:19.153236  5798 containerizer.cpp:648] Recovering containerizer
I0908 11:54:19.154320  5805 provisioner.cpp:416] Provisioner recovery complete
I0908 11:54:19.154736  5796 slave.cpp:6298] Finished recovery
I0908 11:54:19.155258  5796 slave.cpp:6480] Querying resource estimator for oversubscribable
resources
I0908 11:54:19.155459  5811 slave.cpp:6494] Received oversubscribable resources {} from the
resource estimator
I0908 11:54:19.157496  5798 process.cpp:3929] Handling HTTP event for process 'slave(813)'
with path: '/slave(813)/containers'
I0908 11:54:19.158610  5815 http.cpp:1185] HTTP GET for /slave(813)/containers from 172.17.0.7:44020
I0908 11:54:19.158671  5815 http.cpp:976] Authorizing principal 'test-principal' to GET the
'/containers' endpoint
I0908 11:54:19.160343  5804 slave.cpp:861] Agent terminating
[       OK ] Endpoint/SlaveEndpointTest.UnauthorizedRequest/2 (26 ms)
[ RUN      ] Endpoint/SlaveEndpointTest.NoAuthorizer/0
I0908 11:54:19.171440  5775 containerizer.cpp:292] Using isolation { environment_secret, posix/cpu,
posix/mem, filesystem/posix, network/cni }
W0908 11:54:19.172019  5775 backend.cpp:76] Failed to create 'aufs' backend: AufsBackend requires
root privileges
W0908 11:54:19.172122  5775 backend.cpp:76] Failed to create 'bind' backend: BindBackend requires
root privileges
I0908 11:54:19.172155  5775 provisioner.cpp:255] Using default backend 'copy'
I0908 11:54:19.173869  5775 cluster.cpp:448] Creating default 'local' authorizer
I0908 11:54:19.175861  5813 slave.cpp:252] Mesos agent started on (814)@172.17.0.7:43721
I0908 11:54:19.175884  5813 slave.cpp:253] Flags at startup: --acls="" --appc_simple_discovery_uri_prefix="http://"
--appc_store_dir="/tmp/Endpoint_SlaveEndpointTest_NoAuthorizer_0_ir6tj0/store/appc" --authenticate_http_readonly="true"
--authenticate_http_readwrite="true" --authenticatee="crammd5" --authentication_backoff_factor="1secs"
--authorizer="local" --cgroups_cpu_enable_pids_and_tids_count="false" --cgroups_enable_cfs="false"
--cgroups_hierarchy="/sys/fs/cgroup" --cgroups_limit_swap="false" --cgroups_root="mesos" --container_disk_watch_interval="15secs"
--containerizers="mesos" --credential="/tmp/Endpoint_SlaveEndpointTest_NoAuthorizer_0_ir6tj0/credential"
--default_role="*" --disallow_sharing_agent_pid_namespace="false" --disk_watch_interval="1mins"
--docker="docker" --docker_kill_orphans="true" --docker_registry="https://registry-1.docker.io"
--docker_remove_delay="6hrs" --docker_socket="/var/run/docker.sock" --docker_stop_timeout="0ns"
--docker_store_dir="/tmp/Endpoint_SlaveEndpointTest_NoAuthorizer_0_ir6tj0/store/docker" --docker_volume_checkpoint_dir="/var/run/mesos/isolators/docker/volume"
--enforce_container_disk_quota="false" --executor_registration_timeout="1mins" --executor_reregistration_timeout="2secs"
--executor_shutdown_grace_period="5secs" --fetcher_cache_dir="/tmp/Endpoint_SlaveEndpointTest_NoAuthorizer_0_ir6tj0/fetch"
--fetcher_cache_size="2GB" --frameworks_home="" --gc_delay="1weeks" --gc_disk_headroom="0.1"
--hadoop_home="" --help="false" --hostname_lookup="true" --http_command_executor="false" --http_credentials="/tmp/Endpoint_SlaveEndpointTest_NoAuthorizer_0_ir6tj0/http_credentials"
--http_heartbeat_interval="30secs" --initialize_driver_logging="true" --isolation="posix/cpu,posix/mem"
--launcher="posix" --launcher_dir="/mesos/mesos-1.5.0/_build/src" --logbufsecs="0" --logging_level="INFO"
--max_completed_executors_per_framework="150" --oversubscribed_resources_interval="15secs"
--perf_duration="10secs" --perf_interval="1mins" --port="5051" --qos_correction_interval_min="0ns"
--quiet="false" --recover="reconnect" --recovery_timeout="15mins" --registration_backoff_factor="10ms"
--resources="cpus:2;gpus:0;mem:1024;disk:1024;ports:[31000-32000]" --revocable_cpu_low_priority="true"
--runtime_dir="/tmp/Endpoint_SlaveEndpointTest_NoAuthorizer_0_ir6tj0" --sandbox_directory="/mnt/mesos/sandbox"
--strict="true" --switch_user="true" --systemd_enable_support="true" --systemd_runtime_directory="/run/systemd/system"
--version="false" --work_dir="/tmp/Endpoint_SlaveEndpointTest_NoAuthorizer_0_1TW82s" --zk_session_timeout="10secs"
I0908 11:54:19.176295  5813 credentials.hpp:86] Loading credential for authentication from
'/tmp/Endpoint_SlaveEndpointTest_NoAuthorizer_0_ir6tj0/credential'
I0908 11:54:19.176446  5813 slave.cpp:285] Agent using credential for: test-principal
I0908 11:54:19.176465  5813 credentials.hpp:37] Loading credentials for authentication from
'/tmp/Endpoint_SlaveEndpointTest_NoAuthorizer_0_ir6tj0/http_credentials'
I0908 11:54:19.176722  5813 http.cpp:1045] Creating default 'basic' HTTP authenticator for
realm 'mesos-agent-readonly'
I0908 11:54:19.176875  5813 http.cpp:1045] Creating default 'basic' HTTP authenticator for
realm 'mesos-agent-readwrite'
I0908 11:54:19.178340  5813 slave.cpp:583] Agent resources: [{"name":"cpus","scalar":{"value":2.0},"type":"SCALAR"},{"name":"mem","scalar":{"value":1024.0},"type":"SCALAR"},{"name":"disk","scalar":{"value":1024.0},"type":"SCALAR"},{"name":"ports","ranges":{"range":[{"begin":31000,"end":32000}]},"type":"RANGES"}]
I0908 11:54:19.178611  5813 slave.cpp:591] Agent attributes: [  ]
I0908 11:54:19.178627  5813 slave.cpp:600] Agent hostname: 66c21ad50261
I0908 11:54:19.178747  5800 status_update_manager.cpp:177] Pausing sending status updates
I0908 11:54:19.180248  5810 state.cpp:64] Recovering state from '/tmp/Endpoint_SlaveEndpointTest_NoAuthorizer_0_1TW82s/meta'
I0908 11:54:19.180557  5802 status_update_manager.cpp:203] Recovering status update manager
I0908 11:54:19.180797  5795 containerizer.cpp:648] Recovering containerizer
I0908 11:54:19.182021  5800 provisioner.cpp:416] Provisioner recovery complete
I0908 11:54:19.182288  5797 slave.cpp:6298] Finished recovery
I0908 11:54:19.182700  5797 slave.cpp:6480] Querying resource estimator for oversubscribable
resources
I0908 11:54:19.182955  5804 slave.cpp:6494] Received oversubscribable resources {} from the
resource estimator
I0908 11:54:19.185003  5808 process.cpp:3929] Handling HTTP event for process 'slave(814)'
with path: '/slave(814)/monitor/statistics'
I0908 11:54:19.186238  5807 http.cpp:1185] HTTP GET for /slave(814)/monitor/statistics from
172.17.0.7:44022
I0908 11:54:19.186302  5807 http.cpp:976] Authorizing principal 'test-principal' to GET the
'/monitor/statistics' endpoint
I0908 11:54:19.189214  5775 slave.cpp:861] Agent terminating
[       OK ] Endpoint/SlaveEndpointTest.NoAuthorizer/0 (29 ms)
[ RUN      ] Endpoint/SlaveEndpointTest.NoAuthorizer/1
I0908 11:54:19.200443  5775 containerizer.cpp:292] Using isolation { environment_secret, posix/cpu,
posix/mem, filesystem/posix, network/cni }
W0908 11:54:19.200873  5775 backend.cpp:76] Failed to create 'aufs' backend: AufsBackend requires
root privileges
W0908 11:54:19.200968  5775 backend.cpp:76] Failed to create 'bind' backend: BindBackend requires
root privileges
I0908 11:54:19.200995  5775 provisioner.cpp:255] Using default backend 'copy'
I0908 11:54:19.202378  5775 cluster.cpp:448] Creating default 'local' authorizer
I0908 11:54:19.203961  5798 slave.cpp:252] Mesos agent started on (815)@172.17.0.7:43721
I0908 11:54:19.203981  5798 slave.cpp:253] Flags at startup: --acls="" --appc_simple_discovery_uri_prefix="http://"
--appc_store_dir="/tmp/Endpoint_SlaveEndpointTest_NoAuthorizer_1_w0OSB9/store/appc" --authenticate_http_readonly="true"
--authenticate_http_readwrite="true" --authenticatee="crammd5" --authentication_backoff_factor="1secs"
--authorizer="local" --cgroups_cpu_enable_pids_and_tids_count="false" --cgroups_enable_cfs="false"
--cgroups_hierarchy="/sys/fs/cgroup" --cgroups_limit_swap="false" --cgroups_root="mesos" --container_disk_watch_interval="15secs"
--containerizers="mesos" --credential="/tmp/Endpoint_SlaveEndpointTest_NoAuthorizer_1_w0OSB9/credential"
--default_role="*" --disallow_sharing_agent_pid_namespace="false" --disk_watch_interval="1mins"
--docker="docker" --docker_kill_orphans="true" --docker_registry="https://registry-1.docker.io"
--docker_remove_delay="6hrs" --docker_socket="/var/run/docker.sock" --docker_stop_timeout="0ns"
--docker_store_dir="/tmp/Endpoint_SlaveEndpointTest_NoAuthorizer_1_w0OSB9/store/docker" --docker_volume_checkpoint_dir="/var/run/mesos/isolators/docker/volume"
--enforce_container_disk_quota="false" --executor_registration_timeout="1mins" --executor_reregistration_timeout="2secs"
--executor_shutdown_grace_period="5secs" --fetcher_cache_dir="/tmp/Endpoint_SlaveEndpointTest_NoAuthorizer_1_w0OSB9/fetch"
--fetcher_cache_size="2GB" --frameworks_home="" --gc_delay="1weeks" --gc_disk_headroom="0.1"
--hadoop_home="" --help="false" --hostname_lookup="true" --http_command_executor="false" --http_credentials="/tmp/Endpoint_SlaveEndpointTest_NoAuthorizer_1_w0OSB9/http_credentials"
--http_heartbeat_interval="30secs" --initialize_driver_logging="true" --isolation="posix/cpu,posix/mem"
--launcher="posix" --launcher_dir="/mesos/mesos-1.5.0/_build/src" --logbufsecs="0" --logging_level="INFO"
--max_completed_executors_per_framework="150" --oversubscribed_resources_interval="15secs"
--perf_duration="10secs" --perf_interval="1mins" --port="5051" --qos_correction_interval_min="0ns"
--quiet="false" --recover="reconnect" --recovery_timeout="15mins" --registration_backoff_factor="10ms"
--resources="cpus:2;gpus:0;mem:1024;disk:1024;ports:[31000-32000]" --revocable_cpu_low_priority="true"
--runtime_dir="/tmp/Endpoint_SlaveEndpointTest_NoAuthorizer_1_w0OSB9" --sandbox_directory="/mnt/mesos/sandbox"
--strict="true" --switch_user="true" --systemd_enable_support="true" --systemd_runtime_directory="/run/systemd/system"
--version="false" --work_dir="/tmp/Endpoint_SlaveEndpointTest_NoAuthorizer_1_vXF8gC" --zk_session_timeout="10secs"
I0908 11:54:19.204397  5798 credentials.hpp:86] Loading credential for authentication from
'/tmp/Endpoint_SlaveEndpointTest_NoAuthorizer_1_w0OSB9/credential'
I0908 11:54:19.204552  5798 slave.cpp:285] Agent using credential for: test-principal
I0908 11:54:19.204577  5798 credentials.hpp:37] Loading credentials for authentication from
'/tmp/Endpoint_SlaveEndpointTest_NoAuthorizer_1_w0OSB9/http_credentials'
I0908 11:54:19.204856  5798 http.cpp:1045] Creating default 'basic' HTTP authenticator for
realm 'mesos-agent-readonly'
I0908 11:54:19.205004  5798 http.cpp:1045] Creating default 'basic' HTTP authenticator for
realm 'mesos-agent-readwrite'
I0908 11:54:19.206497  5798 slave.cpp:583] Agent resources: [{"name":"cpus","scalar":{"value":2.0},"type":"SCALAR"},{"name":"mem","scalar":{"value":1024.0},"type":"SCALAR"},{"name":"disk","scalar":{"value":1024.0},"type":"SCALAR"},{"name":"ports","ranges":{"range":[{"begin":31000,"end":32000}]},"type":"RANGES"}]
I0908 11:54:19.206765  5798 slave.cpp:591] Agent attributes: [  ]
I0908 11:54:19.206779  5798 slave.cpp:600] Agent hostname: 66c21ad50261
I0908 11:54:19.206889  5796 status_update_manager.cpp:177] Pausing sending status updates
I0908 11:54:19.208254  5810 state.cpp:64] Recovering state from '/tmp/Endpoint_SlaveEndpointTest_NoAuthorizer_1_vXF8gC/meta'
I0908 11:54:19.208482  5803 status_update_manager.cpp:203] Recovering status update manager
I0908 11:54:19.208672  5817 containerizer.cpp:648] Recovering containerizer
I0908 11:54:19.209821  5806 provisioner.cpp:416] Provisioner recovery complete
I0908 11:54:19.210113  5799 slave.cpp:6298] Finished recovery
I0908 11:54:19.210522  5799 slave.cpp:6480] Querying resource estimator for oversubscribable
resources
I0908 11:54:19.210729  5811 slave.cpp:6494] Received oversubscribable resources {} from the
resource estimator
I0908 11:54:19.212790  5800 process.cpp:3929] Handling HTTP event for process 'slave(815)'
with path: '/slave(815)/monitor/statistics.json'
I0908 11:54:19.213871  5814 http.cpp:1185] HTTP GET for /slave(815)/monitor/statistics.json
from 172.17.0.7:44024
I0908 11:54:19.213950  5814 http.cpp:976] Authorizing principal 'test-principal' to GET the
'/monitor/statistics.json' endpoint
I0908 11:54:19.216394  5801 slave.cpp:861] Agent terminating
[       OK ] Endpoint/SlaveEndpointTest.NoAuthorizer/1 (26 ms)
[ RUN      ] Endpoint/SlaveEndpointTest.NoAuthorizer/2
I0908 11:54:19.226354  5775 containerizer.cpp:292] Using isolation { environment_secret, posix/cpu,
posix/mem, filesystem/posix, network/cni }
W0908 11:54:19.226799  5775 backend.cpp:76] Failed to create 'aufs' backend: AufsBackend requires
root privileges
W0908 11:54:19.226922  5775 backend.cpp:76] Failed to create 'bind' backend: BindBackend requires
root privileges
I0908 11:54:19.226958  5775 provisioner.cpp:255] Using default backend 'copy'
I0908 11:54:19.228397  5775 cluster.cpp:448] Creating default 'local' authorizer
I0908 11:54:19.229993  5797 slave.cpp:252] Mesos agent started on (816)@172.17.0.7:43721
I0908 11:54:19.230016  5797 slave.cpp:253] Flags at startup: --acls="" --appc_simple_discovery_uri_prefix="http://"
--appc_store_dir="/tmp/Endpoint_SlaveEndpointTest_NoAuthorizer_2_abJQ3h/store/appc" --authenticate_http_readonly="true"
--authenticate_http_readwrite="true" --authenticatee="crammd5" --authentication_backoff_factor="1secs"
--authorizer="local" --cgroups_cpu_enable_pids_and_tids_count="false" --cgroups_enable_cfs="false"
--cgroups_hierarchy="/sys/fs/cgroup" --cgroups_limit_swap="false" --cgroups_root="mesos" --container_disk_watch_interval="15secs"
--containerizers="mesos" --credential="/tmp/Endpoint_SlaveEndpointTest_NoAuthorizer_2_abJQ3h/credential"
--default_role="*" --disallow_sharing_agent_pid_namespace="false" --disk_watch_interval="1mins"
--docker="docker" --docker_kill_orphans="true" --docker_registry="https://registry-1.docker.io"
--docker_remove_delay="6hrs" --docker_socket="/var/run/docker.sock" --docker_stop_timeout="0ns"
--docker_store_dir="/tmp/Endpoint_SlaveEndpointTest_NoAuthorizer_2_abJQ3h/store/docker" --docker_volume_checkpoint_dir="/var/run/mesos/isolators/docker/volume"
--enforce_container_disk_quota="false" --executor_registration_timeout="1mins" --executor_reregistration_timeout="2secs"
--executor_shutdown_grace_period="5secs" --fetcher_cache_dir="/tmp/Endpoint_SlaveEndpointTest_NoAuthorizer_2_abJQ3h/fetch"
--fetcher_cache_size="2GB" --frameworks_home="" --gc_delay="1weeks" --gc_disk_headroom="0.1"
--hadoop_home="" --help="false" --hostname_lookup="true" --http_command_executor="false" --http_credentials="/tmp/Endpoint_SlaveEndpointTest_NoAuthorizer_2_abJQ3h/http_credentials"
--http_heartbeat_interval="30secs" --initialize_driver_logging="true" --isolation="posix/cpu,posix/mem"
--launcher="posix" --launcher_dir="/mesos/mesos-1.5.0/_build/src" --logbufsecs="0" --logging_level="INFO"
--max_completed_executors_per_framework="150" --oversubscribed_resources_interval="15secs"
--perf_duration="10secs" --perf_interval="1mins" --port="5051" --qos_correction_interval_min="0ns"
--quiet="false" --recover="reconnect" --recovery_timeout="15mins" --registration_backoff_factor="10ms"
--resources="cpus:2;gpus:0;mem:1024;disk:1024;ports:[31000-32000]" --revocable_cpu_low_priority="true"
--runtime_dir="/tmp/Endpoint_SlaveEndpointTest_NoAuthorizer_2_abJQ3h" --sandbox_directory="/mnt/mesos/sandbox"
--strict="true" --switch_user="true" --systemd_enable_support="true" --systemd_runtime_directory="/run/systemd/system"
--version="false" --work_dir="/tmp/Endpoint_SlaveEndpointTest_NoAuthorizer_2_AKUfFK" --zk_session_timeout="10secs"
I0908 11:54:19.230489  5797 credentials.hpp:86] Loading credential for authentication from
'/tmp/Endpoint_SlaveEndpointTest_NoAuthorizer_2_abJQ3h/credential'
I0908 11:54:19.230619  5797 slave.cpp:285] Agent using credential for: test-principal
I0908 11:54:19.230635  5797 credentials.hpp:37] Loading credentials for authentication from
'/tmp/Endpoint_SlaveEndpointTest_NoAuthorizer_2_abJQ3h/http_credentials'
I0908 11:54:19.230823  5797 http.cpp:1045] Creating default 'basic' HTTP authenticator for
realm 'mesos-agent-readonly'
I0908 11:54:19.230949  5797 http.cpp:1045] Creating default 'basic' HTTP authenticator for
realm 'mesos-agent-readwrite'
I0908 11:54:19.232059  5797 slave.cpp:583] Agent resources: [{"name":"cpus","scalar":{"value":2.0},"type":"SCALAR"},{"name":"mem","scalar":{"value":1024.0},"type":"SCALAR"},{"name":"disk","scalar":{"value":1024.0},"type":"SCALAR"},{"name":"ports","ranges":{"range":[{"begin":31000,"end":32000}]},"type":"RANGES"}]
I0908 11:54:19.232251  5797 slave.cpp:591] Agent attributes: [  ]
I0908 11:54:19.232265  5797 slave.cpp:600] Agent hostname: 66c21ad50261
I0908 11:54:19.232379  5817 status_update_manager.cpp:177] Pausing sending status updates
I0908 11:54:19.233665  5797 state.cpp:64] Recovering state from '/tmp/Endpoint_SlaveEndpointTest_NoAuthorizer_2_AKUfFK/meta'
I0908 11:54:19.233875  5798 status_update_manager.cpp:203] Recovering status update manager
I0908 11:54:19.234040  5812 containerizer.cpp:648] Recovering containerizer
I0908 11:54:19.235263  5816 provisioner.cpp:416] Provisioner recovery complete
I0908 11:54:19.235549  5817 slave.cpp:6298] Finished recovery
I0908 11:54:19.235898  5817 slave.cpp:6480] Querying resource estimator for oversubscribable
resources
I0908 11:54:19.236099  5809 slave.cpp:6494] Received oversubscribable resources {} from the
resource estimator
I0908 11:54:19.237951  5799 process.cpp:3929] Handling HTTP event for process 'slave(816)'
with path: '/slave(816)/containers'
I0908 11:54:19.239123  5800 http.cpp:1185] HTTP GET for /slave(816)/containers from 172.17.0.7:44026
I0908 11:54:19.239192  5800 http.cpp:976] Authorizing principal 'test-principal' to GET the
'/containers' endpoint
I0908 11:54:19.241847  5816 slave.cpp:861] Agent terminating
[       OK ] Endpoint/SlaveEndpointTest.NoAuthorizer/2 (28 ms)
[----------] 9 tests from Endpoint/SlaveEndpointTest (275 ms total)

[----------] 2 tests from ContainerizerType/DefaultContainerDNSFlagTest
[ RUN      ] ContainerizerType/DefaultContainerDNSFlagTest.ValidateFlag/0
[       OK ] ContainerizerType/DefaultContainerDNSFlagTest.ValidateFlag/0 (10 ms)
[ RUN      ] ContainerizerType/DefaultContainerDNSFlagTest.ValidateFlag/1
[       OK ] ContainerizerType/DefaultContainerDNSFlagTest.ValidateFlag/1 (12 ms)
[----------] 2 tests from ContainerizerType/DefaultContainerDNSFlagTest (22 ms total)

[----------] Global test environment tear-down
[==========] 1667 tests from 183 test cases ran. (540170 ms total)
[  PASSED  ] 1666 tests.
[  FAILED  ] 1 test, listed below:
[  FAILED  ] ExamplesTest.PersistentVolumeFramework

 1 FAILED TEST
  YOU HAVE 20 DISABLED TESTS

I0908 11:54:19.332953  5818 process.cpp:1068] Failed to accept socket: future discarded
make[4]: *** [check-local] Error 1
make[4]: Leaving directory `/mesos/mesos-1.5.0/_build/src'
make[3]: *** [check-am] Error 2
make[3]: Leaving directory `/mesos/mesos-1.5.0/_build/src'
make[2]: *** [check] Error 2
make[2]: Leaving directory `/mesos/mesos-1.5.0/_build/src'
make[1]: *** [check-recursive] Error 1
make[1]: Leaving directory `/mesos/mesos-1.5.0/_build'
make: *** [distcheck] Error 1
+ docker rmi mesos-1504868491-5693
Untagged: mesos-1504868491-5693:latest
Deleted: sha256:0d2c122204bd50ffa3ae4cc56167783849c25059b7f2b3e39f0a8e8108229998
Deleted: sha256:5ef19ece453d6cc77cee3e0bf22976e4ebac0aa952ea2f4bd3d8ed172ade7328
Deleted: sha256:b85f0a3113db0d4a25b7a3e1f3c76a4fbf3cc12c4a06cd83785a9a411dc80932
Deleted: sha256:2659fa82c762a0a4f7e4472ade964ef82957dfec623a5484d0770aef584ab2c4
Deleted: sha256:a0e46ac47866304929c7893a91eeb46c75fe8b64ca62b0417bff14ba99282c73
Deleted: sha256:900c6bf4c92f57cb4a7d79006036d3704a7e70dc0d24f9739f7ba8205126bc26
Deleted: sha256:426a4cf22992bc3425e21a50f3092d6c2882713f0aa011f35416a5200b10d8b5
Deleted: sha256:2b3bfab170d8fc9cd61a9649c12a5701104217b928d9f516510506ed93e4491d
Deleted: sha256:587bfad341117fba3f3570899adb40af392b3c485b8c19cb300f8018f17360c4
Deleted: sha256:138e100f204abbebb32c85b1f3ff6b222bf325025af022a457df4489aa0a20c7
Deleted: sha256:25e09fedd0d11d9df366685199f1d7caa7e7490d19b23dae1970a56b33235b6a
Deleted: sha256:8f603b5cc53ab009a92a24fa7d4ae94a142aeb903d3686bcba63240de8afacd3
Deleted: sha256:7a64270f50369687ecba99bdba8ba07db7b83b01be3d31300963a24148114604
Deleted: sha256:7794cebbd910e54ee4ef33d18fc4ab3b6e7093dd5f2b765068391d1f124bac45
Deleted: sha256:0d04ca01f874c8869a241675ab04f0e3f0def1ca387683a9aa02c3bb9f4fc6c9
Deleted: sha256:b4ba7f10cad5f6217e820b4f11cf5ae56b170cd6cc2e3add2fa3ac1af55b0e24
Deleted: sha256:af8d6228d2560dcb2e97d488fb7087f4461a2d3042482aba88d7982a4a93a9b3
Deleted: sha256:f7de77b65e8df5a29e2b0a9d87fe5c25ef46bfc40c5c53ab2634d34f9a441d61
Deleted: sha256:4408fbb0201db9cfe80a685ddc7697e1166430e587c81d551dda503973b84a74
Deleted: sha256:3860a2ee75cdf935850f66d63075f7b63d2028f76d5732a631f818f70d88f621
Deleted: sha256:75e7d814ebd126082da55bc90edb81a6a9210e9e1c2bc36e1441cb2df3b9f539
Deleted: sha256:3ee988061f400fa79c6957c91cd6e833a81b895fce1d5a1762a881d4f47385dc
Deleted: sha256:2a86f0034948507363c0c9554891a07015709664ebddde43d98e95fb5a069ed9
Deleted: sha256:973541d34a33ae1d87fca563dbfff651de93a5df1ebb16758e5d4be412bfbcbd
Deleted: sha256:89c82fe0073f85f6b24dc77fb0a9a19031d35333f494252baf171a9704e1624d
Deleted: sha256:6650956f36b7f59b9e460cb8697fd29866f117a6ef41b5ef3fe7604e4a67f9e9
Deleted: sha256:c3d2e57692dabf315030fa0281ec4f42156851fac5d7793a1894536056b459e5
Deleted: sha256:61385c7eff5df623ebfddcbe7f6434dbc2bf66242c5c10e52de44f107745be5d
Build step 'Execute shell' marked build as failure

Mime
View raw message