mesos-builds mailing list archives

Site index · List index
Message view « Date » · « Thread »
Top « Date » · « Thread »
From Apache Jenkins Server <jenk...@builds.apache.org>
Subject Build failed in Jenkins: Mesos-Buildbot » autotools,gcc,--verbose --enable-libevent --enable-ssl,GLOG_v=1 MESOS_VERBOSE=1,ubuntu:14.04,(ubuntu)&&(!ubuntu-us1)&&(!ubuntu-eu2)&&(!qnode3)&&(!H23) #4234
Date Sun, 17 Sep 2017 11:45:50 GMT
See <https://builds.apache.org/job/Mesos-Buildbot/BUILDTOOL=autotools,COMPILER=gcc,CONFIGURATION=--verbose%20--enable-libevent%20--enable-ssl,ENVIRONMENT=GLOG_v=1%20MESOS_VERBOSE=1,OS=ubuntu%3A14.04,label_exp=(ubuntu)&&(!ubuntu-us1)&&(!ubuntu-eu2)&&(!qnode3)&&(!H23)/4234/display/redirect>

------------------------------------------
[...truncated 32.07 MB...]
I0917 11:45:45.494308  8463 containerizer.cpp:246] Using isolation: posix/cpu,posix/mem,filesystem/posix,network/cni,environment_secret
W0917 11:45:45.494964  8463 backend.cpp:76] Failed to create 'aufs' backend: AufsBackend requires
root privileges
W0917 11:45:45.495077  8463 backend.cpp:76] Failed to create 'bind' backend: BindBackend requires
root privileges
I0917 11:45:45.495111  8463 provisioner.cpp:255] Using default backend 'copy'
I0917 11:45:45.498632 29656 slave.cpp:250] Mesos agent started on (806)@172.17.0.2:44156
I0917 11:45:45.498687 29656 slave.cpp:251] Flags at startup: --acls="" --appc_simple_discovery_uri_prefix="http://"
--appc_store_dir="/tmp/Endpoint_SlaveEndpointTest_UnauthorizedRequest_0_Inznnj/store/appc"
--authenticate_http_executors="true" --authenticate_http_readonly="true" --authenticate_http_readwrite="true"
--authenticatee="crammd5" --authentication_backoff_factor="1secs" --authorizer="local" --cgroups_cpu_enable_pids_and_tids_count="false"
--cgroups_enable_cfs="false" --cgroups_hierarchy="/sys/fs/cgroup" --cgroups_limit_swap="false"
--cgroups_root="mesos" --container_disk_watch_interval="15secs" --containerizers="mesos" --credential="/tmp/Endpoint_SlaveEndpointTest_UnauthorizedRequest_0_Inznnj/credential"
--default_role="*" --disallow_sharing_agent_pid_namespace="false" --disk_watch_interval="1mins"
--docker="docker" --docker_kill_orphans="true" --docker_registry="https://registry-1.docker.io"
--docker_remove_delay="6hrs" --docker_socket="/var/run/docker.sock" --docker_stop_timeout="0ns"
--docker_store_dir="/tmp/Endpoint_SlaveEndpointTest_UnauthorizedRequest_0_Inznnj/store/docker"
--docker_volume_checkpoint_dir="/var/run/mesos/isolators/docker/volume" --enforce_container_disk_quota="false"
--executor_registration_timeout="1mins" --executor_reregistration_timeout="2secs" --executor_secret_key="/tmp/Endpoint_SlaveEndpointTest_UnauthorizedRequest_0_Inznnj/executor_secret_key"
--executor_shutdown_grace_period="5secs" --fetcher_cache_dir="/tmp/Endpoint_SlaveEndpointTest_UnauthorizedRequest_0_Inznnj/fetch"
--fetcher_cache_size="2GB" --frameworks_home="" --gc_delay="1weeks" --gc_disk_headroom="0.1"
--hadoop_home="" --help="false" --hostname_lookup="true" --http_command_executor="false" --http_credentials="/tmp/Endpoint_SlaveEndpointTest_UnauthorizedRequest_0_Inznnj/http_credentials"
--http_heartbeat_interval="30secs" --initialize_driver_logging="true" --isolation="posix/cpu,posix/mem"
--launcher="posix" --launcher_dir="/mesos/mesos-1.4.0/_build/src" --logbufsecs="0" --logging_level="INFO"
--max_completed_executors_per_framework="150" --oversubscribed_resources_interval="15secs"
--perf_duration="10secs" --perf_interval="1mins" --port="5051" --qos_correction_interval_min="0ns"
--quiet="false" --recover="reconnect" --recovery_timeout="15mins" --registration_backoff_factor="10ms"
--resources="cpus:2;gpus:0;mem:1024;disk:1024;ports:[31000-32000]" --revocable_cpu_low_priority="true"
--runtime_dir="/tmp/Endpoint_SlaveEndpointTest_UnauthorizedRequest_0_Inznnj" --sandbox_directory="/mnt/mesos/sandbox"
--strict="true" --switch_user="true" --systemd_enable_support="true" --systemd_runtime_directory="/run/systemd/system"
--version="false" --work_dir="/tmp/Endpoint_SlaveEndpointTest_UnauthorizedRequest_0_xvvQPL"
I0917 11:45:45.499358 29656 credentials.hpp:86] Loading credential for authentication from
'/tmp/Endpoint_SlaveEndpointTest_UnauthorizedRequest_0_Inznnj/credential'
I0917 11:45:45.499703 29656 slave.cpp:283] Agent using credential for: test-principal
I0917 11:45:45.499743 29656 credentials.hpp:37] Loading credentials for authentication from
'/tmp/Endpoint_SlaveEndpointTest_UnauthorizedRequest_0_Inznnj/http_credentials'
I0917 11:45:45.500301 29656 http.cpp:1026] Creating default 'basic' HTTP authenticator for
realm 'mesos-agent-executor'
I0917 11:45:45.500635 29656 http.cpp:1047] Creating default 'jwt' HTTP authenticator for realm
'mesos-agent-executor'
I0917 11:45:45.501037 29656 http.cpp:1026] Creating default 'basic' HTTP authenticator for
realm 'mesos-agent-readonly'
I0917 11:45:45.501209 29656 http.cpp:1047] Creating default 'jwt' HTTP authenticator for realm
'mesos-agent-readonly'
I0917 11:45:45.501399 29656 http.cpp:1026] Creating default 'basic' HTTP authenticator for
realm 'mesos-agent-readwrite'
I0917 11:45:45.501500 29656 http.cpp:1047] Creating default 'jwt' HTTP authenticator for realm
'mesos-agent-readwrite'
I0917 11:45:45.502984 29656 slave.cpp:565] Agent resources: [{"name":"cpus","scalar":{"value":2.0},"type":"SCALAR"},{"name":"mem","scalar":{"value":1024.0},"type":"SCALAR"},{"name":"disk","scalar":{"value":1024.0},"type":"SCALAR"},{"name":"ports","ranges":{"range":[{"begin":31000,"end":32000}]},"type":"RANGES"}]
I0917 11:45:45.503226 29656 slave.cpp:573] Agent attributes: [  ]
I0917 11:45:45.503240 29656 slave.cpp:582] Agent hostname: 9f5af5f9390c
I0917 11:45:45.503408 29644 status_update_manager.cpp:177] Pausing sending status updates
I0917 11:45:45.504988 29639 state.cpp:64] Recovering state from '/tmp/Endpoint_SlaveEndpointTest_UnauthorizedRequest_0_xvvQPL/meta'
I0917 11:45:45.505347 29653 status_update_manager.cpp:203] Recovering status update manager
I0917 11:45:45.505606 29657 containerizer.cpp:609] Recovering containerizer
I0917 11:45:45.507268 29652 provisioner.cpp:416] Provisioner recovery complete
I0917 11:45:45.507613 29644 slave.cpp:6295] Finished recovery
I0917 11:45:45.508033 29644 slave.cpp:6477] Querying resource estimator for oversubscribable
resources
I0917 11:45:45.508330 29662 slave.cpp:6491] Received oversubscribable resources {} from the
resource estimator
I0917 11:45:45.510180 29640 process.cpp:3927] Handling HTTP event for process 'slave(806)'
with path: '/slave(806)/monitor/statistics'
I0917 11:45:45.512161 29652 http.cpp:1166] HTTP GET for /slave(806)/monitor/statistics from
172.17.0.2:33726
I0917 11:45:45.512228 29652 http.cpp:957] Authorizing principal 'test-principal' to GET the
'/monitor/statistics' endpoint
I0917 11:45:45.514641 29662 slave.cpp:843] Agent terminating
[       OK ] Endpoint/SlaveEndpointTest.UnauthorizedRequest/0 (31 ms)
[ RUN      ] Endpoint/SlaveEndpointTest.UnauthorizedRequest/1
I0917 11:45:45.526690  8463 containerizer.cpp:246] Using isolation: posix/cpu,posix/mem,filesystem/posix,network/cni,environment_secret
W0917 11:45:45.527392  8463 backend.cpp:76] Failed to create 'aufs' backend: AufsBackend requires
root privileges
W0917 11:45:45.527539  8463 backend.cpp:76] Failed to create 'bind' backend: BindBackend requires
root privileges
I0917 11:45:45.527580  8463 provisioner.cpp:255] Using default backend 'copy'
I0917 11:45:45.531980 29643 slave.cpp:250] Mesos agent started on (807)@172.17.0.2:44156
I0917 11:45:45.532009 29643 slave.cpp:251] Flags at startup: --acls="" --appc_simple_discovery_uri_prefix="http://"
--appc_store_dir="/tmp/Endpoint_SlaveEndpointTest_UnauthorizedRequest_1_4PHPNt/store/appc"
--authenticate_http_executors="true" --authenticate_http_readonly="true" --authenticate_http_readwrite="true"
--authenticatee="crammd5" --authentication_backoff_factor="1secs" --authorizer="local" --cgroups_cpu_enable_pids_and_tids_count="false"
--cgroups_enable_cfs="false" --cgroups_hierarchy="/sys/fs/cgroup" --cgroups_limit_swap="false"
--cgroups_root="mesos" --container_disk_watch_interval="15secs" --containerizers="mesos" --credential="/tmp/Endpoint_SlaveEndpointTest_UnauthorizedRequest_1_4PHPNt/credential"
--default_role="*" --disallow_sharing_agent_pid_namespace="false" --disk_watch_interval="1mins"
--docker="docker" --docker_kill_orphans="true" --docker_registry="https://registry-1.docker.io"
--docker_remove_delay="6hrs" --docker_socket="/var/run/docker.sock" --docker_stop_timeout="0ns"
--docker_store_dir="/tmp/Endpoint_SlaveEndpointTest_UnauthorizedRequest_1_4PHPNt/store/docker"
--docker_volume_checkpoint_dir="/var/run/mesos/isolators/docker/volume" --enforce_container_disk_quota="false"
--executor_registration_timeout="1mins" --executor_reregistration_timeout="2secs" --executor_secret_key="/tmp/Endpoint_SlaveEndpointTest_UnauthorizedRequest_1_4PHPNt/executor_secret_key"
--executor_shutdown_grace_period="5secs" --fetcher_cache_dir="/tmp/Endpoint_SlaveEndpointTest_UnauthorizedRequest_1_4PHPNt/fetch"
--fetcher_cache_size="2GB" --frameworks_home="" --gc_delay="1weeks" --gc_disk_headroom="0.1"
--hadoop_home="" --help="false" --hostname_lookup="true" --http_command_executor="false" --http_credentials="/tmp/Endpoint_SlaveEndpointTest_UnauthorizedRequest_1_4PHPNt/http_credentials"
--http_heartbeat_interval="30secs" --initialize_driver_logging="true" --isolation="posix/cpu,posix/mem"
--launcher="posix" --launcher_dir="/mesos/mesos-1.4.0/_build/src" --logbufsecs="0" --logging_level="INFO"
--max_completed_executors_per_framework="150" --oversubscribed_resources_interval="15secs"
--perf_duration="10secs" --perf_interval="1mins" --port="5051" --qos_correction_interval_min="0ns"
--quiet="false" --recover="reconnect" --recovery_timeout="15mins" --registration_backoff_factor="10ms"
--resources="cpus:2;gpus:0;mem:1024;disk:1024;ports:[31000-32000]" --revocable_cpu_low_priority="true"
--runtime_dir="/tmp/Endpoint_SlaveEndpointTest_UnauthorizedRequest_1_4PHPNt" --sandbox_directory="/mnt/mesos/sandbox"
--strict="true" --switch_user="true" --systemd_enable_support="true" --systemd_runtime_directory="/run/systemd/system"
--version="false" --work_dir="/tmp/Endpoint_SlaveEndpointTest_UnauthorizedRequest_1_BgxzbW"
I0917 11:45:45.532507 29643 credentials.hpp:86] Loading credential for authentication from
'/tmp/Endpoint_SlaveEndpointTest_UnauthorizedRequest_1_4PHPNt/credential'
I0917 11:45:45.532657 29643 slave.cpp:283] Agent using credential for: test-principal
I0917 11:45:45.532678 29643 credentials.hpp:37] Loading credentials for authentication from
'/tmp/Endpoint_SlaveEndpointTest_UnauthorizedRequest_1_4PHPNt/http_credentials'
I0917 11:45:45.532955 29643 http.cpp:1026] Creating default 'basic' HTTP authenticator for
realm 'mesos-agent-executor'
I0917 11:45:45.533071 29643 http.cpp:1047] Creating default 'jwt' HTTP authenticator for realm
'mesos-agent-executor'
I0917 11:45:45.533291 29643 http.cpp:1026] Creating default 'basic' HTTP authenticator for
realm 'mesos-agent-readonly'
I0917 11:45:45.533399 29643 http.cpp:1047] Creating default 'jwt' HTTP authenticator for realm
'mesos-agent-readonly'
I0917 11:45:45.533596 29643 http.cpp:1026] Creating default 'basic' HTTP authenticator for
realm 'mesos-agent-readwrite'
I0917 11:45:45.533694 29643 http.cpp:1047] Creating default 'jwt' HTTP authenticator for realm
'mesos-agent-readwrite'
I0917 11:45:45.535095 29643 slave.cpp:565] Agent resources: [{"name":"cpus","scalar":{"value":2.0},"type":"SCALAR"},{"name":"mem","scalar":{"value":1024.0},"type":"SCALAR"},{"name":"disk","scalar":{"value":1024.0},"type":"SCALAR"},{"name":"ports","ranges":{"range":[{"begin":31000,"end":32000}]},"type":"RANGES"}]
I0917 11:45:45.535326 29643 slave.cpp:573] Agent attributes: [  ]
I0917 11:45:45.535339 29643 slave.cpp:582] Agent hostname: 9f5af5f9390c
I0917 11:45:45.535477 29649 status_update_manager.cpp:177] Pausing sending status updates
I0917 11:45:45.536833 29661 state.cpp:64] Recovering state from '/tmp/Endpoint_SlaveEndpointTest_UnauthorizedRequest_1_BgxzbW/meta'
I0917 11:45:45.537098 29657 status_update_manager.cpp:203] Recovering status update manager
I0917 11:45:45.537328 29640 containerizer.cpp:609] Recovering containerizer
I0917 11:45:45.538578 29639 provisioner.cpp:416] Provisioner recovery complete
I0917 11:45:45.538877 29649 slave.cpp:6295] Finished recovery
I0917 11:45:45.539304 29649 slave.cpp:6477] Querying resource estimator for oversubscribable
resources
I0917 11:45:45.539515 29653 slave.cpp:6491] Received oversubscribable resources {} from the
resource estimator
I0917 11:45:45.541319 29646 process.cpp:3927] Handling HTTP event for process 'slave(807)'
with path: '/slave(807)/monitor/statistics.json'
I0917 11:45:45.542889 29650 http.cpp:1166] HTTP GET for /slave(807)/monitor/statistics.json
from 172.17.0.2:33730
I0917 11:45:45.542971 29650 http.cpp:957] Authorizing principal 'test-principal' to GET the
'/monitor/statistics.json' endpoint
I0917 11:45:45.544598 29642 slave.cpp:843] Agent terminating
[       OK ] Endpoint/SlaveEndpointTest.UnauthorizedRequest/1 (30 ms)
[ RUN      ] Endpoint/SlaveEndpointTest.UnauthorizedRequest/2
I0917 11:45:45.554858  8463 containerizer.cpp:246] Using isolation: posix/cpu,posix/mem,filesystem/posix,network/cni,environment_secret
W0917 11:45:45.555366  8463 backend.cpp:76] Failed to create 'aufs' backend: AufsBackend requires
root privileges
W0917 11:45:45.555485  8463 backend.cpp:76] Failed to create 'bind' backend: BindBackend requires
root privileges
I0917 11:45:45.555531  8463 provisioner.cpp:255] Using default backend 'copy'
I0917 11:45:45.559015 29657 slave.cpp:250] Mesos agent started on (808)@172.17.0.2:44156
I0917 11:45:45.559038 29657 slave.cpp:251] Flags at startup: --acls="" --appc_simple_discovery_uri_prefix="http://"
--appc_store_dir="/tmp/Endpoint_SlaveEndpointTest_UnauthorizedRequest_2_SYo6vE/store/appc"
--authenticate_http_executors="true" --authenticate_http_readonly="true" --authenticate_http_readwrite="true"
--authenticatee="crammd5" --authentication_backoff_factor="1secs" --authorizer="local" --cgroups_cpu_enable_pids_and_tids_count="false"
--cgroups_enable_cfs="false" --cgroups_hierarchy="/sys/fs/cgroup" --cgroups_limit_swap="false"
--cgroups_root="mesos" --container_disk_watch_interval="15secs" --containerizers="mesos" --credential="/tmp/Endpoint_SlaveEndpointTest_UnauthorizedRequest_2_SYo6vE/credential"
--default_role="*" --disallow_sharing_agent_pid_namespace="false" --disk_watch_interval="1mins"
--docker="docker" --docker_kill_orphans="true" --docker_registry="https://registry-1.docker.io"
--docker_remove_delay="6hrs" --docker_socket="/var/run/docker.sock" --docker_stop_timeout="0ns"
--docker_store_dir="/tmp/Endpoint_SlaveEndpointTest_UnauthorizedRequest_2_SYo6vE/store/docker"
--docker_volume_checkpoint_dir="/var/run/mesos/isolators/docker/volume" --enforce_container_disk_quota="false"
--executor_registration_timeout="1mins" --executor_reregistration_timeout="2secs" --executor_secret_key="/tmp/Endpoint_SlaveEndpointTest_UnauthorizedRequest_2_SYo6vE/executor_secret_key"
--executor_shutdown_grace_period="5secs" --fetcher_cache_dir="/tmp/Endpoint_SlaveEndpointTest_UnauthorizedRequest_2_SYo6vE/fetch"
--fetcher_cache_size="2GB" --frameworks_home="" --gc_delay="1weeks" --gc_disk_headroom="0.1"
--hadoop_home="" --help="false" --hostname_lookup="true" --http_command_executor="false" --http_credentials="/tmp/Endpoint_SlaveEndpointTest_UnauthorizedRequest_2_SYo6vE/http_credentials"
--http_heartbeat_interval="30secs" --initialize_driver_logging="true" --isolation="posix/cpu,posix/mem"
--launcher="posix" --launcher_dir="/mesos/mesos-1.4.0/_build/src" --logbufsecs="0" --logging_level="INFO"
--max_completed_executors_per_framework="150" --oversubscribed_resources_interval="15secs"
--perf_duration="10secs" --perf_interval="1mins" --port="5051" --qos_correction_interval_min="0ns"
--quiet="false" --recover="reconnect" --recovery_timeout="15mins" --registration_backoff_factor="10ms"
--resources="cpus:2;gpus:0;mem:1024;disk:1024;ports:[31000-32000]" --revocable_cpu_low_priority="true"
--runtime_dir="/tmp/Endpoint_SlaveEndpointTest_UnauthorizedRequest_2_SYo6vE" --sandbox_directory="/mnt/mesos/sandbox"
--strict="true" --switch_user="true" --systemd_enable_support="true" --systemd_runtime_directory="/run/systemd/system"
--version="false" --work_dir="/tmp/Endpoint_SlaveEndpointTest_UnauthorizedRequest_2_Jx5tP6"
I0917 11:45:45.559386 29657 credentials.hpp:86] Loading credential for authentication from
'/tmp/Endpoint_SlaveEndpointTest_UnauthorizedRequest_2_SYo6vE/credential'
I0917 11:45:45.559548 29657 slave.cpp:283] Agent using credential for: test-principal
I0917 11:45:45.559571 29657 credentials.hpp:37] Loading credentials for authentication from
'/tmp/Endpoint_SlaveEndpointTest_UnauthorizedRequest_2_SYo6vE/http_credentials'
I0917 11:45:45.559834 29657 http.cpp:1026] Creating default 'basic' HTTP authenticator for
realm 'mesos-agent-executor'
I0917 11:45:45.559952 29657 http.cpp:1047] Creating default 'jwt' HTTP authenticator for realm
'mesos-agent-executor'
I0917 11:45:45.560137 29657 http.cpp:1026] Creating default 'basic' HTTP authenticator for
realm 'mesos-agent-readonly'
I0917 11:45:45.560235 29657 http.cpp:1047] Creating default 'jwt' HTTP authenticator for realm
'mesos-agent-readonly'
I0917 11:45:45.560413 29657 http.cpp:1026] Creating default 'basic' HTTP authenticator for
realm 'mesos-agent-readwrite'
I0917 11:45:45.560513 29657 http.cpp:1047] Creating default 'jwt' HTTP authenticator for realm
'mesos-agent-readwrite'
I0917 11:45:45.562347 29657 slave.cpp:565] Agent resources: [{"name":"cpus","scalar":{"value":2.0},"type":"SCALAR"},{"name":"mem","scalar":{"value":1024.0},"type":"SCALAR"},{"name":"disk","scalar":{"value":1024.0},"type":"SCALAR"},{"name":"ports","ranges":{"range":[{"begin":31000,"end":32000}]},"type":"RANGES"}]
I0917 11:45:45.562746 29657 slave.cpp:573] Agent attributes: [  ]
I0917 11:45:45.562770 29657 slave.cpp:582] Agent hostname: 9f5af5f9390c
I0917 11:45:45.562937 29649 status_update_manager.cpp:177] Pausing sending status updates
I0917 11:45:45.564247 29645 state.cpp:64] Recovering state from '/tmp/Endpoint_SlaveEndpointTest_UnauthorizedRequest_2_Jx5tP6/meta'
I0917 11:45:45.564553 29641 status_update_manager.cpp:203] Recovering status update manager
I0917 11:45:45.564743 29652 containerizer.cpp:609] Recovering containerizer
I0917 11:45:45.565934 29662 provisioner.cpp:416] Provisioner recovery complete
I0917 11:45:45.566323 29649 slave.cpp:6295] Finished recovery
I0917 11:45:45.566783 29649 slave.cpp:6477] Querying resource estimator for oversubscribable
resources
I0917 11:45:45.566996 29653 slave.cpp:6491] Received oversubscribable resources {} from the
resource estimator
I0917 11:45:45.568753 29658 process.cpp:3927] Handling HTTP event for process 'slave(808)'
with path: '/slave(808)/containers'
I0917 11:45:45.570528 29643 http.cpp:1166] HTTP GET for /slave(808)/containers from 172.17.0.2:33732
I0917 11:45:45.570593 29643 http.cpp:957] Authorizing principal 'test-principal' to GET the
'/containers' endpoint
I0917 11:45:45.572685  8463 slave.cpp:843] Agent terminating
[       OK ] Endpoint/SlaveEndpointTest.UnauthorizedRequest/2 (30 ms)
[ RUN      ] Endpoint/SlaveEndpointTest.NoAuthorizer/0
I0917 11:45:45.588618  8463 containerizer.cpp:246] Using isolation: posix/cpu,posix/mem,filesystem/posix,network/cni,environment_secret
W0917 11:45:45.589154  8463 backend.cpp:76] Failed to create 'aufs' backend: AufsBackend requires
root privileges
W0917 11:45:45.589318  8463 backend.cpp:76] Failed to create 'bind' backend: BindBackend requires
root privileges
I0917 11:45:45.589356  8463 provisioner.cpp:255] Using default backend 'copy'
I0917 11:45:45.592497  8463 cluster.cpp:448] Creating default 'local' authorizer
I0917 11:45:45.594754 29644 slave.cpp:250] Mesos agent started on (809)@172.17.0.2:44156
I0917 11:45:45.594784 29644 slave.cpp:251] Flags at startup: --acls="" --appc_simple_discovery_uri_prefix="http://"
--appc_store_dir="/tmp/Endpoint_SlaveEndpointTest_NoAuthorizer_0_hbWjwP/store/appc" --authenticate_http_executors="true"
--authenticate_http_readonly="true" --authenticate_http_readwrite="true" --authenticatee="crammd5"
--authentication_backoff_factor="1secs" --authorizer="local" --cgroups_cpu_enable_pids_and_tids_count="false"
--cgroups_enable_cfs="false" --cgroups_hierarchy="/sys/fs/cgroup" --cgroups_limit_swap="false"
--cgroups_root="mesos" --container_disk_watch_interval="15secs" --containerizers="mesos" --credential="/tmp/Endpoint_SlaveEndpointTest_NoAuthorizer_0_hbWjwP/credential"
--default_role="*" --disallow_sharing_agent_pid_namespace="false" --disk_watch_interval="1mins"
--docker="docker" --docker_kill_orphans="true" --docker_registry="https://registry-1.docker.io"
--docker_remove_delay="6hrs" --docker_socket="/var/run/docker.sock" --docker_stop_timeout="0ns"
--docker_store_dir="/tmp/Endpoint_SlaveEndpointTest_NoAuthorizer_0_hbWjwP/store/docker" --docker_volume_checkpoint_dir="/var/run/mesos/isolators/docker/volume"
--enforce_container_disk_quota="false" --executor_registration_timeout="1mins" --executor_reregistration_timeout="2secs"
--executor_secret_key="/tmp/Endpoint_SlaveEndpointTest_NoAuthorizer_0_hbWjwP/executor_secret_key"
--executor_shutdown_grace_period="5secs" --fetcher_cache_dir="/tmp/Endpoint_SlaveEndpointTest_NoAuthorizer_0_hbWjwP/fetch"
--fetcher_cache_size="2GB" --frameworks_home="" --gc_delay="1weeks" --gc_disk_headroom="0.1"
--hadoop_home="" --help="false" --hostname_lookup="true" --http_command_executor="false" --http_credentials="/tmp/Endpoint_SlaveEndpointTest_NoAuthorizer_0_hbWjwP/http_credentials"
--http_heartbeat_interval="30secs" --initialize_driver_logging="true" --isolation="posix/cpu,posix/mem"
--launcher="posix" --launcher_dir="/mesos/mesos-1.4.0/_build/src" --logbufsecs="0" --logging_level="INFO"
--max_completed_executors_per_framework="150" --oversubscribed_resources_interval="15secs"
--perf_duration="10secs" --perf_interval="1mins" --port="5051" --qos_correction_interval_min="0ns"
--quiet="false" --recover="reconnect" --recovery_timeout="15mins" --registration_backoff_factor="10ms"
--resources="cpus:2;gpus:0;mem:1024;disk:1024;ports:[31000-32000]" --revocable_cpu_low_priority="true"
--runtime_dir="/tmp/Endpoint_SlaveEndpointTest_NoAuthorizer_0_hbWjwP" --sandbox_directory="/mnt/mesos/sandbox"
--strict="true" --switch_user="true" --systemd_enable_support="true" --systemd_runtime_directory="/run/systemd/system"
--version="false" --work_dir="/tmp/Endpoint_SlaveEndpointTest_NoAuthorizer_0_7IT1Kh"
I0917 11:45:45.595260 29644 credentials.hpp:86] Loading credential for authentication from
'/tmp/Endpoint_SlaveEndpointTest_NoAuthorizer_0_hbWjwP/credential'
I0917 11:45:45.595450 29644 slave.cpp:283] Agent using credential for: test-principal
I0917 11:45:45.595471 29644 credentials.hpp:37] Loading credentials for authentication from
'/tmp/Endpoint_SlaveEndpointTest_NoAuthorizer_0_hbWjwP/http_credentials'
I0917 11:45:45.595788 29644 http.cpp:1026] Creating default 'basic' HTTP authenticator for
realm 'mesos-agent-executor'
I0917 11:45:45.595911 29644 http.cpp:1047] Creating default 'jwt' HTTP authenticator for realm
'mesos-agent-executor'
I0917 11:45:45.596144 29644 http.cpp:1026] Creating default 'basic' HTTP authenticator for
realm 'mesos-agent-readonly'
I0917 11:45:45.596247 29644 http.cpp:1047] Creating default 'jwt' HTTP authenticator for realm
'mesos-agent-readonly'
I0917 11:45:45.596433 29644 http.cpp:1026] Creating default 'basic' HTTP authenticator for
realm 'mesos-agent-readwrite'
I0917 11:45:45.596542 29644 http.cpp:1047] Creating default 'jwt' HTTP authenticator for realm
'mesos-agent-readwrite'
I0917 11:45:45.598053 29644 slave.cpp:565] Agent resources: [{"name":"cpus","scalar":{"value":2.0},"type":"SCALAR"},{"name":"mem","scalar":{"value":1024.0},"type":"SCALAR"},{"name":"disk","scalar":{"value":1024.0},"type":"SCALAR"},{"name":"ports","ranges":{"range":[{"begin":31000,"end":32000}]},"type":"RANGES"}]
I0917 11:45:45.598299 29644 slave.cpp:573] Agent attributes: [  ]
I0917 11:45:45.598315 29644 slave.cpp:582] Agent hostname: 9f5af5f9390c
I0917 11:45:45.598459 29645 status_update_manager.cpp:177] Pausing sending status updates
I0917 11:45:45.599854 29653 state.cpp:64] Recovering state from '/tmp/Endpoint_SlaveEndpointTest_NoAuthorizer_0_7IT1Kh/meta'
I0917 11:45:45.600142 29653 status_update_manager.cpp:203] Recovering status update manager
I0917 11:45:45.600404 29652 containerizer.cpp:609] Recovering containerizer
I0917 11:45:45.601934 29661 provisioner.cpp:416] Provisioner recovery complete
I0917 11:45:45.602320 29654 slave.cpp:6295] Finished recovery
I0917 11:45:45.602843 29654 slave.cpp:6477] Querying resource estimator for oversubscribable
resources
I0917 11:45:45.603140 29646 slave.cpp:6491] Received oversubscribable resources {} from the
resource estimator
I0917 11:45:45.605186 29658 process.cpp:3927] Handling HTTP event for process 'slave(809)'
with path: '/slave(809)/monitor/statistics'
I0917 11:45:45.606968 29643 http.cpp:1166] HTTP GET for /slave(809)/monitor/statistics from
172.17.0.2:33734
I0917 11:45:45.607034 29643 http.cpp:957] Authorizing principal 'test-principal' to GET the
'/monitor/statistics' endpoint
I0917 11:45:45.610781  8463 slave.cpp:843] Agent terminating
[       OK ] Endpoint/SlaveEndpointTest.NoAuthorizer/0 (37 ms)
[ RUN      ] Endpoint/SlaveEndpointTest.NoAuthorizer/1
I0917 11:45:45.623265  8463 containerizer.cpp:246] Using isolation: posix/cpu,posix/mem,filesystem/posix,network/cni,environment_secret
W0917 11:45:45.623738  8463 backend.cpp:76] Failed to create 'aufs' backend: AufsBackend requires
root privileges
W0917 11:45:45.623837  8463 backend.cpp:76] Failed to create 'bind' backend: BindBackend requires
root privileges
I0917 11:45:45.623868  8463 provisioner.cpp:255] Using default backend 'copy'
I0917 11:45:45.626127  8463 cluster.cpp:448] Creating default 'local' authorizer
I0917 11:45:45.628257 29660 slave.cpp:250] Mesos agent started on (810)@172.17.0.2:44156
I0917 11:45:45.628280 29660 slave.cpp:251] Flags at startup: --acls="" --appc_simple_discovery_uri_prefix="http://"
--appc_store_dir="/tmp/Endpoint_SlaveEndpointTest_NoAuthorizer_1_TkInS0/store/appc" --authenticate_http_executors="true"
--authenticate_http_readonly="true" --authenticate_http_readwrite="true" --authenticatee="crammd5"
--authentication_backoff_factor="1secs" --authorizer="local" --cgroups_cpu_enable_pids_and_tids_count="false"
--cgroups_enable_cfs="false" --cgroups_hierarchy="/sys/fs/cgroup" --cgroups_limit_swap="false"
--cgroups_root="mesos" --container_disk_watch_interval="15secs" --containerizers="mesos" --credential="/tmp/Endpoint_SlaveEndpointTest_NoAuthorizer_1_TkInS0/credential"
--default_role="*" --disallow_sharing_agent_pid_namespace="false" --disk_watch_interval="1mins"
--docker="docker" --docker_kill_orphans="true" --docker_registry="https://registry-1.docker.io"
--docker_remove_delay="6hrs" --docker_socket="/var/run/docker.sock" --docker_stop_timeout="0ns"
--docker_store_dir="/tmp/Endpoint_SlaveEndpointTest_NoAuthorizer_1_TkInS0/store/docker" --docker_volume_checkpoint_dir="/var/run/mesos/isolators/docker/volume"
--enforce_container_disk_quota="false" --executor_registration_timeout="1mins" --executor_reregistration_timeout="2secs"
--executor_secret_key="/tmp/Endpoint_SlaveEndpointTest_NoAuthorizer_1_TkInS0/executor_secret_key"
--executor_shutdown_grace_period="5secs" --fetcher_cache_dir="/tmp/Endpoint_SlaveEndpointTest_NoAuthorizer_1_TkInS0/fetch"
--fetcher_cache_size="2GB" --frameworks_home="" --gc_delay="1weeks" --gc_disk_headroom="0.1"
--hadoop_home="" --help="false" --hostname_lookup="true" --http_command_executor="false" --http_credentials="/tmp/Endpoint_SlaveEndpointTest_NoAuthorizer_1_TkInS0/http_credentials"
--http_heartbeat_interval="30secs" --initialize_driver_logging="true" --isolation="posix/cpu,posix/mem"
--launcher="posix" --launcher_dir="/mesos/mesos-1.4.0/_build/src" --logbufsecs="0" --logging_level="INFO"
--max_completed_executors_per_framework="150" --oversubscribed_resources_interval="15secs"
--perf_duration="10secs" --perf_interval="1mins" --port="5051" --qos_correction_interval_min="0ns"
--quiet="false" --recover="reconnect" --recovery_timeout="15mins" --registration_backoff_factor="10ms"
--resources="cpus:2;gpus:0;mem:1024;disk:1024;ports:[31000-32000]" --revocable_cpu_low_priority="true"
--runtime_dir="/tmp/Endpoint_SlaveEndpointTest_NoAuthorizer_1_TkInS0" --sandbox_directory="/mnt/mesos/sandbox"
--strict="true" --switch_user="true" --systemd_enable_support="true" --systemd_runtime_directory="/run/systemd/system"
--version="false" --work_dir="/tmp/Endpoint_SlaveEndpointTest_NoAuthorizer_1_EihE1s"
I0917 11:45:45.628693 29660 credentials.hpp:86] Loading credential for authentication from
'/tmp/Endpoint_SlaveEndpointTest_NoAuthorizer_1_TkInS0/credential'
I0917 11:45:45.628835 29660 slave.cpp:283] Agent using credential for: test-principal
I0917 11:45:45.628857 29660 credentials.hpp:37] Loading credentials for authentication from
'/tmp/Endpoint_SlaveEndpointTest_NoAuthorizer_1_TkInS0/http_credentials'
I0917 11:45:45.629226 29660 http.cpp:1026] Creating default 'basic' HTTP authenticator for
realm 'mesos-agent-executor'
I0917 11:45:45.629369 29660 http.cpp:1047] Creating default 'jwt' HTTP authenticator for realm
'mesos-agent-executor'
I0917 11:45:45.629736 29660 http.cpp:1026] Creating default 'basic' HTTP authenticator for
realm 'mesos-agent-readonly'
I0917 11:45:45.629881 29660 http.cpp:1047] Creating default 'jwt' HTTP authenticator for realm
'mesos-agent-readonly'
I0917 11:45:45.630093 29660 http.cpp:1026] Creating default 'basic' HTTP authenticator for
realm 'mesos-agent-readwrite'
I0917 11:45:45.630204 29660 http.cpp:1047] Creating default 'jwt' HTTP authenticator for realm
'mesos-agent-readwrite'
I0917 11:45:45.631575 29660 slave.cpp:565] Agent resources: [{"name":"cpus","scalar":{"value":2.0},"type":"SCALAR"},{"name":"mem","scalar":{"value":1024.0},"type":"SCALAR"},{"name":"disk","scalar":{"value":1024.0},"type":"SCALAR"},{"name":"ports","ranges":{"range":[{"begin":31000,"end":32000}]},"type":"RANGES"}]
I0917 11:45:45.631803 29660 slave.cpp:573] Agent attributes: [  ]
I0917 11:45:45.631816 29660 slave.cpp:582] Agent hostname: 9f5af5f9390c
I0917 11:45:45.631973 29658 status_update_manager.cpp:177] Pausing sending status updates
I0917 11:45:45.633297 29657 state.cpp:64] Recovering state from '/tmp/Endpoint_SlaveEndpointTest_NoAuthorizer_1_EihE1s/meta'
I0917 11:45:45.633590 29643 status_update_manager.cpp:203] Recovering status update manager
I0917 11:45:45.633826 29656 containerizer.cpp:609] Recovering containerizer
I0917 11:45:45.635545 29654 provisioner.cpp:416] Provisioner recovery complete
I0917 11:45:45.635924 29654 slave.cpp:6295] Finished recovery
I0917 11:45:45.636330 29654 slave.cpp:6477] Querying resource estimator for oversubscribable
resources
I0917 11:45:45.636550 29662 slave.cpp:6491] Received oversubscribable resources {} from the
resource estimator
I0917 11:45:45.638574 29646 process.cpp:3927] Handling HTTP event for process 'slave(810)'
with path: '/slave(810)/monitor/statistics.json'
I0917 11:45:45.640720 29642 http.cpp:1166] HTTP GET for /slave(810)/monitor/statistics.json
from 172.17.0.2:33738
I0917 11:45:45.640791 29642 http.cpp:957] Authorizing principal 'test-principal' to GET the
'/monitor/statistics.json' endpoint
I0917 11:45:45.644825 29645 slave.cpp:843] Agent terminating
[       OK ] Endpoint/SlaveEndpointTest.NoAuthorizer/1 (33 ms)
[ RUN      ] Endpoint/SlaveEndpointTest.NoAuthorizer/2
I0917 11:45:45.656630  8463 containerizer.cpp:246] Using isolation: posix/cpu,posix/mem,filesystem/posix,network/cni,environment_secret
W0917 11:45:45.657181  8463 backend.cpp:76] Failed to create 'aufs' backend: AufsBackend requires
root privileges
W0917 11:45:45.657292  8463 backend.cpp:76] Failed to create 'bind' backend: BindBackend requires
root privileges
I0917 11:45:45.657326  8463 provisioner.cpp:255] Using default backend 'copy'
I0917 11:45:45.659116  8463 cluster.cpp:448] Creating default 'local' authorizer
I0917 11:45:45.660887 29656 slave.cpp:250] Mesos agent started on (811)@172.17.0.2:44156
I0917 11:45:45.660907 29656 slave.cpp:251] Flags at startup: --acls="" --appc_simple_discovery_uri_prefix="http://"
--appc_store_dir="/tmp/Endpoint_SlaveEndpointTest_NoAuthorizer_2_90hjyc/store/appc" --authenticate_http_executors="true"
--authenticate_http_readonly="true" --authenticate_http_readwrite="true" --authenticatee="crammd5"
--authentication_backoff_factor="1secs" --authorizer="local" --cgroups_cpu_enable_pids_and_tids_count="false"
--cgroups_enable_cfs="false" --cgroups_hierarchy="/sys/fs/cgroup" --cgroups_limit_swap="false"
--cgroups_root="mesos" --container_disk_watch_interval="15secs" --containerizers="mesos" --credential="/tmp/Endpoint_SlaveEndpointTest_NoAuthorizer_2_90hjyc/credential"
--default_role="*" --disallow_sharing_agent_pid_namespace="false" --disk_watch_interval="1mins"
--docker="docker" --docker_kill_orphans="true" --docker_registry="https://registry-1.docker.io"
--docker_remove_delay="6hrs" --docker_socket="/var/run/docker.sock" --docker_stop_timeout="0ns"
--docker_store_dir="/tmp/Endpoint_SlaveEndpointTest_NoAuthorizer_2_90hjyc/store/docker" --docker_volume_checkpoint_dir="/var/run/mesos/isolators/docker/volume"
--enforce_container_disk_quota="false" --executor_registration_timeout="1mins" --executor_reregistration_timeout="2secs"
--executor_secret_key="/tmp/Endpoint_SlaveEndpointTest_NoAuthorizer_2_90hjyc/executor_secret_key"
--executor_shutdown_grace_period="5secs" --fetcher_cache_dir="/tmp/Endpoint_SlaveEndpointTest_NoAuthorizer_2_90hjyc/fetch"
--fetcher_cache_size="2GB" --frameworks_home="" --gc_delay="1weeks" --gc_disk_headroom="0.1"
--hadoop_home="" --help="false" --hostname_lookup="true" --http_command_executor="false" --http_credentials="/tmp/Endpoint_SlaveEndpointTest_NoAuthorizer_2_90hjyc/http_credentials"
--http_heartbeat_interval="30secs" --initialize_driver_logging="true" --isolation="posix/cpu,posix/mem"
--launcher="posix" --launcher_dir="/mesos/mesos-1.4.0/_build/src" --logbufsecs="0" --logging_level="INFO"
--max_completed_executors_per_framework="150" --oversubscribed_resources_interval="15secs"
--perf_duration="10secs" --perf_interval="1mins" --port="5051" --qos_correction_interval_min="0ns"
--quiet="false" --recover="reconnect" --recovery_timeout="15mins" --registration_backoff_factor="10ms"
--resources="cpus:2;gpus:0;mem:1024;disk:1024;ports:[31000-32000]" --revocable_cpu_low_priority="true"
--runtime_dir="/tmp/Endpoint_SlaveEndpointTest_NoAuthorizer_2_90hjyc" --sandbox_directory="/mnt/mesos/sandbox"
--strict="true" --switch_user="true" --systemd_enable_support="true" --systemd_runtime_directory="/run/systemd/system"
--version="false" --work_dir="/tmp/Endpoint_SlaveEndpointTest_NoAuthorizer_2_sfbCCE"
I0917 11:45:45.661288 29656 credentials.hpp:86] Loading credential for authentication from
'/tmp/Endpoint_SlaveEndpointTest_NoAuthorizer_2_90hjyc/credential'
I0917 11:45:45.661453 29656 slave.cpp:283] Agent using credential for: test-principal
I0917 11:45:45.661473 29656 credentials.hpp:37] Loading credentials for authentication from
'/tmp/Endpoint_SlaveEndpointTest_NoAuthorizer_2_90hjyc/http_credentials'
I0917 11:45:45.661792 29656 http.cpp:1026] Creating default 'basic' HTTP authenticator for
realm 'mesos-agent-executor'
I0917 11:45:45.661927 29656 http.cpp:1047] Creating default 'jwt' HTTP authenticator for realm
'mesos-agent-executor'
I0917 11:45:45.662168 29656 http.cpp:1026] Creating default 'basic' HTTP authenticator for
realm 'mesos-agent-readonly'
I0917 11:45:45.662281 29656 http.cpp:1047] Creating default 'jwt' HTTP authenticator for realm
'mesos-agent-readonly'
I0917 11:45:45.662581 29656 http.cpp:1026] Creating default 'basic' HTTP authenticator for
realm 'mesos-agent-readwrite'
I0917 11:45:45.662714 29656 http.cpp:1047] Creating default 'jwt' HTTP authenticator for realm
'mesos-agent-readwrite'
I0917 11:45:45.664252 29656 slave.cpp:565] Agent resources: [{"name":"cpus","scalar":{"value":2.0},"type":"SCALAR"},{"name":"mem","scalar":{"value":1024.0},"type":"SCALAR"},{"name":"disk","scalar":{"value":1024.0},"type":"SCALAR"},{"name":"ports","ranges":{"range":[{"begin":31000,"end":32000}]},"type":"RANGES"}]
I0917 11:45:45.664494 29656 slave.cpp:573] Agent attributes: [  ]
I0917 11:45:45.664506 29656 slave.cpp:582] Agent hostname: 9f5af5f9390c
I0917 11:45:45.664680 29649 status_update_manager.cpp:177] Pausing sending status updates
I0917 11:45:45.665994 29662 state.cpp:64] Recovering state from '/tmp/Endpoint_SlaveEndpointTest_NoAuthorizer_2_sfbCCE/meta'
I0917 11:45:45.666260 29658 status_update_manager.cpp:203] Recovering status update manager
I0917 11:45:45.666546 29650 containerizer.cpp:609] Recovering containerizer
I0917 11:45:45.668220 29651 provisioner.cpp:416] Provisioner recovery complete
I0917 11:45:45.668629 29657 slave.cpp:6295] Finished recovery
I0917 11:45:45.669060 29657 slave.cpp:6477] Querying resource estimator for oversubscribable
resources
I0917 11:45:45.669271 29648 slave.cpp:6491] Received oversubscribable resources {} from the
resource estimator
I0917 11:45:45.671206 29660 process.cpp:3927] Handling HTTP event for process 'slave(811)'
with path: '/slave(811)/containers'
I0917 11:45:45.673053 29651 http.cpp:1166] HTTP GET for /slave(811)/containers from 172.17.0.2:33740
I0917 11:45:45.673147 29651 http.cpp:957] Authorizing principal 'test-principal' to GET the
'/containers' endpoint
I0917 11:45:45.677062 29657 slave.cpp:843] Agent terminating
[       OK ] Endpoint/SlaveEndpointTest.NoAuthorizer/2 (32 ms)
[----------] 9 tests from Endpoint/SlaveEndpointTest (287 ms total)

[----------] 2 tests from ContainerizerType/DefaultContainerDNSFlagTest
[ RUN      ] ContainerizerType/DefaultContainerDNSFlagTest.ValidateFlag/0
[       OK ] ContainerizerType/DefaultContainerDNSFlagTest.ValidateFlag/0 (9 ms)
[ RUN      ] ContainerizerType/DefaultContainerDNSFlagTest.ValidateFlag/1
[       OK ] ContainerizerType/DefaultContainerDNSFlagTest.ValidateFlag/1 (10 ms)
[----------] 2 tests from ContainerizerType/DefaultContainerDNSFlagTest (19 ms total)

[----------] Global test environment tear-down
[==========] 1663 tests from 184 test cases ran. (551414 ms total)
[  PASSED  ] 1662 tests.
[  FAILED  ] 1 test, listed below:
[  FAILED  ] ExamplesTest.PythonFramework

 1 FAILED TEST
  YOU HAVE 20 DISABLED TESTS

I0917 11:45:45.759270 29663 process.cpp:1068] Failed to accept socket: future discarded
make[4]: *** [check-local] Error 1
make[4]: Leaving directory `/mesos/mesos-1.4.0/_build/src'
make[3]: *** [check-am] Error 2
make[3]: Leaving directory `/mesos/mesos-1.4.0/_build/src'
make[2]: *** [check] Error 2
make[2]: Leaving directory `/mesos/mesos-1.4.0/_build/src'
make[1]: *** [check-recursive] Error 1
make[1]: Leaving directory `/mesos/mesos-1.4.0/_build'
make: *** [distcheck] Error 1
+ docker rmi mesos-1505645498-17096
Untagged: mesos-1505645498-17096:latest
Deleted: sha256:5cdec55202fbf6fc78d841604243b3ba61b1337e0007fcb7a9e96d6013c998c3
Deleted: sha256:8d7387a9b578e022c1e1ebdc82c880f75f88a9306afbe3aee495e2022fc7123e
Deleted: sha256:6524b65dae01eb2a97301f2c823720f5e0a701e8b94583e06fd3f22862e5a2d0
Deleted: sha256:bcc5516501120e6882dce81ff7854fac70b82ff41cc2507746495f8ef73aedbc
Deleted: sha256:25f2d8b00024f5e000af858e2bee2cdae95722e78d3de43c92664725fcd42030
Deleted: sha256:80649b48bf078526f8dcfb9732448a43903e215b57fa0f64a0843e433f294622
Deleted: sha256:8059f686e35ca490fa0ed0bee7c867d0582b8f95764fcdc91b60b0cc2ab3b998
Deleted: sha256:08fec335a284bcd1b3cc1cedef9625ad4e58ce84dc2654801beacac37ea374c3
Deleted: sha256:6c9b86ef26bb91b6eaffb5fed194f2feafcae327ad96cf7ba39c2a8769e328c2
Deleted: sha256:82b47f0d32ca85fe2d2efc22f39c023360bac71d6cd7b4eedbb0fdf7de091f09
Deleted: sha256:e3aef5db65cb33daced4e9c15396b3e82c6e4290586b829469a8c6f4577b71bf
Deleted: sha256:b9ec3b39271073f861dc4a6a6a20175cfd8cb532786612df0789af65dd4163cf
Deleted: sha256:f718ebfb36fc890c37d4e2363cd1d42e2ce543a000f48a87f6e246ec036b022f
Deleted: sha256:744dbd9e12429bf31deb882f1ce507080cc3d16419a37e811e435b7fb16b28a7
Deleted: sha256:fa8093929c7495f3d0cb260fc7ecb1091d5bffbf8547730be8c87e98b8e6b452
Deleted: sha256:471b1c702ad9f88d2fa2272b1ff5e9466dc6b386c64695bd567a56f307bd5fee
Deleted: sha256:7a23259ca39331a7814fe046144284174ac0bf9ec409486f2f276bc3f3529f1c
Deleted: sha256:5a496004baa1c50e368358d8221882bda06135d9bb3e36fba4fea1c95ee0b2c7
Deleted: sha256:a3c0393869bd0a9bd6bcec1ff3f7f7a919a462573311402bdb50db447ab8ab4e
Deleted: sha256:84fd6b7e9a876ff6f362102a926e59d76db704f0153b53b5f53c05ccea1bab3b
Deleted: sha256:27beb4a0f390898bdf03b18077ef0c199fb1dbfa1affb42e0a9292f6ea6165b6
Deleted: sha256:7781ef71f1afe36c32ef1866d9aceb4859437895af13fcc6676710abf7327df6
Deleted: sha256:89fada71bafe58bc15d51e731f74c0e64a39102d18925b35dcf9858906b6d351
Deleted: sha256:26d180a71f5a69971371cca6ba41af3c1de0532ef7a459141b019cc8693206f4
Build step 'Execute shell' marked build as failure

Mime
View raw message