mesos-builds mailing list archives

Site index · List index
Message view « Date » · « Thread »
Top « Date » · « Thread »
From Apache Jenkins Server <jenk...@builds.apache.org>
Subject Build failed in Jenkins: Mesos-Reviewbot #19625
Date Fri, 29 Sep 2017 15:23:53 GMT
See <https://builds.apache.org/job/Mesos-Reviewbot/19625/display/redirect>

------------------------------------------
[...truncated 31.60 MB...]
I0929 15:23:39.219065  5796 http.cpp:1045] Creating default 'basic' HTTP authenticator for
realm 'mesos-agent-readonly'
I0929 15:23:39.219223  5796 http.cpp:1045] Creating default 'basic' HTTP authenticator for
realm 'mesos-agent-readwrite'
I0929 15:23:39.220489  5796 slave.cpp:585] Agent resources: [{"name":"cpus","scalar":{"value":2.0},"type":"SCALAR"},{"name":"mem","scalar":{"value":1024.0},"type":"SCALAR"},{"name":"disk","scalar":{"value":1024.0},"type":"SCALAR"},{"name":"ports","ranges":{"range":[{"begin":31000,"end":32000}]},"type":"RANGES"}]
I0929 15:23:39.220708  5796 slave.cpp:593] Agent attributes: [  ]
I0929 15:23:39.220723  5796 slave.cpp:602] Agent hostname: 6210057c624d
I0929 15:23:39.220943  5813 status_update_manager.cpp:177] Pausing sending status updates
I0929 15:23:39.222187  5805 state.cpp:64] Recovering state from '/tmp/Endpoint_SlaveEndpointTest_AuthorizedRequest_2_uhPFlk/meta'
I0929 15:23:39.222502  5803 status_update_manager.cpp:203] Recovering status update manager
I0929 15:23:39.222781  5798 containerizer.cpp:648] Recovering containerizer
I0929 15:23:39.224442  5799 provisioner.cpp:416] Provisioner recovery complete
I0929 15:23:39.224959  5799 slave.cpp:6322] Finished recovery
I0929 15:23:39.225442  5799 slave.cpp:6504] Querying resource estimator for oversubscribable
resources
I0929 15:23:39.225713  5800 slave.cpp:6518] Received oversubscribable resources {} from the
resource estimator
I0929 15:23:39.228118  5794 process.cpp:3929] Handling HTTP event for process 'slave(811)'
with path: '/slave(811)/containers'
I0929 15:23:39.229482  5795 http.cpp:1185] HTTP GET for /slave(811)/containers from 172.17.0.2:56236
I0929 15:23:39.229557  5795 http.cpp:976] Authorizing principal 'test-principal' to GET the
'/containers' endpoint
I0929 15:23:39.233937  5774 slave.cpp:869] Agent terminating
[       OK ] Endpoint/SlaveEndpointTest.AuthorizedRequest/2 (33 ms)
[ RUN      ] Endpoint/SlaveEndpointTest.UnauthorizedRequest/0
I0929 15:23:39.246093  5774 containerizer.cpp:292] Using isolation { environment_secret, posix/cpu,
posix/mem, filesystem/posix, network/cni }
W0929 15:23:39.246647  5774 backend.cpp:76] Failed to create 'aufs' backend: AufsBackend requires
root privileges
W0929 15:23:39.246773  5774 backend.cpp:76] Failed to create 'bind' backend: BindBackend requires
root privileges
I0929 15:23:39.246814  5774 provisioner.cpp:255] Using default backend 'copy'
I0929 15:23:39.250959  5815 slave.cpp:254] Mesos agent started on (812)@172.17.0.2:42399
I0929 15:23:39.250988  5815 slave.cpp:255] Flags at startup: --acls="" --appc_simple_discovery_uri_prefix="http://"
--appc_store_dir="/tmp/Endpoint_SlaveEndpointTest_UnauthorizedRequest_0_mosgw4/store/appc"
--authenticate_http_readonly="true" --authenticate_http_readwrite="true" --authenticatee="crammd5"
--authentication_backoff_factor="1secs" --authorizer="local" --cgroups_cpu_enable_pids_and_tids_count="false"
--cgroups_enable_cfs="false" --cgroups_hierarchy="/sys/fs/cgroup" --cgroups_limit_swap="false"
--cgroups_root="mesos" --container_disk_watch_interval="15secs" --containerizers="mesos" --credential="/tmp/Endpoint_SlaveEndpointTest_UnauthorizedRequest_0_mosgw4/credential"
--default_role="*" --disallow_sharing_agent_pid_namespace="false" --disk_watch_interval="1mins"
--docker="docker" --docker_kill_orphans="true" --docker_registry="https://registry-1.docker.io"
--docker_remove_delay="6hrs" --docker_socket="/var/run/docker.sock" --docker_stop_timeout="0ns"
--docker_store_dir="/tmp/Endpoint_SlaveEndpointTest_UnauthorizedRequest_0_mosgw4/store/docker"
--docker_volume_checkpoint_dir="/var/run/mesos/isolators/docker/volume" --enforce_container_disk_quota="false"
--executor_registration_timeout="1mins" --executor_reregistration_timeout="2secs" --executor_shutdown_grace_period="5secs"
--fetcher_cache_dir="/tmp/Endpoint_SlaveEndpointTest_UnauthorizedRequest_0_mosgw4/fetch" --fetcher_cache_size="2GB"
--frameworks_home="" --gc_delay="1weeks" --gc_disk_headroom="0.1" --hadoop_home="" --help="false"
--hostname_lookup="true" --http_command_executor="false" --http_credentials="/tmp/Endpoint_SlaveEndpointTest_UnauthorizedRequest_0_mosgw4/http_credentials"
--http_heartbeat_interval="30secs" --initialize_driver_logging="true" --isolation="posix/cpu,posix/mem"
--launcher="posix" --launcher_dir="/mesos/mesos-1.5.0/_build/src" --logbufsecs="0" --logging_level="INFO"
--max_completed_executors_per_framework="150" --oversubscribed_resources_interval="15secs"
--perf_duration="10secs" --perf_interval="1mins" --port="5051" --qos_correction_interval_min="0ns"
--quiet="false" --recover="reconnect" --recovery_timeout="15mins" --registration_backoff_factor="10ms"
--resources="cpus:2;gpus:0;mem:1024;disk:1024;ports:[31000-32000]" --revocable_cpu_low_priority="true"
--runtime_dir="/tmp/Endpoint_SlaveEndpointTest_UnauthorizedRequest_0_mosgw4" --sandbox_directory="/mnt/mesos/sandbox"
--strict="true" --switch_user="true" --systemd_enable_support="true" --systemd_runtime_directory="/run/systemd/system"
--version="false" --work_dir="/tmp/Endpoint_SlaveEndpointTest_UnauthorizedRequest_0_yAsmRI"
--zk_session_timeout="10secs"
I0929 15:23:39.251397  5815 credentials.hpp:86] Loading credential for authentication from
'/tmp/Endpoint_SlaveEndpointTest_UnauthorizedRequest_0_mosgw4/credential'
I0929 15:23:39.251541  5815 slave.cpp:287] Agent using credential for: test-principal
I0929 15:23:39.251564  5815 credentials.hpp:37] Loading credentials for authentication from
'/tmp/Endpoint_SlaveEndpointTest_UnauthorizedRequest_0_mosgw4/http_credentials'
I0929 15:23:39.251775  5815 http.cpp:1045] Creating default 'basic' HTTP authenticator for
realm 'mesos-agent-readonly'
I0929 15:23:39.251919  5815 http.cpp:1045] Creating default 'basic' HTTP authenticator for
realm 'mesos-agent-readwrite'
I0929 15:23:39.253178  5815 slave.cpp:585] Agent resources: [{"name":"cpus","scalar":{"value":2.0},"type":"SCALAR"},{"name":"mem","scalar":{"value":1024.0},"type":"SCALAR"},{"name":"disk","scalar":{"value":1024.0},"type":"SCALAR"},{"name":"ports","ranges":{"range":[{"begin":31000,"end":32000}]},"type":"RANGES"}]
I0929 15:23:39.253398  5815 slave.cpp:593] Agent attributes: [  ]
I0929 15:23:39.253410  5815 slave.cpp:602] Agent hostname: 6210057c624d
I0929 15:23:39.253621  5797 status_update_manager.cpp:177] Pausing sending status updates
I0929 15:23:39.255009  5812 state.cpp:64] Recovering state from '/tmp/Endpoint_SlaveEndpointTest_UnauthorizedRequest_0_yAsmRI/meta'
I0929 15:23:39.255393  5800 status_update_manager.cpp:203] Recovering status update manager
I0929 15:23:39.255635  5800 containerizer.cpp:648] Recovering containerizer
I0929 15:23:39.257113  5807 provisioner.cpp:416] Provisioner recovery complete
I0929 15:23:39.257524  5807 slave.cpp:6322] Finished recovery
I0929 15:23:39.257959  5807 slave.cpp:6504] Querying resource estimator for oversubscribable
resources
I0929 15:23:39.258194  5795 slave.cpp:6518] Received oversubscribable resources {} from the
resource estimator
I0929 15:23:39.260509  5810 process.cpp:3929] Handling HTTP event for process 'slave(812)'
with path: '/slave(812)/monitor/statistics'
I0929 15:23:39.261867  5794 http.cpp:1185] HTTP GET for /slave(812)/monitor/statistics from
172.17.0.2:56238
I0929 15:23:39.261932  5794 http.cpp:976] Authorizing principal 'test-principal' to GET the
'/monitor/statistics' endpoint
I0929 15:23:39.264281  5774 slave.cpp:869] Agent terminating
[       OK ] Endpoint/SlaveEndpointTest.UnauthorizedRequest/0 (31 ms)
[ RUN      ] Endpoint/SlaveEndpointTest.UnauthorizedRequest/1
I0929 15:23:39.277063  5774 containerizer.cpp:292] Using isolation { environment_secret, posix/cpu,
posix/mem, filesystem/posix, network/cni }
W0929 15:23:39.277573  5774 backend.cpp:76] Failed to create 'aufs' backend: AufsBackend requires
root privileges
W0929 15:23:39.277678  5774 backend.cpp:76] Failed to create 'bind' backend: BindBackend requires
root privileges
I0929 15:23:39.277709  5774 provisioner.cpp:255] Using default backend 'copy'
I0929 15:23:39.281865  5813 slave.cpp:254] Mesos agent started on (813)@172.17.0.2:42399
I0929 15:23:39.281893  5813 slave.cpp:255] Flags at startup: --acls="" --appc_simple_discovery_uri_prefix="http://"
--appc_store_dir="/tmp/Endpoint_SlaveEndpointTest_UnauthorizedRequest_1_6TQDpt/store/appc"
--authenticate_http_readonly="true" --authenticate_http_readwrite="true" --authenticatee="crammd5"
--authentication_backoff_factor="1secs" --authorizer="local" --cgroups_cpu_enable_pids_and_tids_count="false"
--cgroups_enable_cfs="false" --cgroups_hierarchy="/sys/fs/cgroup" --cgroups_limit_swap="false"
--cgroups_root="mesos" --container_disk_watch_interval="15secs" --containerizers="mesos" --credential="/tmp/Endpoint_SlaveEndpointTest_UnauthorizedRequest_1_6TQDpt/credential"
--default_role="*" --disallow_sharing_agent_pid_namespace="false" --disk_watch_interval="1mins"
--docker="docker" --docker_kill_orphans="true" --docker_registry="https://registry-1.docker.io"
--docker_remove_delay="6hrs" --docker_socket="/var/run/docker.sock" --docker_stop_timeout="0ns"
--docker_store_dir="/tmp/Endpoint_SlaveEndpointTest_UnauthorizedRequest_1_6TQDpt/store/docker"
--docker_volume_checkpoint_dir="/var/run/mesos/isolators/docker/volume" --enforce_container_disk_quota="false"
--executor_registration_timeout="1mins" --executor_reregistration_timeout="2secs" --executor_shutdown_grace_period="5secs"
--fetcher_cache_dir="/tmp/Endpoint_SlaveEndpointTest_UnauthorizedRequest_1_6TQDpt/fetch" --fetcher_cache_size="2GB"
--frameworks_home="" --gc_delay="1weeks" --gc_disk_headroom="0.1" --hadoop_home="" --help="false"
--hostname_lookup="true" --http_command_executor="false" --http_credentials="/tmp/Endpoint_SlaveEndpointTest_UnauthorizedRequest_1_6TQDpt/http_credentials"
--http_heartbeat_interval="30secs" --initialize_driver_logging="true" --isolation="posix/cpu,posix/mem"
--launcher="posix" --launcher_dir="/mesos/mesos-1.5.0/_build/src" --logbufsecs="0" --logging_level="INFO"
--max_completed_executors_per_framework="150" --oversubscribed_resources_interval="15secs"
--perf_duration="10secs" --perf_interval="1mins" --port="5051" --qos_correction_interval_min="0ns"
--quiet="false" --recover="reconnect" --recovery_timeout="15mins" --registration_backoff_factor="10ms"
--resources="cpus:2;gpus:0;mem:1024;disk:1024;ports:[31000-32000]" --revocable_cpu_low_priority="true"
--runtime_dir="/tmp/Endpoint_SlaveEndpointTest_UnauthorizedRequest_1_6TQDpt" --sandbox_directory="/mnt/mesos/sandbox"
--strict="true" --switch_user="true" --systemd_enable_support="true" --systemd_runtime_directory="/run/systemd/system"
--version="false" --work_dir="/tmp/Endpoint_SlaveEndpointTest_UnauthorizedRequest_1_Wxt6F7"
--zk_session_timeout="10secs"
I0929 15:23:39.282304  5813 credentials.hpp:86] Loading credential for authentication from
'/tmp/Endpoint_SlaveEndpointTest_UnauthorizedRequest_1_6TQDpt/credential'
I0929 15:23:39.282464  5813 slave.cpp:287] Agent using credential for: test-principal
I0929 15:23:39.282487  5813 credentials.hpp:37] Loading credentials for authentication from
'/tmp/Endpoint_SlaveEndpointTest_UnauthorizedRequest_1_6TQDpt/http_credentials'
I0929 15:23:39.282701  5813 http.cpp:1045] Creating default 'basic' HTTP authenticator for
realm 'mesos-agent-readonly'
I0929 15:23:39.282845  5813 http.cpp:1045] Creating default 'basic' HTTP authenticator for
realm 'mesos-agent-readwrite'
I0929 15:23:39.284106  5813 slave.cpp:585] Agent resources: [{"name":"cpus","scalar":{"value":2.0},"type":"SCALAR"},{"name":"mem","scalar":{"value":1024.0},"type":"SCALAR"},{"name":"disk","scalar":{"value":1024.0},"type":"SCALAR"},{"name":"ports","ranges":{"range":[{"begin":31000,"end":32000}]},"type":"RANGES"}]
I0929 15:23:39.284332  5813 slave.cpp:593] Agent attributes: [  ]
I0929 15:23:39.284346  5813 slave.cpp:602] Agent hostname: 6210057c624d
I0929 15:23:39.284482  5814 status_update_manager.cpp:177] Pausing sending status updates
I0929 15:23:39.285722  5810 state.cpp:64] Recovering state from '/tmp/Endpoint_SlaveEndpointTest_UnauthorizedRequest_1_Wxt6F7/meta'
I0929 15:23:39.286064  5810 status_update_manager.cpp:203] Recovering status update manager
I0929 15:23:39.286300  5797 containerizer.cpp:648] Recovering containerizer
I0929 15:23:39.287497  5804 provisioner.cpp:416] Provisioner recovery complete
I0929 15:23:39.287951  5804 slave.cpp:6322] Finished recovery
I0929 15:23:39.288409  5804 slave.cpp:6504] Querying resource estimator for oversubscribable
resources
I0929 15:23:39.288642  5798 slave.cpp:6518] Received oversubscribable resources {} from the
resource estimator
I0929 15:23:39.291020  5794 process.cpp:3929] Handling HTTP event for process 'slave(813)'
with path: '/slave(813)/monitor/statistics.json'
I0929 15:23:39.292325  5799 http.cpp:1185] HTTP GET for /slave(813)/monitor/statistics.json
from 172.17.0.2:56240
I0929 15:23:39.292390  5799 http.cpp:976] Authorizing principal 'test-principal' to GET the
'/monitor/statistics.json' endpoint
I0929 15:23:39.294867  5774 slave.cpp:869] Agent terminating
[       OK ] Endpoint/SlaveEndpointTest.UnauthorizedRequest/1 (29 ms)
[ RUN      ] Endpoint/SlaveEndpointTest.UnauthorizedRequest/2
I0929 15:23:39.306668  5774 containerizer.cpp:292] Using isolation { environment_secret, posix/cpu,
posix/mem, filesystem/posix, network/cni }
W0929 15:23:39.307137  5774 backend.cpp:76] Failed to create 'aufs' backend: AufsBackend requires
root privileges
W0929 15:23:39.307251  5774 backend.cpp:76] Failed to create 'bind' backend: BindBackend requires
root privileges
I0929 15:23:39.307281  5774 provisioner.cpp:255] Using default backend 'copy'
I0929 15:23:39.311054  5804 slave.cpp:254] Mesos agent started on (814)@172.17.0.2:42399
I0929 15:23:39.311080  5804 slave.cpp:255] Flags at startup: --acls="" --appc_simple_discovery_uri_prefix="http://"
--appc_store_dir="/tmp/Endpoint_SlaveEndpointTest_UnauthorizedRequest_2_ggFKAS/store/appc"
--authenticate_http_readonly="true" --authenticate_http_readwrite="true" --authenticatee="crammd5"
--authentication_backoff_factor="1secs" --authorizer="local" --cgroups_cpu_enable_pids_and_tids_count="false"
--cgroups_enable_cfs="false" --cgroups_hierarchy="/sys/fs/cgroup" --cgroups_limit_swap="false"
--cgroups_root="mesos" --container_disk_watch_interval="15secs" --containerizers="mesos" --credential="/tmp/Endpoint_SlaveEndpointTest_UnauthorizedRequest_2_ggFKAS/credential"
--default_role="*" --disallow_sharing_agent_pid_namespace="false" --disk_watch_interval="1mins"
--docker="docker" --docker_kill_orphans="true" --docker_registry="https://registry-1.docker.io"
--docker_remove_delay="6hrs" --docker_socket="/var/run/docker.sock" --docker_stop_timeout="0ns"
--docker_store_dir="/tmp/Endpoint_SlaveEndpointTest_UnauthorizedRequest_2_ggFKAS/store/docker"
--docker_volume_checkpoint_dir="/var/run/mesos/isolators/docker/volume" --enforce_container_disk_quota="false"
--executor_registration_timeout="1mins" --executor_reregistration_timeout="2secs" --executor_shutdown_grace_period="5secs"
--fetcher_cache_dir="/tmp/Endpoint_SlaveEndpointTest_UnauthorizedRequest_2_ggFKAS/fetch" --fetcher_cache_size="2GB"
--frameworks_home="" --gc_delay="1weeks" --gc_disk_headroom="0.1" --hadoop_home="" --help="false"
--hostname_lookup="true" --http_command_executor="false" --http_credentials="/tmp/Endpoint_SlaveEndpointTest_UnauthorizedRequest_2_ggFKAS/http_credentials"
--http_heartbeat_interval="30secs" --initialize_driver_logging="true" --isolation="posix/cpu,posix/mem"
--launcher="posix" --launcher_dir="/mesos/mesos-1.5.0/_build/src" --logbufsecs="0" --logging_level="INFO"
--max_completed_executors_per_framework="150" --oversubscribed_resources_interval="15secs"
--perf_duration="10secs" --perf_interval="1mins" --port="5051" --qos_correction_interval_min="0ns"
--quiet="false" --recover="reconnect" --recovery_timeout="15mins" --registration_backoff_factor="10ms"
--resources="cpus:2;gpus:0;mem:1024;disk:1024;ports:[31000-32000]" --revocable_cpu_low_priority="true"
--runtime_dir="/tmp/Endpoint_SlaveEndpointTest_UnauthorizedRequest_2_ggFKAS" --sandbox_directory="/mnt/mesos/sandbox"
--strict="true" --switch_user="true" --systemd_enable_support="true" --systemd_runtime_directory="/run/systemd/system"
--version="false" --work_dir="/tmp/Endpoint_SlaveEndpointTest_UnauthorizedRequest_2_MQfOMw"
--zk_session_timeout="10secs"
I0929 15:23:39.311475  5804 credentials.hpp:86] Loading credential for authentication from
'/tmp/Endpoint_SlaveEndpointTest_UnauthorizedRequest_2_ggFKAS/credential'
I0929 15:23:39.311614  5804 slave.cpp:287] Agent using credential for: test-principal
I0929 15:23:39.311635  5804 credentials.hpp:37] Loading credentials for authentication from
'/tmp/Endpoint_SlaveEndpointTest_UnauthorizedRequest_2_ggFKAS/http_credentials'
I0929 15:23:39.311843  5804 http.cpp:1045] Creating default 'basic' HTTP authenticator for
realm 'mesos-agent-readonly'
I0929 15:23:39.311985  5804 http.cpp:1045] Creating default 'basic' HTTP authenticator for
realm 'mesos-agent-readwrite'
I0929 15:23:39.313206  5804 slave.cpp:585] Agent resources: [{"name":"cpus","scalar":{"value":2.0},"type":"SCALAR"},{"name":"mem","scalar":{"value":1024.0},"type":"SCALAR"},{"name":"disk","scalar":{"value":1024.0},"type":"SCALAR"},{"name":"ports","ranges":{"range":[{"begin":31000,"end":32000}]},"type":"RANGES"}]
I0929 15:23:39.313423  5804 slave.cpp:593] Agent attributes: [  ]
I0929 15:23:39.313436  5804 slave.cpp:602] Agent hostname: 6210057c624d
I0929 15:23:39.313565  5813 status_update_manager.cpp:177] Pausing sending status updates
I0929 15:23:39.314813  5808 state.cpp:64] Recovering state from '/tmp/Endpoint_SlaveEndpointTest_UnauthorizedRequest_2_MQfOMw/meta'
I0929 15:23:39.315088  5814 status_update_manager.cpp:203] Recovering status update manager
I0929 15:23:39.315291  5803 containerizer.cpp:648] Recovering containerizer
I0929 15:23:39.316758  5796 provisioner.cpp:416] Provisioner recovery complete
I0929 15:23:39.317234  5797 slave.cpp:6322] Finished recovery
I0929 15:23:39.317704  5797 slave.cpp:6504] Querying resource estimator for oversubscribable
resources
I0929 15:23:39.317939  5814 slave.cpp:6518] Received oversubscribable resources {} from the
resource estimator
I0929 15:23:39.320144  5811 process.cpp:3929] Handling HTTP event for process 'slave(814)'
with path: '/slave(814)/containers'
I0929 15:23:39.321326  5807 http.cpp:1185] HTTP GET for /slave(814)/containers from 172.17.0.2:56242
I0929 15:23:39.321405  5807 http.cpp:976] Authorizing principal 'test-principal' to GET the
'/containers' endpoint
I0929 15:23:39.324265  5774 slave.cpp:869] Agent terminating
[       OK ] Endpoint/SlaveEndpointTest.UnauthorizedRequest/2 (30 ms)
[ RUN      ] Endpoint/SlaveEndpointTest.NoAuthorizer/0
I0929 15:23:39.337011  5774 containerizer.cpp:292] Using isolation { environment_secret, posix/cpu,
posix/mem, filesystem/posix, network/cni }
W0929 15:23:39.337517  5774 backend.cpp:76] Failed to create 'aufs' backend: AufsBackend requires
root privileges
W0929 15:23:39.337630  5774 backend.cpp:76] Failed to create 'bind' backend: BindBackend requires
root privileges
I0929 15:23:39.337669  5774 provisioner.cpp:255] Using default backend 'copy'
I0929 15:23:39.340302  5774 cluster.cpp:448] Creating default 'local' authorizer
I0929 15:23:39.344127  5799 slave.cpp:254] Mesos agent started on (815)@172.17.0.2:42399
I0929 15:23:39.344173  5799 slave.cpp:255] Flags at startup: --acls="" --appc_simple_discovery_uri_prefix="http://"
--appc_store_dir="/tmp/Endpoint_SlaveEndpointTest_NoAuthorizer_0_CDxC3h/store/appc" --authenticate_http_readonly="true"
--authenticate_http_readwrite="true" --authenticatee="crammd5" --authentication_backoff_factor="1secs"
--authorizer="local" --cgroups_cpu_enable_pids_and_tids_count="false" --cgroups_enable_cfs="false"
--cgroups_hierarchy="/sys/fs/cgroup" --cgroups_limit_swap="false" --cgroups_root="mesos" --container_disk_watch_interval="15secs"
--containerizers="mesos" --credential="/tmp/Endpoint_SlaveEndpointTest_NoAuthorizer_0_CDxC3h/credential"
--default_role="*" --disallow_sharing_agent_pid_namespace="false" --disk_watch_interval="1mins"
--docker="docker" --docker_kill_orphans="true" --docker_registry="https://registry-1.docker.io"
--docker_remove_delay="6hrs" --docker_socket="/var/run/docker.sock" --docker_stop_timeout="0ns"
--docker_store_dir="/tmp/Endpoint_SlaveEndpointTest_NoAuthorizer_0_CDxC3h/store/docker" --docker_volume_checkpoint_dir="/var/run/mesos/isolators/docker/volume"
--enforce_container_disk_quota="false" --executor_registration_timeout="1mins" --executor_reregistration_timeout="2secs"
--executor_shutdown_grace_period="5secs" --fetcher_cache_dir="/tmp/Endpoint_SlaveEndpointTest_NoAuthorizer_0_CDxC3h/fetch"
--fetcher_cache_size="2GB" --frameworks_home="" --gc_delay="1weeks" --gc_disk_headroom="0.1"
--hadoop_home="" --help="false" --hostname_lookup="true" --http_command_executor="false" --http_credentials="/tmp/Endpoint_SlaveEndpointTest_NoAuthorizer_0_CDxC3h/http_credentials"
--http_heartbeat_interval="30secs" --initialize_driver_logging="true" --isolation="posix/cpu,posix/mem"
--launcher="posix" --launcher_dir="/mesos/mesos-1.5.0/_build/src" --logbufsecs="0" --logging_level="INFO"
--max_completed_executors_per_framework="150" --oversubscribed_resources_interval="15secs"
--perf_duration="10secs" --perf_interval="1mins" --port="5051" --qos_correction_interval_min="0ns"
--quiet="false" --recover="reconnect" --recovery_timeout="15mins" --registration_backoff_factor="10ms"
--resources="cpus:2;gpus:0;mem:1024;disk:1024;ports:[31000-32000]" --revocable_cpu_low_priority="true"
--runtime_dir="/tmp/Endpoint_SlaveEndpointTest_NoAuthorizer_0_CDxC3h" --sandbox_directory="/mnt/mesos/sandbox"
--strict="true" --switch_user="true" --systemd_enable_support="true" --systemd_runtime_directory="/run/systemd/system"
--version="false" --work_dir="/tmp/Endpoint_SlaveEndpointTest_NoAuthorizer_0_ubWdbW" --zk_session_timeout="10secs"
I0929 15:23:39.344779  5799 credentials.hpp:86] Loading credential for authentication from
'/tmp/Endpoint_SlaveEndpointTest_NoAuthorizer_0_CDxC3h/credential'
I0929 15:23:39.345046  5799 slave.cpp:287] Agent using credential for: test-principal
I0929 15:23:39.345083  5799 credentials.hpp:37] Loading credentials for authentication from
'/tmp/Endpoint_SlaveEndpointTest_NoAuthorizer_0_CDxC3h/http_credentials'
I0929 15:23:39.345468  5799 http.cpp:1045] Creating default 'basic' HTTP authenticator for
realm 'mesos-agent-readonly'
I0929 15:23:39.345724  5799 http.cpp:1045] Creating default 'basic' HTTP authenticator for
realm 'mesos-agent-readwrite'
I0929 15:23:39.347846  5799 slave.cpp:585] Agent resources: [{"name":"cpus","scalar":{"value":2.0},"type":"SCALAR"},{"name":"mem","scalar":{"value":1024.0},"type":"SCALAR"},{"name":"disk","scalar":{"value":1024.0},"type":"SCALAR"},{"name":"ports","ranges":{"range":[{"begin":31000,"end":32000}]},"type":"RANGES"}]
I0929 15:23:39.348243  5799 slave.cpp:593] Agent attributes: [  ]
I0929 15:23:39.348269  5799 slave.cpp:602] Agent hostname: 6210057c624d
I0929 15:23:39.348471  5815 status_update_manager.cpp:177] Pausing sending status updates
I0929 15:23:39.350240  5813 state.cpp:64] Recovering state from '/tmp/Endpoint_SlaveEndpointTest_NoAuthorizer_0_ubWdbW/meta'
I0929 15:23:39.350538  5794 status_update_manager.cpp:203] Recovering status update manager
I0929 15:23:39.350777  5794 containerizer.cpp:648] Recovering containerizer
I0929 15:23:39.352352  5811 provisioner.cpp:416] Provisioner recovery complete
I0929 15:23:39.352840  5808 slave.cpp:6322] Finished recovery
I0929 15:23:39.353262  5808 slave.cpp:6504] Querying resource estimator for oversubscribable
resources
I0929 15:23:39.353515  5807 slave.cpp:6518] Received oversubscribable resources {} from the
resource estimator
I0929 15:23:39.355765  5794 process.cpp:3929] Handling HTTP event for process 'slave(815)'
with path: '/slave(815)/monitor/statistics'
I0929 15:23:39.357297  5803 http.cpp:1185] HTTP GET for /slave(815)/monitor/statistics from
172.17.0.2:56244
I0929 15:23:39.357369  5803 http.cpp:976] Authorizing principal 'test-principal' to GET the
'/monitor/statistics' endpoint
I0929 15:23:39.360986  5774 slave.cpp:869] Agent terminating
[       OK ] Endpoint/SlaveEndpointTest.NoAuthorizer/0 (38 ms)
[ RUN      ] Endpoint/SlaveEndpointTest.NoAuthorizer/1
I0929 15:23:39.378985  5774 containerizer.cpp:292] Using isolation { environment_secret, posix/cpu,
posix/mem, filesystem/posix, network/cni }
W0929 15:23:39.379873  5774 backend.cpp:76] Failed to create 'aufs' backend: AufsBackend requires
root privileges
W0929 15:23:39.380080  5774 backend.cpp:76] Failed to create 'bind' backend: BindBackend requires
root privileges
I0929 15:23:39.380115  5774 provisioner.cpp:255] Using default backend 'copy'
I0929 15:23:39.383265  5774 cluster.cpp:448] Creating default 'local' authorizer
I0929 15:23:39.385735  5810 slave.cpp:254] Mesos agent started on (816)@172.17.0.2:42399
I0929 15:23:39.385759  5810 slave.cpp:255] Flags at startup: --acls="" --appc_simple_discovery_uri_prefix="http://"
--appc_store_dir="/tmp/Endpoint_SlaveEndpointTest_NoAuthorizer_1_LTHRTH/store/appc" --authenticate_http_readonly="true"
--authenticate_http_readwrite="true" --authenticatee="crammd5" --authentication_backoff_factor="1secs"
--authorizer="local" --cgroups_cpu_enable_pids_and_tids_count="false" --cgroups_enable_cfs="false"
--cgroups_hierarchy="/sys/fs/cgroup" --cgroups_limit_swap="false" --cgroups_root="mesos" --container_disk_watch_interval="15secs"
--containerizers="mesos" --credential="/tmp/Endpoint_SlaveEndpointTest_NoAuthorizer_1_LTHRTH/credential"
--default_role="*" --disallow_sharing_agent_pid_namespace="false" --disk_watch_interval="1mins"
--docker="docker" --docker_kill_orphans="true" --docker_registry="https://registry-1.docker.io"
--docker_remove_delay="6hrs" --docker_socket="/var/run/docker.sock" --docker_stop_timeout="0ns"
--docker_store_dir="/tmp/Endpoint_SlaveEndpointTest_NoAuthorizer_1_LTHRTH/store/docker" --docker_volume_checkpoint_dir="/var/run/mesos/isolators/docker/volume"
--enforce_container_disk_quota="false" --executor_registration_timeout="1mins" --executor_reregistration_timeout="2secs"
--executor_shutdown_grace_period="5secs" --fetcher_cache_dir="/tmp/Endpoint_SlaveEndpointTest_NoAuthorizer_1_LTHRTH/fetch"
--fetcher_cache_size="2GB" --frameworks_home="" --gc_delay="1weeks" --gc_disk_headroom="0.1"
--hadoop_home="" --help="false" --hostname_lookup="true" --http_command_executor="false" --http_credentials="/tmp/Endpoint_SlaveEndpointTest_NoAuthorizer_1_LTHRTH/http_credentials"
--http_heartbeat_interval="30secs" --initialize_driver_logging="true" --isolation="posix/cpu,posix/mem"
--launcher="posix" --launcher_dir="/mesos/mesos-1.5.0/_build/src" --logbufsecs="0" --logging_level="INFO"
--max_completed_executors_per_framework="150" --oversubscribed_resources_interval="15secs"
--perf_duration="10secs" --perf_interval="1mins" --port="5051" --qos_correction_interval_min="0ns"
--quiet="false" --recover="reconnect" --recovery_timeout="15mins" --registration_backoff_factor="10ms"
--resources="cpus:2;gpus:0;mem:1024;disk:1024;ports:[31000-32000]" --revocable_cpu_low_priority="true"
--runtime_dir="/tmp/Endpoint_SlaveEndpointTest_NoAuthorizer_1_LTHRTH" --sandbox_directory="/mnt/mesos/sandbox"
--strict="true" --switch_user="true" --systemd_enable_support="true" --systemd_runtime_directory="/run/systemd/system"
--version="false" --work_dir="/tmp/Endpoint_SlaveEndpointTest_NoAuthorizer_1_DhvoVl" --zk_session_timeout="10secs"
I0929 15:23:39.386286  5810 credentials.hpp:86] Loading credential for authentication from
'/tmp/Endpoint_SlaveEndpointTest_NoAuthorizer_1_LTHRTH/credential'
I0929 15:23:39.386499  5810 slave.cpp:287] Agent using credential for: test-principal
I0929 15:23:39.386534  5810 credentials.hpp:37] Loading credentials for authentication from
'/tmp/Endpoint_SlaveEndpointTest_NoAuthorizer_1_LTHRTH/http_credentials'
I0929 15:23:39.386824  5810 http.cpp:1045] Creating default 'basic' HTTP authenticator for
realm 'mesos-agent-readonly'
I0929 15:23:39.387030  5810 http.cpp:1045] Creating default 'basic' HTTP authenticator for
realm 'mesos-agent-readwrite'
I0929 15:23:39.388403  5810 slave.cpp:585] Agent resources: [{"name":"cpus","scalar":{"value":2.0},"type":"SCALAR"},{"name":"mem","scalar":{"value":1024.0},"type":"SCALAR"},{"name":"disk","scalar":{"value":1024.0},"type":"SCALAR"},{"name":"ports","ranges":{"range":[{"begin":31000,"end":32000}]},"type":"RANGES"}]
I0929 15:23:39.388658  5810 slave.cpp:593] Agent attributes: [  ]
I0929 15:23:39.388674  5810 slave.cpp:602] Agent hostname: 6210057c624d
I0929 15:23:39.388872  5803 status_update_manager.cpp:177] Pausing sending status updates
I0929 15:23:39.390502  5799 state.cpp:64] Recovering state from '/tmp/Endpoint_SlaveEndpointTest_NoAuthorizer_1_DhvoVl/meta'
I0929 15:23:39.390863  5813 status_update_manager.cpp:203] Recovering status update manager
I0929 15:23:39.391144  5813 containerizer.cpp:648] Recovering containerizer
I0929 15:23:39.392868  5793 provisioner.cpp:416] Provisioner recovery complete
I0929 15:23:39.393287  5803 slave.cpp:6322] Finished recovery
I0929 15:23:39.393733  5803 slave.cpp:6504] Querying resource estimator for oversubscribable
resources
I0929 15:23:39.393980  5799 slave.cpp:6518] Received oversubscribable resources {} from the
resource estimator
I0929 15:23:39.396430  5809 process.cpp:3929] Handling HTTP event for process 'slave(816)'
with path: '/slave(816)/monitor/statistics.json'
I0929 15:23:39.397629  5800 http.cpp:1185] HTTP GET for /slave(816)/monitor/statistics.json
from 172.17.0.2:56246
I0929 15:23:39.397716  5800 http.cpp:976] Authorizing principal 'test-principal' to GET the
'/monitor/statistics.json' endpoint
I0929 15:23:39.400848  5802 slave.cpp:869] Agent terminating
[       OK ] Endpoint/SlaveEndpointTest.NoAuthorizer/1 (37 ms)
[ RUN      ] Endpoint/SlaveEndpointTest.NoAuthorizer/2
I0929 15:23:39.421422  5774 containerizer.cpp:292] Using isolation { environment_secret, posix/cpu,
posix/mem, filesystem/posix, network/cni }
W0929 15:23:39.421936  5774 backend.cpp:76] Failed to create 'aufs' backend: AufsBackend requires
root privileges
W0929 15:23:39.422050  5774 backend.cpp:76] Failed to create 'bind' backend: BindBackend requires
root privileges
I0929 15:23:39.422091  5774 provisioner.cpp:255] Using default backend 'copy'
I0929 15:23:39.424000  5774 cluster.cpp:448] Creating default 'local' authorizer
I0929 15:23:39.426128  5797 slave.cpp:254] Mesos agent started on (817)@172.17.0.2:42399
I0929 15:23:39.426156  5797 slave.cpp:255] Flags at startup: --acls="" --appc_simple_discovery_uri_prefix="http://"
--appc_store_dir="/tmp/Endpoint_SlaveEndpointTest_NoAuthorizer_2_reAJ97/store/appc" --authenticate_http_readonly="true"
--authenticate_http_readwrite="true" --authenticatee="crammd5" --authentication_backoff_factor="1secs"
--authorizer="local" --cgroups_cpu_enable_pids_and_tids_count="false" --cgroups_enable_cfs="false"
--cgroups_hierarchy="/sys/fs/cgroup" --cgroups_limit_swap="false" --cgroups_root="mesos" --container_disk_watch_interval="15secs"
--containerizers="mesos" --credential="/tmp/Endpoint_SlaveEndpointTest_NoAuthorizer_2_reAJ97/credential"
--default_role="*" --disallow_sharing_agent_pid_namespace="false" --disk_watch_interval="1mins"
--docker="docker" --docker_kill_orphans="true" --docker_registry="https://registry-1.docker.io"
--docker_remove_delay="6hrs" --docker_socket="/var/run/docker.sock" --docker_stop_timeout="0ns"
--docker_store_dir="/tmp/Endpoint_SlaveEndpointTest_NoAuthorizer_2_reAJ97/store/docker" --docker_volume_checkpoint_dir="/var/run/mesos/isolators/docker/volume"
--enforce_container_disk_quota="false" --executor_registration_timeout="1mins" --executor_reregistration_timeout="2secs"
--executor_shutdown_grace_period="5secs" --fetcher_cache_dir="/tmp/Endpoint_SlaveEndpointTest_NoAuthorizer_2_reAJ97/fetch"
--fetcher_cache_size="2GB" --frameworks_home="" --gc_delay="1weeks" --gc_disk_headroom="0.1"
--hadoop_home="" --help="false" --hostname_lookup="true" --http_command_executor="false" --http_credentials="/tmp/Endpoint_SlaveEndpointTest_NoAuthorizer_2_reAJ97/http_credentials"
--http_heartbeat_interval="30secs" --initialize_driver_logging="true" --isolation="posix/cpu,posix/mem"
--launcher="posix" --launcher_dir="/mesos/mesos-1.5.0/_build/src" --logbufsecs="0" --logging_level="INFO"
--max_completed_executors_per_framework="150" --oversubscribed_resources_interval="15secs"
--perf_duration="10secs" --perf_interval="1mins" --port="5051" --qos_correction_interval_min="0ns"
--quiet="false" --recover="reconnect" --recovery_timeout="15mins" --registration_backoff_factor="10ms"
--resources="cpus:2;gpus:0;mem:1024;disk:1024;ports:[31000-32000]" --revocable_cpu_low_priority="true"
--runtime_dir="/tmp/Endpoint_SlaveEndpointTest_NoAuthorizer_2_reAJ97" --sandbox_directory="/mnt/mesos/sandbox"
--strict="true" --switch_user="true" --systemd_enable_support="true" --systemd_runtime_directory="/run/systemd/system"
--version="false" --work_dir="/tmp/Endpoint_SlaveEndpointTest_NoAuthorizer_2_bqHL4L" --zk_session_timeout="10secs"
I0929 15:23:39.426671  5797 credentials.hpp:86] Loading credential for authentication from
'/tmp/Endpoint_SlaveEndpointTest_NoAuthorizer_2_reAJ97/credential'
I0929 15:23:39.426846  5797 slave.cpp:287] Agent using credential for: test-principal
I0929 15:23:39.426868  5797 credentials.hpp:37] Loading credentials for authentication from
'/tmp/Endpoint_SlaveEndpointTest_NoAuthorizer_2_reAJ97/http_credentials'
I0929 15:23:39.427116  5797 http.cpp:1045] Creating default 'basic' HTTP authenticator for
realm 'mesos-agent-readonly'
I0929 15:23:39.427281  5797 http.cpp:1045] Creating default 'basic' HTTP authenticator for
realm 'mesos-agent-readwrite'
I0929 15:23:39.429452  5797 slave.cpp:585] Agent resources: [{"name":"cpus","scalar":{"value":2.0},"type":"SCALAR"},{"name":"mem","scalar":{"value":1024.0},"type":"SCALAR"},{"name":"disk","scalar":{"value":1024.0},"type":"SCALAR"},{"name":"ports","ranges":{"range":[{"begin":31000,"end":32000}]},"type":"RANGES"}]
I0929 15:23:39.429855  5797 slave.cpp:593] Agent attributes: [  ]
I0929 15:23:39.429886  5797 slave.cpp:602] Agent hostname: 6210057c624d
I0929 15:23:39.430032  5800 status_update_manager.cpp:177] Pausing sending status updates
I0929 15:23:39.431919  5815 state.cpp:64] Recovering state from '/tmp/Endpoint_SlaveEndpointTest_NoAuthorizer_2_bqHL4L/meta'
I0929 15:23:39.432328  5810 status_update_manager.cpp:203] Recovering status update manager
I0929 15:23:39.432570  5808 containerizer.cpp:648] Recovering containerizer
I0929 15:23:39.434056  5802 provisioner.cpp:416] Provisioner recovery complete
I0929 15:23:39.434607  5795 slave.cpp:6322] Finished recovery
I0929 15:23:39.435287  5795 slave.cpp:6504] Querying resource estimator for oversubscribable
resources
I0929 15:23:39.435570  5815 slave.cpp:6518] Received oversubscribable resources {} from the
resource estimator
I0929 15:23:39.438102  5813 process.cpp:3929] Handling HTTP event for process 'slave(817)'
with path: '/slave(817)/containers'
I0929 15:23:39.439699  5801 http.cpp:1185] HTTP GET for /slave(817)/containers from 172.17.0.2:56248
I0929 15:23:39.439774  5801 http.cpp:976] Authorizing principal 'test-principal' to GET the
'/containers' endpoint
I0929 15:23:39.444245  5774 slave.cpp:869] Agent terminating
[       OK ] Endpoint/SlaveEndpointTest.NoAuthorizer/2 (36 ms)
[----------] 9 tests from Endpoint/SlaveEndpointTest (341 ms total)

[----------] 2 tests from ContainerizerType/DefaultContainerDNSFlagTest
[ RUN      ] ContainerizerType/DefaultContainerDNSFlagTest.ValidateFlag/0
[       OK ] ContainerizerType/DefaultContainerDNSFlagTest.ValidateFlag/0 (11 ms)
[ RUN      ] ContainerizerType/DefaultContainerDNSFlagTest.ValidateFlag/1
[       OK ] ContainerizerType/DefaultContainerDNSFlagTest.ValidateFlag/1 (10 ms)
[----------] 2 tests from ContainerizerType/DefaultContainerDNSFlagTest (21 ms total)

[----------] Global test environment tear-down
[==========] 1676 tests from 184 test cases ran. (786513 ms total)
[  PASSED  ] 1674 tests.
[  FAILED  ] 2 tests, listed below:
[  FAILED  ] ExamplesTest.TestFramework
[  FAILED  ] ExamplesTest.DynamicReservationFramework

 2 FAILED TESTS
  YOU HAVE 20 DISABLED TESTS

I0929 15:23:39.536134  5817 process.cpp:1068] Failed to accept socket: future discarded
make[4]: *** [check-local] Error 1
make[4]: Leaving directory `/mesos/mesos-1.5.0/_build/src'
make[3]: *** [check-am] Error 2
make[3]: Leaving directory `/mesos/mesos-1.5.0/_build/src'
make[2]: *** [check] Error 2
make[2]: Leaving directory `/mesos/mesos-1.5.0/_build/src'
make[1]: *** [check-recursive] Error 1
make[1]: Leaving directory `/mesos/mesos-1.5.0/_build'
make: *** [distcheck] Error 1
+ docker rmi mesos-1506694892-3359
Untagged: mesos-1506694892-3359:latest
Deleted: sha256:7fd638d3961f5eb89281fab88a15e7e65ac496656b9bb5be874a84b493b2af60
Deleted: sha256:f18752540c92b35f0c4db6684428ecc7032c7471c554730ebcc7a8b8dcb0c9b3
Deleted: sha256:6a37d35348eb2643a772bc824055fd8798bbc29370f32436acb26ee77f904621
Deleted: sha256:7d7de29f76887b791d9ee25a315ee8acd49ce082879568e385661264883d8dea
Deleted: sha256:0bc08d1b42005404002986407e5980d1f82a7bfd7f25241a6477505f16b3ca4a
Deleted: sha256:3ac6fea5dc816d62e31cacbde538c115c879b49a3e444d2aed00f04ff7607825
Deleted: sha256:2e80dd12732d7e5f54bf0ec23fe29a32badc5272ce633e5e4de91bdfd2753c46
Deleted: sha256:afae2a15393c31df946a15b8bafbc993a32b069f88c877b0781183edce3c3f8a
Deleted: sha256:4bb442eed5aa39a36d084244f5a0904a2dca65abeedeaffaba78e01e36a7b945
Deleted: sha256:c842320e80105108535f8037c3cc06ba2f48a7b9215fa4090b93321140cb78ab
Deleted: sha256:f5699959071c01c67a535f963adba67aee484862ca851a9035991d0326d57869
Deleted: sha256:c8926576f882aeaba39d2bab5f2ec2e8d1d05c8201a4dfd8bda9107c2598db8f
Deleted: sha256:7f6f8adb3ac9614c77ea3dac993850bae9b43754941d6a32a9bd6cffa13b400e
Deleted: sha256:e912721dd444504c3ae51828f77419200233835d92bade63db667ec5c5e53eda
Deleted: sha256:dc248a8888d13f6cad3fa4ab05e451933fb859c4bfd90effd2ca4795d20fa038
Deleted: sha256:f1d8dc7e4dd6282cfb1ac315f9c0e65458a97697ea5cd3fe5e90a982269fe492
Deleted: sha256:c7765855efd2f6225072c09586e953f6f09af69e64ce1452657189e49e3c2c13
Deleted: sha256:c9a213d15e7c9f716d97b1dd556d60754370eb1e28af2f806a97aa440c302fd1
Deleted: sha256:5801d0e78bdcca7e8c0d25ec72399e9be9ac1240c0d95d5848b9e70a48ba3c68
Deleted: sha256:7a8a9b737f45609186faa630279b6fd424ecd64849cc5130eaad593a2868752c
Deleted: sha256:b1a241a364548925d51c6d60484e4b0654bcfad28ad95f0793eb5550336167e5
Deleted: sha256:000ba2e8375b7c7d35e11c5a812057d29039738f18da30ff5bf63a95d9a24d19
Deleted: sha256:86a65401e4db8a760d4d98ec87aa25c44e776b685a51a262b33ef4218bbd7233
Deleted: sha256:80f5de888f77c6fa8376c2d1adec5326068b4e28de3b1bf06fa51e0ab1a91d21
Deleted: sha256:f2f7f32bc7dc959733bb44ce89343176f77cdf9212c9bd420a3ad29e82b812fe
Deleted: sha256:87f0d02d496406b2bff89de2352f9ec2bde782e3ee3de4a9293bc567a927710b
Deleted: sha256:519079c0771a8012bb90794fa044e3e2901f4ddd097461800f1b9b6df147cef1
Deleted: sha256:e8f07e677581ce050873e62fb789cfe567fd78f125b6ab3df45c94b0b81ef09a
Build step 'Execute shell' marked build as failure

Mime
View raw message