mesos-builds mailing list archives

Site index · List index
Message view « Date » · « Thread »
Top « Date » · « Thread »
From Apache Jenkins Server <jenk...@builds.apache.org>
Subject Build failed in Jenkins: Mesos-Buildbot » cmake,gcc,--verbose --enable-libevent --enable-ssl,GLOG_v=1 MESOS_VERBOSE=1,ubuntu:14.04,(ubuntu)&&(!ubuntu-us1)&&(!ubuntu-eu2) #4202
Date Wed, 06 Sep 2017 18:26:03 GMT
See <https://builds.apache.org/job/Mesos-Buildbot/BUILDTOOL=cmake,COMPILER=gcc,CONFIGURATION=--verbose%20--enable-libevent%20--enable-ssl,ENVIRONMENT=GLOG_v=1%20MESOS_VERBOSE=1,OS=ubuntu%3A14.04,label_exp=(ubuntu)&&(!ubuntu-us1)&&(!ubuntu-eu2)/4202/display/redirect?page=changes>

Changes:

[josephwu] Updated CMake version in docker build helper.

------------------------------------------
[...truncated 1.06 MB...]
[ 81%] Building CXX object src/tests/CMakeFiles/test-helper.dir/test_helper_main.cpp.o
cd /mesos/build/src/tests && /usr/bin/g++  -DBUILD_DIR=\"/mesos/build\" -DBUILD_FLAGS=\"\" -DBUILD_JAVA_JVM_LIBRARY=\"\" -DHAS_AUTHENTICATION=1 -DHAVE_LIBZ -DLIBDIR=\"/usr/local/libmesos\" -DPICOJSON_USE_INT64 -DPKGDATADIR=\"/usr/local/share/mesos\" -DPKGLIBEXECDIR=\"/usr/local/libexec/mesos\" -DPKGMODULEDIR=\"\" -DSBINDIR=\"\" -DSOURCE_DIR=\"/mesos\" -DTESTLIBEXECDIR=\"\" -DUSE_CMAKE_BUILD_CONFIG -DUSE_SSL_SOCKET=1 -DUSE_STATIC_LIB -DVERSION=\"1.5.0\" -DZOOKEEPER_VERSION=\"3.4.8\" -D__STDC_FORMAT_MACROS -I/mesos/include -I/mesos/build/include -I/mesos/build/include/mesos -I/mesos/build/src -I/mesos/src -I/mesos/3rdparty/libprocess/src/../include -I/mesos/3rdparty/stout/include -isystem /usr/include/apr-1.0 -isystem /mesos/build/3rdparty/boost-1.53.0/src/boost-1.53.0 -isystem /mesos/build/3rdparty/elfio-3.2/src/elfio-3.2 -isystem /mesos/build/3rdparty/glog-0.3.3/src/glog-0.3.3-build/include -isystem /mesos/build/3rdparty/picojson-1.3.0/src/picojson-1.3.0 -isystem /mesos/build/3rdparty/protobuf-3.3.0/src/protobuf-3.3.0/src -isystem /usr/include/subversion-1 -isystem /mesos/build/3rdparty/http_parser-2.6.2/src/http_parser-2.6.2 -isystem /mesos/build/3rdparty/zookeeper-3.4.8/src/zookeeper-3.4.8/src/c/include -isystem /mesos/build/3rdparty/zookeeper-3.4.8/src/zookeeper-3.4.8/src/c/generated -isystem /mesos/build/3rdparty/nvml-352.79/src/nvml-352.79 -isystem /mesos/build/3rdparty/leveldb-1.19/src/leveldb-1.19/include -isystem /mesos/build/3rdparty/googletest-1.8.0/src/googletest-1.8.0/googlemock/include -isystem /mesos/build/3rdparty/googletest-1.8.0/src/googletest-1.8.0/googletest/include  -std=c++11 -Wformat-security -fstack-protector -fPIE   -o CMakeFiles/test-helper.dir/resources_utils.cpp.o -c /mesos/src/tests/resources_utils.cpp
cd /mesos/build/src/tests && /usr/bin/g++  -DBUILD_DIR=\"/mesos/build\" -DBUILD_FLAGS=\"\" -DBUILD_JAVA_JVM_LIBRARY=\"\" -DHAS_AUTHENTICATION=1 -DHAVE_LIBZ -DLIBDIR=\"/usr/local/libmesos\" -DPICOJSON_USE_INT64 -DPKGDATADIR=\"/usr/local/share/mesos\" -DPKGLIBEXECDIR=\"/usr/local/libexec/mesos\" -DPKGMODULEDIR=\"\" -DSBINDIR=\"\" -DSOURCE_DIR=\"/mesos\" -DTESTLIBEXECDIR=\"\" -DUSE_CMAKE_BUILD_CONFIG -DUSE_SSL_SOCKET=1 -DUSE_STATIC_LIB -DVERSION=\"1.5.0\" -DZOOKEEPER_VERSION=\"3.4.8\" -D__STDC_FORMAT_MACROS -I/mesos/include -I/mesos/build/include -I/mesos/build/include/mesos -I/mesos/build/src -I/mesos/src -I/mesos/3rdparty/libprocess/src/../include -I/mesos/3rdparty/stout/include -isystem /usr/include/apr-1.0 -isystem /mesos/build/3rdparty/boost-1.53.0/src/boost-1.53.0 -isystem /mesos/build/3rdparty/elfio-3.2/src/elfio-3.2 -isystem /mesos/build/3rdparty/glog-0.3.3/src/glog-0.3.3-build/include -isystem /mesos/build/3rdparty/picojson-1.3.0/src/picojson-1.3.0 -isystem /mesos/build/3rdparty/protobuf-3.3.0/src/protobuf-3.3.0/src -isystem /usr/include/subversion-1 -isystem /mesos/build/3rdparty/http_parser-2.6.2/src/http_parser-2.6.2 -isystem /mesos/build/3rdparty/zookeeper-3.4.8/src/zookeeper-3.4.8/src/c/include -isystem /mesos/build/3rdparty/zookeeper-3.4.8/src/zookeeper-3.4.8/src/c/generated -isystem /mesos/build/3rdparty/nvml-352.79/src/nvml-352.79 -isystem /mesos/build/3rdparty/leveldb-1.19/src/leveldb-1.19/include -isystem /mesos/build/3rdparty/googletest-1.8.0/src/googletest-1.8.0/googlemock/include -isystem /mesos/build/3rdparty/googletest-1.8.0/src/googletest-1.8.0/googletest/include  -std=c++11 -Wformat-security -fstack-protector -fPIE   -o CMakeFiles/test-helper.dir/test_helper_main.cpp.o -c /mesos/src/tests/test_helper_main.cpp
make[3]: Leaving directory `/mesos/build'
[ 81%] Built target mesos-cni-port-mapper
[ 81%] Building CXX object src/tests/CMakeFiles/test-helper.dir/utils.cpp.o
cd /mesos/build/src/tests && /usr/bin/g++  -DBUILD_DIR=\"/mesos/build\" -DBUILD_FLAGS=\"\" -DBUILD_JAVA_JVM_LIBRARY=\"\" -DHAS_AUTHENTICATION=1 -DHAVE_LIBZ -DLIBDIR=\"/usr/local/libmesos\" -DPICOJSON_USE_INT64 -DPKGDATADIR=\"/usr/local/share/mesos\" -DPKGLIBEXECDIR=\"/usr/local/libexec/mesos\" -DPKGMODULEDIR=\"\" -DSBINDIR=\"\" -DSOURCE_DIR=\"/mesos\" -DTESTLIBEXECDIR=\"\" -DUSE_CMAKE_BUILD_CONFIG -DUSE_SSL_SOCKET=1 -DUSE_STATIC_LIB -DVERSION=\"1.5.0\" -DZOOKEEPER_VERSION=\"3.4.8\" -D__STDC_FORMAT_MACROS -I/mesos/include -I/mesos/build/include -I/mesos/build/include/mesos -I/mesos/build/src -I/mesos/src -I/mesos/3rdparty/libprocess/src/../include -I/mesos/3rdparty/stout/include -isystem /usr/include/apr-1.0 -isystem /mesos/build/3rdparty/boost-1.53.0/src/boost-1.53.0 -isystem /mesos/build/3rdparty/elfio-3.2/src/elfio-3.2 -isystem /mesos/build/3rdparty/glog-0.3.3/src/glog-0.3.3-build/include -isystem /mesos/build/3rdparty/picojson-1.3.0/src/picojson-1.3.0 -isystem /mesos/build/3rdparty/protobuf-3.3.0/src/protobuf-3.3.0/src -isystem /usr/include/subversion-1 -isystem /mesos/build/3rdparty/http_parser-2.6.2/src/http_parser-2.6.2 -isystem /mesos/build/3rdparty/zookeeper-3.4.8/src/zookeeper-3.4.8/src/c/include -isystem /mesos/build/3rdparty/zookeeper-3.4.8/src/zookeeper-3.4.8/src/c/generated -isystem /mesos/build/3rdparty/nvml-352.79/src/nvml-352.79 -isystem /mesos/build/3rdparty/leveldb-1.19/src/leveldb-1.19/include -isystem /mesos/build/3rdparty/googletest-1.8.0/src/googletest-1.8.0/googlemock/include -isystem /mesos/build/3rdparty/googletest-1.8.0/src/googletest-1.8.0/googletest/include  -std=c++11 -Wformat-security -fstack-protector -fPIE   -o CMakeFiles/test-helper.dir/utils.cpp.o -c /mesos/src/tests/utils.cpp
[ 81%] Building CXX object src/tests/CMakeFiles/test-helper.dir/kill_policy_test_helper.cpp.o
cd /mesos/build/src/tests && /usr/bin/g++  -DBUILD_DIR=\"/mesos/build\" -DBUILD_FLAGS=\"\" -DBUILD_JAVA_JVM_LIBRARY=\"\" -DHAS_AUTHENTICATION=1 -DHAVE_LIBZ -DLIBDIR=\"/usr/local/libmesos\" -DPICOJSON_USE_INT64 -DPKGDATADIR=\"/usr/local/share/mesos\" -DPKGLIBEXECDIR=\"/usr/local/libexec/mesos\" -DPKGMODULEDIR=\"\" -DSBINDIR=\"\" -DSOURCE_DIR=\"/mesos\" -DTESTLIBEXECDIR=\"\" -DUSE_CMAKE_BUILD_CONFIG -DUSE_SSL_SOCKET=1 -DUSE_STATIC_LIB -DVERSION=\"1.5.0\" -DZOOKEEPER_VERSION=\"3.4.8\" -D__STDC_FORMAT_MACROS -I/mesos/include -I/mesos/build/include -I/mesos/build/include/mesos -I/mesos/build/src -I/mesos/src -I/mesos/3rdparty/libprocess/src/../include -I/mesos/3rdparty/stout/include -isystem /usr/include/apr-1.0 -isystem /mesos/build/3rdparty/boost-1.53.0/src/boost-1.53.0 -isystem /mesos/build/3rdparty/elfio-3.2/src/elfio-3.2 -isystem /mesos/build/3rdparty/glog-0.3.3/src/glog-0.3.3-build/include -isystem /mesos/build/3rdparty/picojson-1.3.0/src/picojson-1.3.0 -isystem /mesos/build/3rdparty/protobuf-3.3.0/src/protobuf-3.3.0/src -isystem /usr/include/subversion-1 -isystem /mesos/build/3rdparty/http_parser-2.6.2/src/http_parser-2.6.2 -isystem /mesos/build/3rdparty/zookeeper-3.4.8/src/zookeeper-3.4.8/src/c/include -isystem /mesos/build/3rdparty/zookeeper-3.4.8/src/zookeeper-3.4.8/src/c/generated -isystem /mesos/build/3rdparty/nvml-352.79/src/nvml-352.79 -isystem /mesos/build/3rdparty/leveldb-1.19/src/leveldb-1.19/include -isystem /mesos/build/3rdparty/googletest-1.8.0/src/googletest-1.8.0/googlemock/include -isystem /mesos/build/3rdparty/googletest-1.8.0/src/googletest-1.8.0/googletest/include  -std=c++11 -Wformat-security -fstack-protector -fPIE   -o CMakeFiles/test-helper.dir/kill_policy_test_helper.cpp.o -c /mesos/src/tests/kill_policy_test_helper.cpp
[ 81%] Building CXX object src/tests/CMakeFiles/test-helper.dir/containerizer/memory_test_helper.cpp.o
cd /mesos/build/src/tests && /usr/bin/g++  -DBUILD_DIR=\"/mesos/build\" -DBUILD_FLAGS=\"\" -DBUILD_JAVA_JVM_LIBRARY=\"\" -DHAS_AUTHENTICATION=1 -DHAVE_LIBZ -DLIBDIR=\"/usr/local/libmesos\" -DPICOJSON_USE_INT64 -DPKGDATADIR=\"/usr/local/share/mesos\" -DPKGLIBEXECDIR=\"/usr/local/libexec/mesos\" -DPKGMODULEDIR=\"\" -DSBINDIR=\"\" -DSOURCE_DIR=\"/mesos\" -DTESTLIBEXECDIR=\"\" -DUSE_CMAKE_BUILD_CONFIG -DUSE_SSL_SOCKET=1 -DUSE_STATIC_LIB -DVERSION=\"1.5.0\" -DZOOKEEPER_VERSION=\"3.4.8\" -D__STDC_FORMAT_MACROS -I/mesos/include -I/mesos/build/include -I/mesos/build/include/mesos -I/mesos/build/src -I/mesos/src -I/mesos/3rdparty/libprocess/src/../include -I/mesos/3rdparty/stout/include -isystem /usr/include/apr-1.0 -isystem /mesos/build/3rdparty/boost-1.53.0/src/boost-1.53.0 -isystem /mesos/build/3rdparty/elfio-3.2/src/elfio-3.2 -isystem /mesos/build/3rdparty/glog-0.3.3/src/glog-0.3.3-build/include -isystem /mesos/build/3rdparty/picojson-1.3.0/src/picojson-1.3.0 -isystem /mesos/build/3rdparty/protobuf-3.3.0/src/protobuf-3.3.0/src -isystem /usr/include/subversion-1 -isystem /mesos/build/3rdparty/http_parser-2.6.2/src/http_parser-2.6.2 -isystem /mesos/build/3rdparty/zookeeper-3.4.8/src/zookeeper-3.4.8/src/c/include -isystem /mesos/build/3rdparty/zookeeper-3.4.8/src/zookeeper-3.4.8/src/c/generated -isystem /mesos/build/3rdparty/nvml-352.79/src/nvml-352.79 -isystem /mesos/build/3rdparty/leveldb-1.19/src/leveldb-1.19/include -isystem /mesos/build/3rdparty/googletest-1.8.0/src/googletest-1.8.0/googlemock/include -isystem /mesos/build/3rdparty/googletest-1.8.0/src/googletest-1.8.0/googletest/include  -std=c++11 -Wformat-security -fstack-protector -fPIE   -o CMakeFiles/test-helper.dir/containerizer/memory_test_helper.cpp.o -c /mesos/src/tests/containerizer/memory_test_helper.cpp
[ 81%] Building CXX object src/tests/CMakeFiles/test-helper.dir/containerizer/capabilities_test_helper.cpp.o
cd /mesos/build/src/tests && /usr/bin/g++  -DBUILD_DIR=\"/mesos/build\" -DBUILD_FLAGS=\"\" -DBUILD_JAVA_JVM_LIBRARY=\"\" -DHAS_AUTHENTICATION=1 -DHAVE_LIBZ -DLIBDIR=\"/usr/local/libmesos\" -DPICOJSON_USE_INT64 -DPKGDATADIR=\"/usr/local/share/mesos\" -DPKGLIBEXECDIR=\"/usr/local/libexec/mesos\" -DPKGMODULEDIR=\"\" -DSBINDIR=\"\" -DSOURCE_DIR=\"/mesos\" -DTESTLIBEXECDIR=\"\" -DUSE_CMAKE_BUILD_CONFIG -DUSE_SSL_SOCKET=1 -DUSE_STATIC_LIB -DVERSION=\"1.5.0\" -DZOOKEEPER_VERSION=\"3.4.8\" -D__STDC_FORMAT_MACROS -I/mesos/include -I/mesos/build/include -I/mesos/build/include/mesos -I/mesos/build/src -I/mesos/src -I/mesos/3rdparty/libprocess/src/../include -I/mesos/3rdparty/stout/include -isystem /usr/include/apr-1.0 -isystem /mesos/build/3rdparty/boost-1.53.0/src/boost-1.53.0 -isystem /mesos/build/3rdparty/elfio-3.2/src/elfio-3.2 -isystem /mesos/build/3rdparty/glog-0.3.3/src/glog-0.3.3-build/include -isystem /mesos/build/3rdparty/picojson-1.3.0/src/picojson-1.3.0 -isystem /mesos/build/3rdparty/protobuf-3.3.0/src/protobuf-3.3.0/src -isystem /usr/include/subversion-1 -isystem /mesos/build/3rdparty/http_parser-2.6.2/src/http_parser-2.6.2 -isystem /mesos/build/3rdparty/zookeeper-3.4.8/src/zookeeper-3.4.8/src/c/include -isystem /mesos/build/3rdparty/zookeeper-3.4.8/src/zookeeper-3.4.8/src/c/generated -isystem /mesos/build/3rdparty/nvml-352.79/src/nvml-352.79 -isystem /mesos/build/3rdparty/leveldb-1.19/src/leveldb-1.19/include -isystem /mesos/build/3rdparty/googletest-1.8.0/src/googletest-1.8.0/googlemock/include -isystem /mesos/build/3rdparty/googletest-1.8.0/src/googletest-1.8.0/googletest/include  -std=c++11 -Wformat-security -fstack-protector -fPIE   -o CMakeFiles/test-helper.dir/containerizer/capabilities_test_helper.cpp.o -c /mesos/src/tests/containerizer/capabilities_test_helper.cpp
[ 81%] Building CXX object src/tests/CMakeFiles/test-helper.dir/containerizer/setns_test_helper.cpp.o
cd /mesos/build/src/tests && /usr/bin/g++  -DBUILD_DIR=\"/mesos/build\" -DBUILD_FLAGS=\"\" -DBUILD_JAVA_JVM_LIBRARY=\"\" -DHAS_AUTHENTICATION=1 -DHAVE_LIBZ -DLIBDIR=\"/usr/local/libmesos\" -DPICOJSON_USE_INT64 -DPKGDATADIR=\"/usr/local/share/mesos\" -DPKGLIBEXECDIR=\"/usr/local/libexec/mesos\" -DPKGMODULEDIR=\"\" -DSBINDIR=\"\" -DSOURCE_DIR=\"/mesos\" -DTESTLIBEXECDIR=\"\" -DUSE_CMAKE_BUILD_CONFIG -DUSE_SSL_SOCKET=1 -DUSE_STATIC_LIB -DVERSION=\"1.5.0\" -DZOOKEEPER_VERSION=\"3.4.8\" -D__STDC_FORMAT_MACROS -I/mesos/include -I/mesos/build/include -I/mesos/build/include/mesos -I/mesos/build/src -I/mesos/src -I/mesos/3rdparty/libprocess/src/../include -I/mesos/3rdparty/stout/include -isystem /usr/include/apr-1.0 -isystem /mesos/build/3rdparty/boost-1.53.0/src/boost-1.53.0 -isystem /mesos/build/3rdparty/elfio-3.2/src/elfio-3.2 -isystem /mesos/build/3rdparty/glog-0.3.3/src/glog-0.3.3-build/include -isystem /mesos/build/3rdparty/picojson-1.3.0/src/picojson-1.3.0 -isystem /mesos/build/3rdparty/protobuf-3.3.0/src/protobuf-3.3.0/src -isystem /usr/include/subversion-1 -isystem /mesos/build/3rdparty/http_parser-2.6.2/src/http_parser-2.6.2 -isystem /mesos/build/3rdparty/zookeeper-3.4.8/src/zookeeper-3.4.8/src/c/include -isystem /mesos/build/3rdparty/zookeeper-3.4.8/src/zookeeper-3.4.8/src/c/generated -isystem /mesos/build/3rdparty/nvml-352.79/src/nvml-352.79 -isystem /mesos/build/3rdparty/leveldb-1.19/src/leveldb-1.19/include -isystem /mesos/build/3rdparty/googletest-1.8.0/src/googletest-1.8.0/googlemock/include -isystem /mesos/build/3rdparty/googletest-1.8.0/src/googletest-1.8.0/googletest/include  -std=c++11 -Wformat-security -fstack-protector -fPIE   -o CMakeFiles/test-helper.dir/containerizer/setns_test_helper.cpp.o -c /mesos/src/tests/containerizer/setns_test_helper.cpp
[ 81%] Linking CXX executable ../test-helper
cd /mesos/build/src/tests && /usr/local/bin/cmake -E cmake_link_script CMakeFiles/test-helper.dir/link.txt --verbose=1
/usr/bin/g++   -std=c++11 -Wformat-security -fstack-protector   CMakeFiles/test-helper.dir/active_user_test_helper.cpp.o CMakeFiles/test-helper.dir/flags.cpp.o CMakeFiles/test-helper.dir/http_server_test_helper.cpp.o CMakeFiles/test-helper.dir/resources_utils.cpp.o CMakeFiles/test-helper.dir/test_helper_main.cpp.o CMakeFiles/test-helper.dir/utils.cpp.o CMakeFiles/test-helper.dir/kill_policy_test_helper.cpp.o CMakeFiles/test-helper.dir/containerizer/memory_test_helper.cpp.o CMakeFiles/test-helper.dir/containerizer/capabilities_test_helper.cpp.o CMakeFiles/test-helper.dir/containerizer/setns_test_helper.cpp.o  -o ../test-helper -Wl,-rpath,/mesos/build/src/.libs:/mesos/build/3rdparty/libprocess/src:/mesos/build/3rdparty/glog-0.3.3/src/glog-0.3.3-build/lib:/mesos/build/3rdparty/libevent-2.1.5-beta/src/libevent-2.1.5-beta-build/lib:/mesos/build/src:/mesos/build/3rdparty/protobuf-3.3.0/src/protobuf-3.3.0-build ../.libs/libmesos.so.1.5.0 ../../3rdparty/libprocess/src/libprocess.so /usr/lib/x86_64-linux-gnu/libapr-1.so /usr/lib/x86_64-linux-gnu/libcurl.so ../../3rdparty/glog-0.3.3/src/glog-0.3.3-build/lib/libglog.so -lpthread /usr/lib/x86_64-linux-gnu/libz.so -lrt -ldl /usr/lib/x86_64-linux-gnu/libsvn_delta-1.so /usr/lib/x86_64-linux-gnu/libsvn_diff-1.so /usr/lib/x86_64-linux-gnu/libsvn_subr-1.so ../../3rdparty/http_parser-2.6.2/src/http_parser-2.6.2-build/libhttp_parser.a /usr/lib/x86_64-linux-gnu/libssl.so /usr/lib/x86_64-linux-gnu/libcrypto.so ../../3rdparty/zookeeper-3.4.8/src/zookeeper-3.4.8-build/libzookeeper.a ../../3rdparty/zookeeper-3.4.8/src/zookeeper-3.4.8-build/libhashtable.a ../libmesos-protobufs.so ../../3rdparty/protobuf-3.3.0/src/protobuf-3.3.0-build/libprotobuf.so ../../3rdparty/leveldb-1.19/src/leveldb-1.19/out-static/libleveldb.a -lsasl2 ../../3rdparty/googletest-1.8.0/src/googletest-1.8.0-build/googlemock/libgmock.a ../../3rdparty/googletest-1.8.0/src/googletest-1.8.0-build/googlemock/gtest/libgtest.a ../.libs/libload_qos_controller.so ../.libs/libfixed_resource_estimator.so ../.libs/liblogrotate_container_logger.so -Wl,-rpath-link,/mesos/build/3rdparty/libevent-2.1.5-beta/src/libevent-2.1.5-beta-build/lib 
make[3]: Leaving directory `/mesos/build'
[ 81%] Built target test-helper
make -f src/tests/CMakeFiles/mesos-tests.dir/build.make src/tests/CMakeFiles/mesos-tests.dir/depend
make[3]: Entering directory `/mesos/build'
cd /mesos/build && /usr/local/bin/cmake -E cmake_depends "Unix Makefiles" /mesos /mesos/src/tests /mesos/build /mesos/build/src/tests /mesos/build/src/tests/CMakeFiles/mesos-tests.dir/DependInfo.cmake --color=
Scanning dependencies of target mesos-tests
make[3]: Leaving directory `/mesos/build'
make -f src/tests/CMakeFiles/mesos-tests.dir/build.make src/tests/CMakeFiles/mesos-tests.dir/build
make[3]: Entering directory `/mesos/build'
[ 81%] Building CXX object src/tests/CMakeFiles/mesos-tests.dir/active_user_test_helper.cpp.o
cd /mesos/build/src/tests && /usr/bin/g++  -DBUILD_DIR=\"/mesos/build\" -DBUILD_FLAGS=\"\" -DBUILD_JAVA_JVM_LIBRARY=\"\" -DHAS_AUTHENTICATION=1 -DHAVE_LIBZ -DLIBDIR=\"/usr/local/libmesos\" -DPICOJSON_USE_INT64 -DPKGDATADIR=\"/usr/local/share/mesos\" -DPKGLIBEXECDIR=\"/usr/local/libexec/mesos\" -DPKGMODULEDIR=\"\" -DSBINDIR=\"\" -DSOURCE_DIR=\"/mesos\" -DTESTLIBEXECDIR=\"\" -DUSE_CMAKE_BUILD_CONFIG -DUSE_SSL_SOCKET=1 -DUSE_STATIC_LIB -DVERSION=\"1.5.0\" -DZOOKEEPER_VERSION=\"3.4.8\" -D__STDC_FORMAT_MACROS -I/mesos/include -I/mesos/build/include -I/mesos/build/include/mesos -I/mesos/build/src -I/mesos/src -I/mesos/3rdparty/libprocess/src/../include -I/mesos/3rdparty/stout/include -isystem /usr/include/apr-1.0 -isystem /mesos/build/3rdparty/boost-1.53.0/src/boost-1.53.0 -isystem /mesos/build/3rdparty/elfio-3.2/src/elfio-3.2 -isystem /mesos/build/3rdparty/glog-0.3.3/src/glog-0.3.3-build/include -isystem /mesos/build/3rdparty/picojson-1.3.0/src/picojson-1.3.0 -isystem /mesos/build/3rdparty/protobuf-3.3.0/src/protobuf-3.3.0/src -isystem /usr/include/subversion-1 -isystem /mesos/build/3rdparty/http_parser-2.6.2/src/http_parser-2.6.2 -isystem /mesos/build/3rdparty/zookeeper-3.4.8/src/zookeeper-3.4.8/src/c/include -isystem /mesos/build/3rdparty/zookeeper-3.4.8/src/zookeeper-3.4.8/src/c/generated -isystem /mesos/build/3rdparty/nvml-352.79/src/nvml-352.79 -isystem /mesos/build/3rdparty/leveldb-1.19/src/leveldb-1.19/include -isystem /mesos/build/3rdparty/googletest-1.8.0/src/googletest-1.8.0/googlemock/include -isystem /mesos/build/3rdparty/googletest-1.8.0/src/googletest-1.8.0/googletest/include  -std=c++11 -Wformat-security -fstack-protector -fPIE   -o CMakeFiles/mesos-tests.dir/active_user_test_helper.cpp.o -c /mesos/src/tests/active_user_test_helper.cpp
[ 81%] Building CXX object src/tests/CMakeFiles/mesos-tests.dir/cluster.cpp.o
cd /mesos/build/src/tests && /usr/bin/g++  -DBUILD_DIR=\"/mesos/build\" -DBUILD_FLAGS=\"\" -DBUILD_JAVA_JVM_LIBRARY=\"\" -DHAS_AUTHENTICATION=1 -DHAVE_LIBZ -DLIBDIR=\"/usr/local/libmesos\" -DPICOJSON_USE_INT64 -DPKGDATADIR=\"/usr/local/share/mesos\" -DPKGLIBEXECDIR=\"/usr/local/libexec/mesos\" -DPKGMODULEDIR=\"\" -DSBINDIR=\"\" -DSOURCE_DIR=\"/mesos\" -DTESTLIBEXECDIR=\"\" -DUSE_CMAKE_BUILD_CONFIG -DUSE_SSL_SOCKET=1 -DUSE_STATIC_LIB -DVERSION=\"1.5.0\" -DZOOKEEPER_VERSION=\"3.4.8\" -D__STDC_FORMAT_MACROS -I/mesos/include -I/mesos/build/include -I/mesos/build/include/mesos -I/mesos/build/src -I/mesos/src -I/mesos/3rdparty/libprocess/src/../include -I/mesos/3rdparty/stout/include -isystem /usr/include/apr-1.0 -isystem /mesos/build/3rdparty/boost-1.53.0/src/boost-1.53.0 -isystem /mesos/build/3rdparty/elfio-3.2/src/elfio-3.2 -isystem /mesos/build/3rdparty/glog-0.3.3/src/glog-0.3.3-build/include -isystem /mesos/build/3rdparty/picojson-1.3.0/src/picojson-1.3.0 -isystem /mesos/build/3rdparty/protobuf-3.3.0/src/protobuf-3.3.0/src -isystem /usr/include/subversion-1 -isystem /mesos/build/3rdparty/http_parser-2.6.2/src/http_parser-2.6.2 -isystem /mesos/build/3rdparty/zookeeper-3.4.8/src/zookeeper-3.4.8/src/c/include -isystem /mesos/build/3rdparty/zookeeper-3.4.8/src/zookeeper-3.4.8/src/c/generated -isystem /mesos/build/3rdparty/nvml-352.79/src/nvml-352.79 -isystem /mesos/build/3rdparty/leveldb-1.19/src/leveldb-1.19/include -isystem /mesos/build/3rdparty/googletest-1.8.0/src/googletest-1.8.0/googlemock/include -isystem /mesos/build/3rdparty/googletest-1.8.0/src/googletest-1.8.0/googletest/include  -std=c++11 -Wformat-security -fstack-protector -fPIE   -o CMakeFiles/mesos-tests.dir/cluster.cpp.o -c /mesos/src/tests/cluster.cpp
[ 81%] Building CXX object src/tests/CMakeFiles/mesos-tests.dir/containerizer.cpp.o
[ 82%] Building CXX object src/tests/CMakeFiles/mesos-tests.dir/environment.cpp.o
cd /mesos/build/src/tests && /usr/bin/g++  -DBUILD_DIR=\"/mesos/build\" -DBUILD_FLAGS=\"\" -DBUILD_JAVA_JVM_LIBRARY=\"\" -DHAS_AUTHENTICATION=1 -DHAVE_LIBZ -DLIBDIR=\"/usr/local/libmesos\" -DPICOJSON_USE_INT64 -DPKGDATADIR=\"/usr/local/share/mesos\" -DPKGLIBEXECDIR=\"/usr/local/libexec/mesos\" -DPKGMODULEDIR=\"\" -DSBINDIR=\"\" -DSOURCE_DIR=\"/mesos\" -DTESTLIBEXECDIR=\"\" -DUSE_CMAKE_BUILD_CONFIG -DUSE_SSL_SOCKET=1 -DUSE_STATIC_LIB -DVERSION=\"1.5.0\" -DZOOKEEPER_VERSION=\"3.4.8\" -D__STDC_FORMAT_MACROS -I/mesos/include -I/mesos/build/include -I/mesos/build/include/mesos -I/mesos/build/src -I/mesos/src -I/mesos/3rdparty/libprocess/src/../include -I/mesos/3rdparty/stout/include -isystem /usr/include/apr-1.0 -isystem /mesos/build/3rdparty/boost-1.53.0/src/boost-1.53.0 -isystem /mesos/build/3rdparty/elfio-3.2/src/elfio-3.2 -isystem /mesos/build/3rdparty/glog-0.3.3/src/glog-0.3.3-build/include -isystem /mesos/build/3rdparty/picojson-1.3.0/src/picojson-1.3.0 -isystem /mesos/build/3rdparty/protobuf-3.3.0/src/protobuf-3.3.0/src -isystem /usr/include/subversion-1 -isystem /mesos/build/3rdparty/http_parser-2.6.2/src/http_parser-2.6.2 -isystem /mesos/build/3rdparty/zookeeper-3.4.8/src/zookeeper-3.4.8/src/c/include -isystem /mesos/build/3rdparty/zookeeper-3.4.8/src/zookeeper-3.4.8/src/c/generated -isystem /mesos/build/3rdparty/nvml-352.79/src/nvml-352.79 -isystem /mesos/build/3rdparty/leveldb-1.19/src/leveldb-1.19/include -isystem /mesos/build/3rdparty/googletest-1.8.0/src/googletest-1.8.0/googlemock/include -isystem /mesos/build/3rdparty/googletest-1.8.0/src/googletest-1.8.0/googletest/include  -std=c++11 -Wformat-security -fstack-protector -fPIE   -o CMakeFiles/mesos-tests.dir/containerizer.cpp.o -c /mesos/src/tests/containerizer.cpp
cd /mesos/build/src/tests && /usr/bin/g++  -DBUILD_DIR=\"/mesos/build\" -DBUILD_FLAGS=\"\" -DBUILD_JAVA_JVM_LIBRARY=\"\" -DHAS_AUTHENTICATION=1 -DHAVE_LIBZ -DLIBDIR=\"/usr/local/libmesos\" -DPICOJSON_USE_INT64 -DPKGDATADIR=\"/usr/local/share/mesos\" -DPKGLIBEXECDIR=\"/usr/local/libexec/mesos\" -DPKGMODULEDIR=\"\" -DSBINDIR=\"\" -DSOURCE_DIR=\"/mesos\" -DTESTLIBEXECDIR=\"\" -DUSE_CMAKE_BUILD_CONFIG -DUSE_SSL_SOCKET=1 -DUSE_STATIC_LIB -DVERSION=\"1.5.0\" -DZOOKEEPER_VERSION=\"3.4.8\" -D__STDC_FORMAT_MACROS -I/mesos/include -I/mesos/build/include -I/mesos/build/include/mesos -I/mesos/build/src -I/mesos/src -I/mesos/3rdparty/libprocess/src/../include -I/mesos/3rdparty/stout/include -isystem /usr/include/apr-1.0 -isystem /mesos/build/3rdparty/boost-1.53.0/src/boost-1.53.0 -isystem /mesos/build/3rdparty/elfio-3.2/src/elfio-3.2 -isystem /mesos/build/3rdparty/glog-0.3.3/src/glog-0.3.3-build/include -isystem /mesos/build/3rdparty/picojson-1.3.0/src/picojson-1.3.0 -isystem /mesos/build/3rdparty/protobuf-3.3.0/src/protobuf-3.3.0/src -isystem /usr/include/subversion-1 -isystem /mesos/build/3rdparty/http_parser-2.6.2/src/http_parser-2.6.2 -isystem /mesos/build/3rdparty/zookeeper-3.4.8/src/zookeeper-3.4.8/src/c/include -isystem /mesos/build/3rdparty/zookeeper-3.4.8/src/zookeeper-3.4.8/src/c/generated -isystem /mesos/build/3rdparty/nvml-352.79/src/nvml-352.79 -isystem /mesos/build/3rdparty/leveldb-1.19/src/leveldb-1.19/include -isystem /mesos/build/3rdparty/googletest-1.8.0/src/googletest-1.8.0/googlemock/include -isystem /mesos/build/3rdparty/googletest-1.8.0/src/googletest-1.8.0/googletest/include  -std=c++11 -Wformat-security -fstack-protector -fPIE   -o CMakeFiles/mesos-tests.dir/environment.cpp.o -c /mesos/src/tests/environment.cpp
[ 82%] Building CXX object src/tests/CMakeFiles/mesos-tests.dir/flags.cpp.o
cd /mesos/build/src/tests && /usr/bin/g++  -DBUILD_DIR=\"/mesos/build\" -DBUILD_FLAGS=\"\" -DBUILD_JAVA_JVM_LIBRARY=\"\" -DHAS_AUTHENTICATION=1 -DHAVE_LIBZ -DLIBDIR=\"/usr/local/libmesos\" -DPICOJSON_USE_INT64 -DPKGDATADIR=\"/usr/local/share/mesos\" -DPKGLIBEXECDIR=\"/usr/local/libexec/mesos\" -DPKGMODULEDIR=\"\" -DSBINDIR=\"\" -DSOURCE_DIR=\"/mesos\" -DTESTLIBEXECDIR=\"\" -DUSE_CMAKE_BUILD_CONFIG -DUSE_SSL_SOCKET=1 -DUSE_STATIC_LIB -DVERSION=\"1.5.0\" -DZOOKEEPER_VERSION=\"3.4.8\" -D__STDC_FORMAT_MACROS -I/mesos/include -I/mesos/build/include -I/mesos/build/include/mesos -I/mesos/build/src -I/mesos/src -I/mesos/3rdparty/libprocess/src/../include -I/mesos/3rdparty/stout/include -isystem /usr/include/apr-1.0 -isystem /mesos/build/3rdparty/boost-1.53.0/src/boost-1.53.0 -isystem /mesos/build/3rdparty/elfio-3.2/src/elfio-3.2 -isystem /mesos/build/3rdparty/glog-0.3.3/src/glog-0.3.3-build/include -isystem /mesos/build/3rdparty/picojson-1.3.0/src/picojson-1.3.0 -isystem /mesos/build/3rdparty/protobuf-3.3.0/src/protobuf-3.3.0/src -isystem /usr/include/subversion-1 -isystem /mesos/build/3rdparty/http_parser-2.6.2/src/http_parser-2.6.2 -isystem /mesos/build/3rdparty/zookeeper-3.4.8/src/zookeeper-3.4.8/src/c/include -isystem /mesos/build/3rdparty/zookeeper-3.4.8/src/zookeeper-3.4.8/src/c/generated -isystem /mesos/build/3rdparty/nvml-352.79/src/nvml-352.79 -isystem /mesos/build/3rdparty/leveldb-1.19/src/leveldb-1.19/include -isystem /mesos/build/3rdparty/googletest-1.8.0/src/googletest-1.8.0/googlemock/include -isystem /mesos/build/3rdparty/googletest-1.8.0/src/googletest-1.8.0/googletest/include  -std=c++11 -Wformat-security -fstack-protector -fPIE   -o CMakeFiles/mesos-tests.dir/flags.cpp.o -c /mesos/src/tests/flags.cpp
[ 82%] Building CXX object src/tests/CMakeFiles/mesos-tests.dir/http_server_test_helper.cpp.o
cd /mesos/build/src/tests && /usr/bin/g++  -DBUILD_DIR=\"/mesos/build\" -DBUILD_FLAGS=\"\" -DBUILD_JAVA_JVM_LIBRARY=\"\" -DHAS_AUTHENTICATION=1 -DHAVE_LIBZ -DLIBDIR=\"/usr/local/libmesos\" -DPICOJSON_USE_INT64 -DPKGDATADIR=\"/usr/local/share/mesos\" -DPKGLIBEXECDIR=\"/usr/local/libexec/mesos\" -DPKGMODULEDIR=\"\" -DSBINDIR=\"\" -DSOURCE_DIR=\"/mesos\" -DTESTLIBEXECDIR=\"\" -DUSE_CMAKE_BUILD_CONFIG -DUSE_SSL_SOCKET=1 -DUSE_STATIC_LIB -DVERSION=\"1.5.0\" -DZOOKEEPER_VERSION=\"3.4.8\" -D__STDC_FORMAT_MACROS -I/mesos/include -I/mesos/build/include -I/mesos/build/include/mesos -I/mesos/build/src -I/mesos/src -I/mesos/3rdparty/libprocess/src/../include -I/mesos/3rdparty/stout/include -isystem /usr/include/apr-1.0 -isystem /mesos/build/3rdparty/boost-1.53.0/src/boost-1.53.0 -isystem /mesos/build/3rdparty/elfio-3.2/src/elfio-3.2 -isystem /mesos/build/3rdparty/glog-0.3.3/src/glog-0.3.3-build/include -isystem /mesos/build/3rdparty/picojson-1.3.0/src/picojson-1.3.0 -isystem /mesos/build/3rdparty/protobuf-3.3.0/src/protobuf-3.3.0/src -isystem /usr/include/subversion-1 -isystem /mesos/build/3rdparty/http_parser-2.6.2/src/http_parser-2.6.2 -isystem /mesos/build/3rdparty/zookeeper-3.4.8/src/zookeeper-3.4.8/src/c/include -isystem /mesos/build/3rdparty/zookeeper-3.4.8/src/zookeeper-3.4.8/src/c/generated -isystem /mesos/build/3rdparty/nvml-352.79/src/nvml-352.79 -isystem /mesos/build/3rdparty/leveldb-1.19/src/leveldb-1.19/include -isystem /mesos/build/3rdparty/googletest-1.8.0/src/googletest-1.8.0/googlemock/include -isystem /mesos/build/3rdparty/googletest-1.8.0/src/googletest-1.8.0/googletest/include  -std=c++11 -Wformat-security -fstack-protector -fPIE   -o CMakeFiles/mesos-tests.dir/http_server_test_helper.cpp.o -c /mesos/src/tests/http_server_test_helper.cpp
[ 82%] Building CXX object src/tests/CMakeFiles/mesos-tests.dir/main.cpp.o
cd /mesos/build/src/tests && /usr/bin/g++  -DBUILD_DIR=\"/mesos/build\" -DBUILD_FLAGS=\"\" -DBUILD_JAVA_JVM_LIBRARY=\"\" -DHAS_AUTHENTICATION=1 -DHAVE_LIBZ -DLIBDIR=\"/usr/local/libmesos\" -DPICOJSON_USE_INT64 -DPKGDATADIR=\"/usr/local/share/mesos\" -DPKGLIBEXECDIR=\"/usr/local/libexec/mesos\" -DPKGMODULEDIR=\"\" -DSBINDIR=\"\" -DSOURCE_DIR=\"/mesos\" -DTESTLIBEXECDIR=\"\" -DUSE_CMAKE_BUILD_CONFIG -DUSE_SSL_SOCKET=1 -DUSE_STATIC_LIB -DVERSION=\"1.5.0\" -DZOOKEEPER_VERSION=\"3.4.8\" -D__STDC_FORMAT_MACROS -I/mesos/include -I/mesos/build/include -I/mesos/build/include/mesos -I/mesos/build/src -I/mesos/src -I/mesos/3rdparty/libprocess/src/../include -I/mesos/3rdparty/stout/include -isystem /usr/include/apr-1.0 -isystem /mesos/build/3rdparty/boost-1.53.0/src/boost-1.53.0 -isystem /mesos/build/3rdparty/elfio-3.2/src/elfio-3.2 -isystem /mesos/build/3rdparty/glog-0.3.3/src/glog-0.3.3-build/include -isystem /mesos/build/3rdparty/picojson-1.3.0/src/picojson-1.3.0 -isystem /mesos/build/3rdparty/protobuf-3.3.0/src/protobuf-3.3.0/src -isystem /usr/include/subversion-1 -isystem /mesos/build/3rdparty/http_parser-2.6.2/src/http_parser-2.6.2 -isystem /mesos/build/3rdparty/zookeeper-3.4.8/src/zookeeper-3.4.8/src/c/include -isystem /mesos/build/3rdparty/zookeeper-3.4.8/src/zookeeper-3.4.8/src/c/generated -isystem /mesos/build/3rdparty/nvml-352.79/src/nvml-352.79 -isystem /mesos/build/3rdparty/leveldb-1.19/src/leveldb-1.19/include -isystem /mesos/build/3rdparty/googletest-1.8.0/src/googletest-1.8.0/googlemock/include -isystem /mesos/build/3rdparty/googletest-1.8.0/src/googletest-1.8.0/googletest/include  -std=c++11 -Wformat-security -fstack-protector -fPIE   -o CMakeFiles/mesos-tests.dir/main.cpp.o -c /mesos/src/tests/main.cpp
[ 82%] Building CXX object src/tests/CMakeFiles/mesos-tests.dir/mesos.cpp.o
cd /mesos/build/src/tests && /usr/bin/g++  -DBUILD_DIR=\"/mesos/build\" -DBUILD_FLAGS=\"\" -DBUILD_JAVA_JVM_LIBRARY=\"\" -DHAS_AUTHENTICATION=1 -DHAVE_LIBZ -DLIBDIR=\"/usr/local/libmesos\" -DPICOJSON_USE_INT64 -DPKGDATADIR=\"/usr/local/share/mesos\" -DPKGLIBEXECDIR=\"/usr/local/libexec/mesos\" -DPKGMODULEDIR=\"\" -DSBINDIR=\"\" -DSOURCE_DIR=\"/mesos\" -DTESTLIBEXECDIR=\"\" -DUSE_CMAKE_BUILD_CONFIG -DUSE_SSL_SOCKET=1 -DUSE_STATIC_LIB -DVERSION=\"1.5.0\" -DZOOKEEPER_VERSION=\"3.4.8\" -D__STDC_FORMAT_MACROS -I/mesos/include -I/mesos/build/include -I/mesos/build/include/mesos -I/mesos/build/src -I/mesos/src -I/mesos/3rdparty/libprocess/src/../include -I/mesos/3rdparty/stout/include -isystem /usr/include/apr-1.0 -isystem /mesos/build/3rdparty/boost-1.53.0/src/boost-1.53.0 -isystem /mesos/build/3rdparty/elfio-3.2/src/elfio-3.2 -isystem /mesos/build/3rdparty/glog-0.3.3/src/glog-0.3.3-build/include -isystem /mesos/build/3rdparty/picojson-1.3.0/src/picojson-1.3.0 -isystem /mesos/build/3rdparty/protobuf-3.3.0/src/protobuf-3.3.0/src -isystem /usr/include/subversion-1 -isystem /mesos/build/3rdparty/http_parser-2.6.2/src/http_parser-2.6.2 -isystem /mesos/build/3rdparty/zookeeper-3.4.8/src/zookeeper-3.4.8/src/c/include -isystem /mesos/build/3rdparty/zookeeper-3.4.8/src/zookeeper-3.4.8/src/c/generated -isystem /mesos/build/3rdparty/nvml-352.79/src/nvml-352.79 -isystem /mesos/build/3rdparty/leveldb-1.19/src/leveldb-1.19/include -isystem /mesos/build/3rdparty/googletest-1.8.0/src/googletest-1.8.0/googlemock/include -isystem /mesos/build/3rdparty/googletest-1.8.0/src/googletest-1.8.0/googletest/include  -std=c++11 -Wformat-security -fstack-protector -fPIE   -o CMakeFiles/mesos-tests.dir/mesos.cpp.o -c /mesos/src/tests/mesos.cpp
[ 82%] Building CXX object src/tests/CMakeFiles/mesos-tests.dir/mock_docker.cpp.o
cd /mesos/build/src/tests && /usr/bin/g++  -DBUILD_DIR=\"/mesos/build\" -DBUILD_FLAGS=\"\" -DBUILD_JAVA_JVM_LIBRARY=\"\" -DHAS_AUTHENTICATION=1 -DHAVE_LIBZ -DLIBDIR=\"/usr/local/libmesos\" -DPICOJSON_USE_INT64 -DPKGDATADIR=\"/usr/local/share/mesos\" -DPKGLIBEXECDIR=\"/usr/local/libexec/mesos\" -DPKGMODULEDIR=\"\" -DSBINDIR=\"\" -DSOURCE_DIR=\"/mesos\" -DTESTLIBEXECDIR=\"\" -DUSE_CMAKE_BUILD_CONFIG -DUSE_SSL_SOCKET=1 -DUSE_STATIC_LIB -DVERSION=\"1.5.0\" -DZOOKEEPER_VERSION=\"3.4.8\" -D__STDC_FORMAT_MACROS -I/mesos/include -I/mesos/build/include -I/mesos/build/include/mesos -I/mesos/build/src -I/mesos/src -I/mesos/3rdparty/libprocess/src/../include -I/mesos/3rdparty/stout/include -isystem /usr/include/apr-1.0 -isystem /mesos/build/3rdparty/boost-1.53.0/src/boost-1.53.0 -isystem /mesos/build/3rdparty/elfio-3.2/src/elfio-3.2 -isystem /mesos/build/3rdparty/glog-0.3.3/src/glog-0.3.3-build/include -isystem /mesos/build/3rdparty/picojson-1.3.0/src/picojson-1.3.0 -isystem /mesos/build/3rdparty/protobuf-3.3.0/src/protobuf-3.3.0/src -isystem /usr/include/subversion-1 -isystem /mesos/build/3rdparty/http_parser-2.6.2/src/http_parser-2.6.2 -isystem /mesos/build/3rdparty/zookeeper-3.4.8/src/zookeeper-3.4.8/src/c/include -isystem /mesos/build/3rdparty/zookeeper-3.4.8/src/zookeeper-3.4.8/src/c/generated -isystem /mesos/build/3rdparty/nvml-352.79/src/nvml-352.79 -isystem /mesos/build/3rdparty/leveldb-1.19/src/leveldb-1.19/include -isystem /mesos/build/3rdparty/googletest-1.8.0/src/googletest-1.8.0/googlemock/include -isystem /mesos/build/3rdparty/googletest-1.8.0/src/googletest-1.8.0/googletest/include  -std=c++11 -Wformat-security -fstack-protector -fPIE   -o CMakeFiles/mesos-tests.dir/mock_docker.cpp.o -c /mesos/src/tests/mock_docker.cpp
[ 82%] Building CXX object src/tests/CMakeFiles/mesos-tests.dir/mock_fetcher.cpp.o
cd /mesos/build/src/tests && /usr/bin/g++  -DBUILD_DIR=\"/mesos/build\" -DBUILD_FLAGS=\"\" -DBUILD_JAVA_JVM_LIBRARY=\"\" -DHAS_AUTHENTICATION=1 -DHAVE_LIBZ -DLIBDIR=\"/usr/local/libmesos\" -DPICOJSON_USE_INT64 -DPKGDATADIR=\"/usr/local/share/mesos\" -DPKGLIBEXECDIR=\"/usr/local/libexec/mesos\" -DPKGMODULEDIR=\"\" -DSBINDIR=\"\" -DSOURCE_DIR=\"/mesos\" -DTESTLIBEXECDIR=\"\" -DUSE_CMAKE_BUILD_CONFIG -DUSE_SSL_SOCKET=1 -DUSE_STATIC_LIB -DVERSION=\"1.5.0\" -DZOOKEEPER_VERSION=\"3.4.8\" -D__STDC_FORMAT_MACROS -I/mesos/include -I/mesos/build/include -I/mesos/build/include/mesos -I/mesos/build/src -I/mesos/src -I/mesos/3rdparty/libprocess/src/../include -I/mesos/3rdparty/stout/include -isystem /usr/include/apr-1.0 -isystem /mesos/build/3rdparty/boost-1.53.0/src/boost-1.53.0 -isystem /mesos/build/3rdparty/elfio-3.2/src/elfio-3.2 -isystem /mesos/build/3rdparty/glog-0.3.3/src/glog-0.3.3-build/include -isystem /mesos/build/3rdparty/picojson-1.3.0/src/picojson-1.3.0 -isystem /mesos/build/3rdparty/protobuf-3.3.0/src/protobuf-3.3.0/src -isystem /usr/include/subversion-1 -isystem /mesos/build/3rdparty/http_parser-2.6.2/src/http_parser-2.6.2 -isystem /mesos/build/3rdparty/zookeeper-3.4.8/src/zookeeper-3.4.8/src/c/include -isystem /mesos/build/3rdparty/zookeeper-3.4.8/src/zookeeper-3.4.8/src/c/generated -isystem /mesos/build/3rdparty/nvml-352.79/src/nvml-352.79 -isystem /mesos/build/3rdparty/leveldb-1.19/src/leveldb-1.19/include -isystem /mesos/build/3rdparty/googletest-1.8.0/src/googletest-1.8.0/googlemock/include -isystem /mesos/build/3rdparty/googletest-1.8.0/src/googletest-1.8.0/googletest/include  -std=c++11 -Wformat-security -fstack-protector -fPIE   -o CMakeFiles/mesos-tests.dir/mock_fetcher.cpp.o -c /mesos/src/tests/mock_fetcher.cpp
[ 83%] Building CXX object src/tests/CMakeFiles/mesos-tests.dir/mock_registrar.cpp.o
cd /mesos/build/src/tests && /usr/bin/g++  -DBUILD_DIR=\"/mesos/build\" -DBUILD_FLAGS=\"\" -DBUILD_JAVA_JVM_LIBRARY=\"\" -DHAS_AUTHENTICATION=1 -DHAVE_LIBZ -DLIBDIR=\"/usr/local/libmesos\" -DPICOJSON_USE_INT64 -DPKGDATADIR=\"/usr/local/share/mesos\" -DPKGLIBEXECDIR=\"/usr/local/libexec/mesos\" -DPKGMODULEDIR=\"\" -DSBINDIR=\"\" -DSOURCE_DIR=\"/mesos\" -DTESTLIBEXECDIR=\"\" -DUSE_CMAKE_BUILD_CONFIG -DUSE_SSL_SOCKET=1 -DUSE_STATIC_LIB -DVERSION=\"1.5.0\" -DZOOKEEPER_VERSION=\"3.4.8\" -D__STDC_FORMAT_MACROS -I/mesos/include -I/mesos/build/include -I/mesos/build/include/mesos -I/mesos/build/src -I/mesos/src -I/mesos/3rdparty/libprocess/src/../include -I/mesos/3rdparty/stout/include -isystem /usr/include/apr-1.0 -isystem /mesos/build/3rdparty/boost-1.53.0/src/boost-1.53.0 -isystem /mesos/build/3rdparty/elfio-3.2/src/elfio-3.2 -isystem /mesos/build/3rdparty/glog-0.3.3/src/glog-0.3.3-build/include -isystem /mesos/build/3rdparty/picojson-1.3.0/src/picojson-1.3.0 -isystem /mesos/build/3rdparty/protobuf-3.3.0/src/protobuf-3.3.0/src -isystem /usr/include/subversion-1 -isystem /mesos/build/3rdparty/http_parser-2.6.2/src/http_parser-2.6.2 -isystem /mesos/build/3rdparty/zookeeper-3.4.8/src/zookeeper-3.4.8/src/c/include -isystem /mesos/build/3rdparty/zookeeper-3.4.8/src/zookeeper-3.4.8/src/c/generated -isystem /mesos/build/3rdparty/nvml-352.79/src/nvml-352.79 -isystem /mesos/build/3rdparty/leveldb-1.19/src/leveldb-1.19/include -isystem /mesos/build/3rdparty/googletest-1.8.0/src/googletest-1.8.0/googlemock/include -isystem /mesos/build/3rdparty/googletest-1.8.0/src/googletest-1.8.0/googletest/include  -std=c++11 -Wformat-security -fstack-protector -fPIE   -o CMakeFiles/mesos-tests.dir/mock_registrar.cpp.o -c /mesos/src/tests/mock_registrar.cpp
[ 83%] Building CXX object src/tests/CMakeFiles/mesos-tests.dir/mock_slave.cpp.o
cd /mesos/build/src/tests && /usr/bin/g++  -DBUILD_DIR=\"/mesos/build\" -DBUILD_FLAGS=\"\" -DBUILD_JAVA_JVM_LIBRARY=\"\" -DHAS_AUTHENTICATION=1 -DHAVE_LIBZ -DLIBDIR=\"/usr/local/libmesos\" -DPICOJSON_USE_INT64 -DPKGDATADIR=\"/usr/local/share/mesos\" -DPKGLIBEXECDIR=\"/usr/local/libexec/mesos\" -DPKGMODULEDIR=\"\" -DSBINDIR=\"\" -DSOURCE_DIR=\"/mesos\" -DTESTLIBEXECDIR=\"\" -DUSE_CMAKE_BUILD_CONFIG -DUSE_SSL_SOCKET=1 -DUSE_STATIC_LIB -DVERSION=\"1.5.0\" -DZOOKEEPER_VERSION=\"3.4.8\" -D__STDC_FORMAT_MACROS -I/mesos/include -I/mesos/build/include -I/mesos/build/include/mesos -I/mesos/build/src -I/mesos/src -I/mesos/3rdparty/libprocess/src/../include -I/mesos/3rdparty/stout/include -isystem /usr/include/apr-1.0 -isystem /mesos/build/3rdparty/boost-1.53.0/src/boost-1.53.0 -isystem /mesos/build/3rdparty/elfio-3.2/src/elfio-3.2 -isystem /mesos/build/3rdparty/glog-0.3.3/src/glog-0.3.3-build/include -isystem /mesos/build/3rdparty/picojson-1.3.0/src/picojson-1.3.0 -isystem /mesos/build/3rdparty/protobuf-3.3.0/src/protobuf-3.3.0/src -isystem /usr/include/subversion-1 -isystem /mesos/build/3rdparty/http_parser-2.6.2/src/http_parser-2.6.2 -isystem /mesos/build/3rdparty/zookeeper-3.4.8/src/zookeeper-3.4.8/src/c/include -isystem /mesos/build/3rdparty/zookeeper-3.4.8/src/zookeeper-3.4.8/src/c/generated -isystem /mesos/build/3rdparty/nvml-352.79/src/nvml-352.79 -isystem /mesos/build/3rdparty/leveldb-1.19/src/leveldb-1.19/include -isystem /mesos/build/3rdparty/googletest-1.8.0/src/googletest-1.8.0/googlemock/include -isystem /mesos/build/3rdparty/googletest-1.8.0/src/googletest-1.8.0/googletest/include  -std=c++11 -Wformat-security -fstack-protector -fPIE   -o CMakeFiles/mesos-tests.dir/mock_slave.cpp.o -c /mesos/src/tests/mock_slave.cpp
[ 83%] Building CXX object src/tests/CMakeFiles/mesos-tests.dir/module.cpp.o
cd /mesos/build/src/tests && /usr/bin/g++  -DBUILD_DIR=\"/mesos/build\" -DBUILD_FLAGS=\"\" -DBUILD_JAVA_JVM_LIBRARY=\"\" -DHAS_AUTHENTICATION=1 -DHAVE_LIBZ -DLIBDIR=\"/usr/local/libmesos\" -DPICOJSON_USE_INT64 -DPKGDATADIR=\"/usr/local/share/mesos\" -DPKGLIBEXECDIR=\"/usr/local/libexec/mesos\" -DPKGMODULEDIR=\"\" -DSBINDIR=\"\" -DSOURCE_DIR=\"/mesos\" -DTESTLIBEXECDIR=\"\" -DUSE_CMAKE_BUILD_CONFIG -DUSE_SSL_SOCKET=1 -DUSE_STATIC_LIB -DVERSION=\"1.5.0\" -DZOOKEEPER_VERSION=\"3.4.8\" -D__STDC_FORMAT_MACROS -I/mesos/include -I/mesos/build/include -I/mesos/build/include/mesos -I/mesos/build/src -I/mesos/src -I/mesos/3rdparty/libprocess/src/../include -I/mesos/3rdparty/stout/include -isystem /usr/include/apr-1.0 -isystem /mesos/build/3rdparty/boost-1.53.0/src/boost-1.53.0 -isystem /mesos/build/3rdparty/elfio-3.2/src/elfio-3.2 -isystem /mesos/build/3rdparty/glog-0.3.3/src/glog-0.3.3-build/include -isystem /mesos/build/3rdparty/picojson-1.3.0/src/picojson-1.3.0 -isystem /mesos/build/3rdparty/protobuf-3.3.0/src/protobuf-3.3.0/src -isystem /usr/include/subversion-1 -isystem /mesos/build/3rdparty/http_parser-2.6.2/src/http_parser-2.6.2 -isystem /mesos/build/3rdparty/zookeeper-3.4.8/src/zookeeper-3.4.8/src/c/include -isystem /mesos/build/3rdparty/zookeeper-3.4.8/src/zookeeper-3.4.8/src/c/generated -isystem /mesos/build/3rdparty/nvml-352.79/src/nvml-352.79 -isystem /mesos/build/3rdparty/leveldb-1.19/src/leveldb-1.19/include -isystem /mesos/build/3rdparty/googletest-1.8.0/src/googletest-1.8.0/googlemock/include -isystem /mesos/build/3rdparty/googletest-1.8.0/src/googletest-1.8.0/googletest/include  -std=c++11 -Wformat-security -fstack-protector -fPIE   -o CMakeFiles/mesos-tests.dir/module.cpp.o -c /mesos/src/tests/module.cpp
[ 83%] Building CXX object src/tests/CMakeFiles/mesos-tests.dir/resources_utils.cpp.o
cd /mesos/build/src/tests && /usr/bin/g++  -DBUILD_DIR=\"/mesos/build\" -DBUILD_FLAGS=\"\" -DBUILD_JAVA_JVM_LIBRARY=\"\" -DHAS_AUTHENTICATION=1 -DHAVE_LIBZ -DLIBDIR=\"/usr/local/libmesos\" -DPICOJSON_USE_INT64 -DPKGDATADIR=\"/usr/local/share/mesos\" -DPKGLIBEXECDIR=\"/usr/local/libexec/mesos\" -DPKGMODULEDIR=\"\" -DSBINDIR=\"\" -DSOURCE_DIR=\"/mesos\" -DTESTLIBEXECDIR=\"\" -DUSE_CMAKE_BUILD_CONFIG -DUSE_SSL_SOCKET=1 -DUSE_STATIC_LIB -DVERSION=\"1.5.0\" -DZOOKEEPER_VERSION=\"3.4.8\" -D__STDC_FORMAT_MACROS -I/mesos/include -I/mesos/build/include -I/mesos/build/include/mesos -I/mesos/build/src -I/mesos/src -I/mesos/3rdparty/libprocess/src/../include -I/mesos/3rdparty/stout/include -isystem /usr/include/apr-1.0 -isystem /mesos/build/3rdparty/boost-1.53.0/src/boost-1.53.0 -isystem /mesos/build/3rdparty/elfio-3.2/src/elfio-3.2 -isystem /mesos/build/3rdparty/glog-0.3.3/src/glog-0.3.3-build/include -isystem /mesos/build/3rdparty/picojson-1.3.0/src/picojson-1.3.0 -isystem /mesos/build/3rdparty/protobuf-3.3.0/src/protobuf-3.3.0/src -isystem /usr/include/subversion-1 -isystem /mesos/build/3rdparty/http_parser-2.6.2/src/http_parser-2.6.2 -isystem /mesos/build/3rdparty/zookeeper-3.4.8/src/zookeeper-3.4.8/src/c/include -isystem /mesos/build/3rdparty/zookeeper-3.4.8/src/zookeeper-3.4.8/src/c/generated -isystem /mesos/build/3rdparty/nvml-352.79/src/nvml-352.79 -isystem /mesos/build/3rdparty/leveldb-1.19/src/leveldb-1.19/include -isystem /mesos/build/3rdparty/googletest-1.8.0/src/googletest-1.8.0/googlemock/include -isystem /mesos/build/3rdparty/googletest-1.8.0/src/googletest-1.8.0/googletest/include  -std=c++11 -Wformat-security -fstack-protector -fPIE   -o CMakeFiles/mesos-tests.dir/resources_utils.cpp.o -c /mesos/src/tests/resources_utils.cpp
[ 83%] Building CXX object src/tests/CMakeFiles/mesos-tests.dir/utils.cpp.o
cd /mesos/build/src/tests && /usr/bin/g++  -DBUILD_DIR=\"/mesos/build\" -DBUILD_FLAGS=\"\" -DBUILD_JAVA_JVM_LIBRARY=\"\" -DHAS_AUTHENTICATION=1 -DHAVE_LIBZ -DLIBDIR=\"/usr/local/libmesos\" -DPICOJSON_USE_INT64 -DPKGDATADIR=\"/usr/local/share/mesos\" -DPKGLIBEXECDIR=\"/usr/local/libexec/mesos\" -DPKGMODULEDIR=\"\" -DSBINDIR=\"\" -DSOURCE_DIR=\"/mesos\" -DTESTLIBEXECDIR=\"\" -DUSE_CMAKE_BUILD_CONFIG -DUSE_SSL_SOCKET=1 -DUSE_STATIC_LIB -DVERSION=\"1.5.0\" -DZOOKEEPER_VERSION=\"3.4.8\" -D__STDC_FORMAT_MACROS -I/mesos/include -I/mesos/build/include -I/mesos/build/include/mesos -I/mesos/build/src -I/mesos/src -I/mesos/3rdparty/libprocess/src/../include -I/mesos/3rdparty/stout/include -isystem /usr/include/apr-1.0 -isystem /mesos/build/3rdparty/boost-1.53.0/src/boost-1.53.0 -isystem /mesos/build/3rdparty/elfio-3.2/src/elfio-3.2 -isystem /mesos/build/3rdparty/glog-0.3.3/src/glog-0.3.3-build/include -isystem /mesos/build/3rdparty/picojson-1.3.0/src/picojson-1.3.0 -isystem /mesos/build/3rdparty/protobuf-3.3.0/src/protobuf-3.3.0/src -isystem /usr/include/subversion-1 -isystem /mesos/build/3rdparty/http_parser-2.6.2/src/http_parser-2.6.2 -isystem /mesos/build/3rdparty/zookeeper-3.4.8/src/zookeeper-3.4.8/src/c/include -isystem /mesos/build/3rdparty/zookeeper-3.4.8/src/zookeeper-3.4.8/src/c/generated -isystem /mesos/build/3rdparty/nvml-352.79/src/nvml-352.79 -isystem /mesos/build/3rdparty/leveldb-1.19/src/leveldb-1.19/include -isystem /mesos/build/3rdparty/googletest-1.8.0/src/googletest-1.8.0/googlemock/include -isystem /mesos/build/3rdparty/googletest-1.8.0/src/googletest-1.8.0/googletest/include  -std=c++11 -Wformat-security -fstack-protector -fPIE   -o CMakeFiles/mesos-tests.dir/utils.cpp.o -c /mesos/src/tests/utils.cpp
[ 83%] Building CXX object src/tests/CMakeFiles/mesos-tests.dir/containerizer/launcher.cpp.o
cd /mesos/build/src/tests && /usr/bin/g++  -DBUILD_DIR=\"/mesos/build\" -DBUILD_FLAGS=\"\" -DBUILD_JAVA_JVM_LIBRARY=\"\" -DHAS_AUTHENTICATION=1 -DHAVE_LIBZ -DLIBDIR=\"/usr/local/libmesos\" -DPICOJSON_USE_INT64 -DPKGDATADIR=\"/usr/local/share/mesos\" -DPKGLIBEXECDIR=\"/usr/local/libexec/mesos\" -DPKGMODULEDIR=\"\" -DSBINDIR=\"\" -DSOURCE_DIR=\"/mesos\" -DTESTLIBEXECDIR=\"\" -DUSE_CMAKE_BUILD_CONFIG -DUSE_SSL_SOCKET=1 -DUSE_STATIC_LIB -DVERSION=\"1.5.0\" -DZOOKEEPER_VERSION=\"3.4.8\" -D__STDC_FORMAT_MACROS -I/mesos/include -I/mesos/build/include -I/mesos/build/include/mesos -I/mesos/build/src -I/mesos/src -I/mesos/3rdparty/libprocess/src/../include -I/mesos/3rdparty/stout/include -isystem /usr/include/apr-1.0 -isystem /mesos/build/3rdparty/boost-1.53.0/src/boost-1.53.0 -isystem /mesos/build/3rdparty/elfio-3.2/src/elfio-3.2 -isystem /mesos/build/3rdparty/glog-0.3.3/src/glog-0.3.3-build/include -isystem /mesos/build/3rdparty/picojson-1.3.0/src/picojson-1.3.0 -isystem /mesos/build/3rdparty/protobuf-3.3.0/src/protobuf-3.3.0/src -isystem /usr/include/subversion-1 -isystem /mesos/build/3rdparty/http_parser-2.6.2/src/http_parser-2.6.2 -isystem /mesos/build/3rdparty/zookeeper-3.4.8/src/zookeeper-3.4.8/src/c/include -isystem /mesos/build/3rdparty/zookeeper-3.4.8/src/zookeeper-3.4.8/src/c/generated -isystem /mesos/build/3rdparty/nvml-352.79/src/nvml-352.79 -isystem /mesos/build/3rdparty/leveldb-1.19/src/leveldb-1.19/include -isystem /mesos/build/3rdparty/googletest-1.8.0/src/googletest-1.8.0/googlemock/include -isystem /mesos/build/3rdparty/googletest-1.8.0/src/googletest-1.8.0/googletest/include  -std=c++11 -Wformat-security -fstack-protector -fPIE   -o CMakeFiles/mesos-tests.dir/containerizer/launcher.cpp.o -c /mesos/src/tests/containerizer/launcher.cpp
[ 83%] Building CXX object src/tests/CMakeFiles/mesos-tests.dir/kill_policy_test_helper.cpp.o
cd /mesos/build/src/tests && /usr/bin/g++  -DBUILD_DIR=\"/mesos/build\" -DBUILD_FLAGS=\"\" -DBUILD_JAVA_JVM_LIBRARY=\"\" -DHAS_AUTHENTICATION=1 -DHAVE_LIBZ -DLIBDIR=\"/usr/local/libmesos\" -DPICOJSON_USE_INT64 -DPKGDATADIR=\"/usr/local/share/mesos\" -DPKGLIBEXECDIR=\"/usr/local/libexec/mesos\" -DPKGMODULEDIR=\"\" -DSBINDIR=\"\" -DSOURCE_DIR=\"/mesos\" -DTESTLIBEXECDIR=\"\" -DUSE_CMAKE_BUILD_CONFIG -DUSE_SSL_SOCKET=1 -DUSE_STATIC_LIB -DVERSION=\"1.5.0\" -DZOOKEEPER_VERSION=\"3.4.8\" -D__STDC_FORMAT_MACROS -I/mesos/include -I/mesos/build/include -I/mesos/build/include/mesos -I/mesos/build/src -I/mesos/src -I/mesos/3rdparty/libprocess/src/../include -I/mesos/3rdparty/stout/include -isystem /usr/include/apr-1.0 -isystem /mesos/build/3rdparty/boost-1.53.0/src/boost-1.53.0 -isystem /mesos/build/3rdparty/elfio-3.2/src/elfio-3.2 -isystem /mesos/build/3rdparty/glog-0.3.3/src/glog-0.3.3-build/include -isystem /mesos/build/3rdparty/picojson-1.3.0/src/picojson-1.3.0 -isystem /mesos/build/3rdparty/protobuf-3.3.0/src/protobuf-3.3.0/src -isystem /usr/include/subversion-1 -isystem /mesos/build/3rdparty/http_parser-2.6.2/src/http_parser-2.6.2 -isystem /mesos/build/3rdparty/zookeeper-3.4.8/src/zookeeper-3.4.8/src/c/include -isystem /mesos/build/3rdparty/zookeeper-3.4.8/src/zookeeper-3.4.8/src/c/generated -isystem /mesos/build/3rdparty/nvml-352.79/src/nvml-352.79 -isystem /mesos/build/3rdparty/leveldb-1.19/src/leveldb-1.19/include -isystem /mesos/build/3rdparty/googletest-1.8.0/src/googletest-1.8.0/googlemock/include -isystem /mesos/build/3rdparty/googletest-1.8.0/src/googletest-1.8.0/googletest/include  -std=c++11 -Wformat-security -fstack-protector -fPIE   -o CMakeFiles/mesos-tests.dir/kill_policy_test_helper.cpp.o -c /mesos/src/tests/kill_policy_test_helper.cpp
[ 83%] Building CXX object src/tests/CMakeFiles/mesos-tests.dir/script.cpp.o
cd /mesos/build/src/tests && /usr/bin/g++  -DBUILD_DIR=\"/mesos/build\" -DBUILD_FLAGS=\"\" -DBUILD_JAVA_JVM_LIBRARY=\"\" -DHAS_AUTHENTICATION=1 -DHAVE_LIBZ -DLIBDIR=\"/usr/local/libmesos\" -DPICOJSON_USE_INT64 -DPKGDATADIR=\"/usr/local/share/mesos\" -DPKGLIBEXECDIR=\"/usr/local/libexec/mesos\" -DPKGMODULEDIR=\"\" -DSBINDIR=\"\" -DSOURCE_DIR=\"/mesos\" -DTESTLIBEXECDIR=\"\" -DUSE_CMAKE_BUILD_CONFIG -DUSE_SSL_SOCKET=1 -DUSE_STATIC_LIB -DVERSION=\"1.5.0\" -DZOOKEEPER_VERSION=\"3.4.8\" -D__STDC_FORMAT_MACROS -I/mesos/include -I/mesos/build/include -I/mesos/build/include/mesos -I/mesos/build/src -I/mesos/src -I/mesos/3rdparty/libprocess/src/../include -I/mesos/3rdparty/stout/include -isystem /usr/include/apr-1.0 -isystem /mesos/build/3rdparty/boost-1.53.0/src/boost-1.53.0 -isystem /mesos/build/3rdparty/elfio-3.2/src/elfio-3.2 -isystem /mesos/build/3rdparty/glog-0.3.3/src/glog-0.3.3-build/include -isystem /mesos/build/3rdparty/picojson-1.3.0/src/picojson-1.3.0 -isystem /mesos/build/3rdparty/protobuf-3.3.0/src/protobuf-3.3.0/src -isystem /usr/include/subversion-1 -isystem /mesos/build/3rdparty/http_parser-2.6.2/src/http_parser-2.6.2 -isystem /mesos/build/3rdparty/zookeeper-3.4.8/src/zookeeper-3.4.8/src/c/include -isystem /mesos/build/3rdparty/zookeeper-3.4.8/src/zookeeper-3.4.8/src/c/generated -isystem /mesos/build/3rdparty/nvml-352.79/src/nvml-352.79 -isystem /mesos/build/3rdparty/leveldb-1.19/src/leveldb-1.19/include -isystem /mesos/build/3rdparty/googletest-1.8.0/src/googletest-1.8.0/googlemock/include -isystem /mesos/build/3rdparty/googletest-1.8.0/src/googletest-1.8.0/googletest/include  -std=c++11 -Wformat-security -fstack-protector -fPIE   -o CMakeFiles/mesos-tests.dir/script.cpp.o -c /mesos/src/tests/script.cpp
[ 84%] Building CXX object src/tests/CMakeFiles/mesos-tests.dir/containerizer/memory_test_helper.cpp.o
cd /mesos/build/src/tests && /usr/bin/g++  -DBUILD_DIR=\"/mesos/build\" -DBUILD_FLAGS=\"\" -DBUILD_JAVA_JVM_LIBRARY=\"\" -DHAS_AUTHENTICATION=1 -DHAVE_LIBZ -DLIBDIR=\"/usr/local/libmesos\" -DPICOJSON_USE_INT64 -DPKGDATADIR=\"/usr/local/share/mesos\" -DPKGLIBEXECDIR=\"/usr/local/libexec/mesos\" -DPKGMODULEDIR=\"\" -DSBINDIR=\"\" -DSOURCE_DIR=\"/mesos\" -DTESTLIBEXECDIR=\"\" -DUSE_CMAKE_BUILD_CONFIG -DUSE_SSL_SOCKET=1 -DUSE_STATIC_LIB -DVERSION=\"1.5.0\" -DZOOKEEPER_VERSION=\"3.4.8\" -D__STDC_FORMAT_MACROS -I/mesos/include -I/mesos/build/include -I/mesos/build/include/mesos -I/mesos/build/src -I/mesos/src -I/mesos/3rdparty/libprocess/src/../include -I/mesos/3rdparty/stout/include -isystem /usr/include/apr-1.0 -isystem /mesos/build/3rdparty/boost-1.53.0/src/boost-1.53.0 -isystem /mesos/build/3rdparty/elfio-3.2/src/elfio-3.2 -isystem /mesos/build/3rdparty/glog-0.3.3/src/glog-0.3.3-build/include -isystem /mesos/build/3rdparty/picojson-1.3.0/src/picojson-1.3.0 -isystem /mesos/build/3rdparty/protobuf-3.3.0/src/protobuf-3.3.0/src -isystem /usr/include/subversion-1 -isystem /mesos/build/3rdparty/http_parser-2.6.2/src/http_parser-2.6.2 -isystem /mesos/build/3rdparty/zookeeper-3.4.8/src/zookeeper-3.4.8/src/c/include -isystem /mesos/build/3rdparty/zookeeper-3.4.8/src/zookeeper-3.4.8/src/c/generated -isystem /mesos/build/3rdparty/nvml-352.79/src/nvml-352.79 -isystem /mesos/build/3rdparty/leveldb-1.19/src/leveldb-1.19/include -isystem /mesos/build/3rdparty/googletest-1.8.0/src/googletest-1.8.0/googlemock/include -isystem /mesos/build/3rdparty/googletest-1.8.0/src/googletest-1.8.0/googletest/include  -std=c++11 -Wformat-security -fstack-protector -fPIE   -o CMakeFiles/mesos-tests.dir/containerizer/memory_test_helper.cpp.o -c /mesos/src/tests/containerizer/memory_test_helper.cpp
[ 84%] Building CXX object src/tests/CMakeFiles/mesos-tests.dir/containerizer/capabilities_test_helper.cpp.o
cd /mesos/build/src/tests && /usr/bin/g++  -DBUILD_DIR=\"/mesos/build\" -DBUILD_FLAGS=\"\" -DBUILD_JAVA_JVM_LIBRARY=\"\" -DHAS_AUTHENTICATION=1 -DHAVE_LIBZ -DLIBDIR=\"/usr/local/libmesos\" -DPICOJSON_USE_INT64 -DPKGDATADIR=\"/usr/local/share/mesos\" -DPKGLIBEXECDIR=\"/usr/local/libexec/mesos\" -DPKGMODULEDIR=\"\" -DSBINDIR=\"\" -DSOURCE_DIR=\"/mesos\" -DTESTLIBEXECDIR=\"\" -DUSE_CMAKE_BUILD_CONFIG -DUSE_SSL_SOCKET=1 -DUSE_STATIC_LIB -DVERSION=\"1.5.0\" -DZOOKEEPER_VERSION=\"3.4.8\" -D__STDC_FORMAT_MACROS -I/mesos/include -I/mesos/build/include -I/mesos/build/include/mesos -I/mesos/build/src -I/mesos/src -I/mesos/3rdparty/libprocess/src/../include -I/mesos/3rdparty/stout/include -isystem /usr/include/apr-1.0 -isystem /mesos/build/3rdparty/boost-1.53.0/src/boost-1.53.0 -isystem /mesos/build/3rdparty/elfio-3.2/src/elfio-3.2 -isystem /mesos/build/3rdparty/glog-0.3.3/src/glog-0.3.3-build/include -isystem /mesos/build/3rdparty/picojson-1.3.0/src/picojson-1.3.0 -isystem /mesos/build/3rdparty/protobuf-3.3.0/src/protobuf-3.3.0/src -isystem /usr/include/subversion-1 -isystem /mesos/build/3rdparty/http_parser-2.6.2/src/http_parser-2.6.2 -isystem /mesos/build/3rdparty/zookeeper-3.4.8/src/zookeeper-3.4.8/src/c/include -isystem /mesos/build/3rdparty/zookeeper-3.4.8/src/zookeeper-3.4.8/src/c/generated -isystem /mesos/build/3rdparty/nvml-352.79/src/nvml-352.79 -isystem /mesos/build/3rdparty/leveldb-1.19/src/leveldb-1.19/include -isystem /mesos/build/3rdparty/googletest-1.8.0/src/googletest-1.8.0/googlemock/include -isystem /mesos/build/3rdparty/googletest-1.8.0/src/googletest-1.8.0/googletest/include  -std=c++11 -Wformat-security -fstack-protector -fPIE   -o CMakeFiles/mesos-tests.dir/containerizer/capabilities_test_helper.cpp.o -c /mesos/src/tests/containerizer/capabilities_test_helper.cpp
[ 84%] Building CXX object src/tests/CMakeFiles/mesos-tests.dir/containerizer/setns_test_helper.cpp.o
cd /mesos/build/src/tests && /usr/bin/g++  -DBUILD_DIR=\"/mesos/build\" -DBUILD_FLAGS=\"\" -DBUILD_JAVA_JVM_LIBRARY=\"\" -DHAS_AUTHENTICATION=1 -DHAVE_LIBZ -DLIBDIR=\"/usr/local/libmesos\" -DPICOJSON_USE_INT64 -DPKGDATADIR=\"/usr/local/share/mesos\" -DPKGLIBEXECDIR=\"/usr/local/libexec/mesos\" -DPKGMODULEDIR=\"\" -DSBINDIR=\"\" -DSOURCE_DIR=\"/mesos\" -DTESTLIBEXECDIR=\"\" -DUSE_CMAKE_BUILD_CONFIG -DUSE_SSL_SOCKET=1 -DUSE_STATIC_LIB -DVERSION=\"1.5.0\" -DZOOKEEPER_VERSION=\"3.4.8\" -D__STDC_FORMAT_MACROS -I/mesos/include -I/mesos/build/include -I/mesos/build/include/mesos -I/mesos/build/src -I/mesos/src -I/mesos/3rdparty/libprocess/src/../include -I/mesos/3rdparty/stout/include -isystem /usr/include/apr-1.0 -isystem /mesos/build/3rdparty/boost-1.53.0/src/boost-1.53.0 -isystem /mesos/build/3rdparty/elfio-3.2/src/elfio-3.2 -isystem /mesos/build/3rdparty/glog-0.3.3/src/glog-0.3.3-build/include -isystem /mesos/build/3rdparty/picojson-1.3.0/src/picojson-1.3.0 -isystem /mesos/build/3rdparty/protobuf-3.3.0/src/protobuf-3.3.0/src -isystem /usr/include/subversion-1 -isystem /mesos/build/3rdparty/http_parser-2.6.2/src/http_parser-2.6.2 -isystem /mesos/build/3rdparty/zookeeper-3.4.8/src/zookeeper-3.4.8/src/c/include -isystem /mesos/build/3rdparty/zookeeper-3.4.8/src/zookeeper-3.4.8/src/c/generated -isystem /mesos/build/3rdparty/nvml-352.79/src/nvml-352.79 -isystem /mesos/build/3rdparty/leveldb-1.19/src/leveldb-1.19/include -isystem /mesos/build/3rdparty/googletest-1.8.0/src/googletest-1.8.0/googlemock/include -isystem /mesos/build/3rdparty/googletest-1.8.0/src/googletest-1.8.0/googletest/include  -std=c++11 -Wformat-security -fstack-protector -fPIE   -o CMakeFiles/mesos-tests.dir/containerizer/setns_test_helper.cpp.o -c /mesos/src/tests/containerizer/setns_test_helper.cpp
[ 84%] Building CXX object src/tests/CMakeFiles/mesos-tests.dir/anonymous_tests.cpp.o
cd /mesos/build/src/tests && /usr/bin/g++  -DBUILD_DIR=\"/mesos/build\" -DBUILD_FLAGS=\"\" -DBUILD_JAVA_JVM_LIBRARY=\"\" -DHAS_AUTHENTICATION=1 -DHAVE_LIBZ -DLIBDIR=\"/usr/local/libmesos\" -DPICOJSON_USE_INT64 -DPKGDATADIR=\"/usr/local/share/mesos\" -DPKGLIBEXECDIR=\"/usr/local/libexec/mesos\" -DPKGMODULEDIR=\"\" -DSBINDIR=\"\" -DSOURCE_DIR=\"/mesos\" -DTESTLIBEXECDIR=\"\" -DUSE_CMAKE_BUILD_CONFIG -DUSE_SSL_SOCKET=1 -DUSE_STATIC_LIB -DVERSION=\"1.5.0\" -DZOOKEEPER_VERSION=\"3.4.8\" -D__STDC_FORMAT_MACROS -I/mesos/include -I/mesos/build/include -I/mesos/build/include/mesos -I/mesos/build/src -I/mesos/src -I/mesos/3rdparty/libprocess/src/../include -I/mesos/3rdparty/stout/include -isystem /usr/include/apr-1.0 -isystem /mesos/build/3rdparty/boost-1.53.0/src/boost-1.53.0 -isystem /mesos/build/3rdparty/elfio-3.2/src/elfio-3.2 -isystem /mesos/build/3rdparty/glog-0.3.3/src/glog-0.3.3-build/include -isystem /mesos/build/3rdparty/picojson-1.3.0/src/picojson-1.3.0 -isystem /mesos/build/3rdparty/protobuf-3.3.0/src/protobuf-3.3.0/src -isystem /usr/include/subversion-1 -isystem /mesos/build/3rdparty/http_parser-2.6.2/src/http_parser-2.6.2 -isystem /mesos/build/3rdparty/zookeeper-3.4.8/src/zookeeper-3.4.8/src/c/include -isystem /mesos/build/3rdparty/zookeeper-3.4.8/src/zookeeper-3.4.8/src/c/generated -isystem /mesos/build/3rdparty/nvml-352.79/src/nvml-352.79 -isystem /mesos/build/3rdparty/leveldb-1.19/src/leveldb-1.19/include -isystem /mesos/build/3rdparty/googletest-1.8.0/src/googletest-1.8.0/googlemock/include -isystem /mesos/build/3rdparty/googletest-1.8.0/src/googletest-1.8.0/googletest/include  -std=c++11 -Wformat-security -fstack-protector -fPIE   -o CMakeFiles/mesos-tests.dir/anonymous_tests.cpp.o -c /mesos/src/tests/anonymous_tests.cpp
[ 84%] Building CXX object src/tests/CMakeFiles/mesos-tests.dir/api_tests.cpp.o
cd /mesos/build/src/tests && /usr/bin/g++  -DBUILD_DIR=\"/mesos/build\" -DBUILD_FLAGS=\"\" -DBUILD_JAVA_JVM_LIBRARY=\"\" -DHAS_AUTHENTICATION=1 -DHAVE_LIBZ -DLIBDIR=\"/usr/local/libmesos\" -DPICOJSON_USE_INT64 -DPKGDATADIR=\"/usr/local/share/mesos\" -DPKGLIBEXECDIR=\"/usr/local/libexec/mesos\" -DPKGMODULEDIR=\"\" -DSBINDIR=\"\" -DSOURCE_DIR=\"/mesos\" -DTESTLIBEXECDIR=\"\" -DUSE_CMAKE_BUILD_CONFIG -DUSE_SSL_SOCKET=1 -DUSE_STATIC_LIB -DVERSION=\"1.5.0\" -DZOOKEEPER_VERSION=\"3.4.8\" -D__STDC_FORMAT_MACROS -I/mesos/include -I/mesos/build/include -I/mesos/build/include/mesos -I/mesos/build/src -I/mesos/src -I/mesos/3rdparty/libprocess/src/../include -I/mesos/3rdparty/stout/include -isystem /usr/include/apr-1.0 -isystem /mesos/build/3rdparty/boost-1.53.0/src/boost-1.53.0 -isystem /mesos/build/3rdparty/elfio-3.2/src/elfio-3.2 -isystem /mesos/build/3rdparty/glog-0.3.3/src/glog-0.3.3-build/include -isystem /mesos/build/3rdparty/picojson-1.3.0/src/picojson-1.3.0 -isystem /mesos/build/3rdparty/protobuf-3.3.0/src/protobuf-3.3.0/src -isystem /usr/include/subversion-1 -isystem /mesos/build/3rdparty/http_parser-2.6.2/src/http_parser-2.6.2 -isystem /mesos/build/3rdparty/zookeeper-3.4.8/src/zookeeper-3.4.8/src/c/include -isystem /mesos/build/3rdparty/zookeeper-3.4.8/src/zookeeper-3.4.8/src/c/generated -isystem /mesos/build/3rdparty/nvml-352.79/src/nvml-352.79 -isystem /mesos/build/3rdparty/leveldb-1.19/src/leveldb-1.19/include -isystem /mesos/build/3rdparty/googletest-1.8.0/src/googletest-1.8.0/googlemock/include -isystem /mesos/build/3rdparty/googletest-1.8.0/src/googletest-1.8.0/googletest/include  -std=c++11 -Wformat-security -fstack-protector -fPIE   -o CMakeFiles/mesos-tests.dir/api_tests.cpp.o -c /mesos/src/tests/api_tests.cpp
[ 84%] Building CXX object src/tests/CMakeFiles/mesos-tests.dir/attributes_tests.cpp.o
cd /mesos/build/src/tests && /usr/bin/g++  -DBUILD_DIR=\"/mesos/build\" -DBUILD_FLAGS=\"\" -DBUILD_JAVA_JVM_LIBRARY=\"\" -DHAS_AUTHENTICATION=1 -DHAVE_LIBZ -DLIBDIR=\"/usr/local/libmesos\" -DPICOJSON_USE_INT64 -DPKGDATADIR=\"/usr/local/share/mesos\" -DPKGLIBEXECDIR=\"/usr/local/libexec/mesos\" -DPKGMODULEDIR=\"\" -DSBINDIR=\"\" -DSOURCE_DIR=\"/mesos\" -DTESTLIBEXECDIR=\"\" -DUSE_CMAKE_BUILD_CONFIG -DUSE_SSL_SOCKET=1 -DUSE_STATIC_LIB -DVERSION=\"1.5.0\" -DZOOKEEPER_VERSION=\"3.4.8\" -D__STDC_FORMAT_MACROS -I/mesos/include -I/mesos/build/include -I/mesos/build/include/mesos -I/mesos/build/src -I/mesos/src -I/mesos/3rdparty/libprocess/src/../include -I/mesos/3rdparty/stout/include -isystem /usr/include/apr-1.0 -isystem /mesos/build/3rdparty/boost-1.53.0/src/boost-1.53.0 -isystem /mesos/build/3rdparty/elfio-3.2/src/elfio-3.2 -isystem /mesos/build/3rdparty/glog-0.3.3/src/glog-0.3.3-build/include -isystem /mesos/build/3rdparty/picojson-1.3.0/src/picojson-1.3.0 -isystem /mesos/build/3rdparty/protobuf-3.3.0/src/protobuf-3.3.0/src -isystem /usr/include/subversion-1 -isystem /mesos/build/3rdparty/http_parser-2.6.2/src/http_parser-2.6.2 -isystem /mesos/build/3rdparty/zookeeper-3.4.8/src/zookeeper-3.4.8/src/c/include -isystem /mesos/build/3rdparty/zookeeper-3.4.8/src/zookeeper-3.4.8/src/c/generated -isystem /mesos/build/3rdparty/nvml-352.79/src/nvml-352.79 -isystem /mesos/build/3rdparty/leveldb-1.19/src/leveldb-1.19/include -isystem /mesos/build/3rdparty/googletest-1.8.0/src/googletest-1.8.0/googlemock/include -isystem /mesos/build/3rdparty/googletest-1.8.0/src/googletest-1.8.0/googletest/include  -std=c++11 -Wformat-security -fstack-protector -fPIE   -o CMakeFiles/mesos-tests.dir/attributes_tests.cpp.o -c /mesos/src/tests/attributes_tests.cpp
[ 84%] Building CXX object src/tests/CMakeFiles/mesos-tests.dir/authentication_tests.cpp.o
cd /mesos/build/src/tests && /usr/bin/g++  -DBUILD_DIR=\"/mesos/build\" -DBUILD_FLAGS=\"\" -DBUILD_JAVA_JVM_LIBRARY=\"\" -DHAS_AUTHENTICATION=1 -DHAVE_LIBZ -DLIBDIR=\"/usr/local/libmesos\" -DPICOJSON_USE_INT64 -DPKGDATADIR=\"/usr/local/share/mesos\" -DPKGLIBEXECDIR=\"/usr/local/libexec/mesos\" -DPKGMODULEDIR=\"\" -DSBINDIR=\"\" -DSOURCE_DIR=\"/mesos\" -DTESTLIBEXECDIR=\"\" -DUSE_CMAKE_BUILD_CONFIG -DUSE_SSL_SOCKET=1 -DUSE_STATIC_LIB -DVERSION=\"1.5.0\" -DZOOKEEPER_VERSION=\"3.4.8\" -D__STDC_FORMAT_MACROS -I/mesos/include -I/mesos/build/include -I/mesos/build/include/mesos -I/mesos/build/src -I/mesos/src -I/mesos/3rdparty/libprocess/src/../include -I/mesos/3rdparty/stout/include -isystem /usr/include/apr-1.0 -isystem /mesos/build/3rdparty/boost-1.53.0/src/boost-1.53.0 -isystem /mesos/build/3rdparty/elfio-3.2/src/elfio-3.2 -isystem /mesos/build/3rdparty/glog-0.3.3/src/glog-0.3.3-build/include -isystem /mesos/build/3rdparty/picojson-1.3.0/src/picojson-1.3.0 -isystem /mesos/build/3rdparty/protobuf-3.3.0/src/protobuf-3.3.0/src -isystem /usr/include/subversion-1 -isystem /mesos/build/3rdparty/http_parser-2.6.2/src/http_parser-2.6.2 -isystem /mesos/build/3rdparty/zookeeper-3.4.8/src/zookeeper-3.4.8/src/c/include -isystem /mesos/build/3rdparty/zookeeper-3.4.8/src/zookeeper-3.4.8/src/c/generated -isystem /mesos/build/3rdparty/nvml-352.79/src/nvml-352.79 -isystem /mesos/build/3rdparty/leveldb-1.19/src/leveldb-1.19/include -isystem /mesos/build/3rdparty/googletest-1.8.0/src/googletest-1.8.0/googlemock/include -isystem /mesos/build/3rdparty/googletest-1.8.0/src/googletest-1.8.0/googletest/include  -std=c++11 -Wformat-security -fstack-protector -fPIE   -o CMakeFiles/mesos-tests.dir/authentication_tests.cpp.o -c /mesos/src/tests/authentication_tests.cpp
[ 85%] Building CXX object src/tests/CMakeFiles/mesos-tests.dir/check_tests.cpp.o
cd /mesos/build/src/tests && /usr/bin/g++  -DBUILD_DIR=\"/mesos/build\" -DBUILD_FLAGS=\"\" -DBUILD_JAVA_JVM_LIBRARY=\"\" -DHAS_AUTHENTICATION=1 -DHAVE_LIBZ -DLIBDIR=\"/usr/local/libmesos\" -DPICOJSON_USE_INT64 -DPKGDATADIR=\"/usr/local/share/mesos\" -DPKGLIBEXECDIR=\"/usr/local/libexec/mesos\" -DPKGMODULEDIR=\"\" -DSBINDIR=\"\" -DSOURCE_DIR=\"/mesos\" -DTESTLIBEXECDIR=\"\" -DUSE_CMAKE_BUILD_CONFIG -DUSE_SSL_SOCKET=1 -DUSE_STATIC_LIB -DVERSION=\"1.5.0\" -DZOOKEEPER_VERSION=\"3.4.8\" -D__STDC_FORMAT_MACROS -I/mesos/include -I/mesos/build/include -I/mesos/build/include/mesos -I/mesos/build/src -I/mesos/src -I/mesos/3rdparty/libprocess/src/../include -I/mesos/3rdparty/stout/include -isystem /usr/include/apr-1.0 -isystem /mesos/build/3rdparty/boost-1.53.0/src/boost-1.53.0 -isystem /mesos/build/3rdparty/elfio-3.2/src/elfio-3.2 -isystem /mesos/build/3rdparty/glog-0.3.3/src/glog-0.3.3-build/include -isystem /mesos/build/3rdparty/picojson-1.3.0/src/picojson-1.3.0 -isystem /mesos/build/3rdparty/protobuf-3.3.0/src/protobuf-3.3.0/src -isystem /usr/include/subversion-1 -isystem /mesos/build/3rdparty/http_parser-2.6.2/src/http_parser-2.6.2 -isystem /mesos/build/3rdparty/zookeeper-3.4.8/src/zookeeper-3.4.8/src/c/include -isystem /mesos/build/3rdparty/zookeeper-3.4.8/src/zookeeper-3.4.8/src/c/generated -isystem /mesos/build/3rdparty/nvml-352.79/src/nvml-352.79 -isystem /mesos/build/3rdparty/leveldb-1.19/src/leveldb-1.19/include -isystem /mesos/build/3rdparty/googletest-1.8.0/src/googletest-1.8.0/googlemock/include -isystem /mesos/build/3rdparty/googletest-1.8.0/src/googletest-1.8.0/googletest/include  -std=c++11 -Wformat-security -fstack-protector -fPIE   -o CMakeFiles/mesos-tests.dir/check_tests.cpp.o -c /mesos/src/tests/check_tests.cpp
[ 85%] Building CXX object src/tests/CMakeFiles/mesos-tests.dir/command_executor_tests.cpp.o
cd /mesos/build/src/tests && /usr/bin/g++  -DBUILD_DIR=\"/mesos/build\" -DBUILD_FLAGS=\"\" -DBUILD_JAVA_JVM_LIBRARY=\"\" -DHAS_AUTHENTICATION=1 -DHAVE_LIBZ -DLIBDIR=\"/usr/local/libmesos\" -DPICOJSON_USE_INT64 -DPKGDATADIR=\"/usr/local/share/mesos\" -DPKGLIBEXECDIR=\"/usr/local/libexec/mesos\" -DPKGMODULEDIR=\"\" -DSBINDIR=\"\" -DSOURCE_DIR=\"/mesos\" -DTESTLIBEXECDIR=\"\" -DUSE_CMAKE_BUILD_CONFIG -DUSE_SSL_SOCKET=1 -DUSE_STATIC_LIB -DVERSION=\"1.5.0\" -DZOOKEEPER_VERSION=\"3.4.8\" -D__STDC_FORMAT_MACROS -I/mesos/include -I/mesos/build/include -I/mesos/build/include/mesos -I/mesos/build/src -I/mesos/src -I/mesos/3rdparty/libprocess/src/../include -I/mesos/3rdparty/stout/include -isystem /usr/include/apr-1.0 -isystem /mesos/build/3rdparty/boost-1.53.0/src/boost-1.53.0 -isystem /mesos/build/3rdparty/elfio-3.2/src/elfio-3.2 -isystem /mesos/build/3rdparty/glog-0.3.3/src/glog-0.3.3-build/include -isystem /mesos/build/3rdparty/picojson-1.3.0/src/picojson-1.3.0 -isystem /mesos/build/3rdparty/protobuf-3.3.0/src/protobuf-3.3.0/src -isystem /usr/include/subversion-1 -isystem /mesos/build/3rdparty/http_parser-2.6.2/src/http_parser-2.6.2 -isystem /mesos/build/3rdparty/zookeeper-3.4.8/src/zookeeper-3.4.8/src/c/include -isystem /mesos/build/3rdparty/zookeeper-3.4.8/src/zookeeper-3.4.8/src/c/generated -isystem /mesos/build/3rdparty/nvml-352.79/src/nvml-352.79 -isystem /mesos/build/3rdparty/leveldb-1.19/src/leveldb-1.19/include -isystem /mesos/build/3rdparty/googletest-1.8.0/src/googletest-1.8.0/googlemock/include -isystem /mesos/build/3rdparty/googletest-1.8.0/src/googletest-1.8.0/googletest/include  -std=c++11 -Wformat-security -fstack-protector -fPIE   -o CMakeFiles/mesos-tests.dir/command_executor_tests.cpp.o -c /mesos/src/tests/command_executor_tests.cpp
[ 85%] Building CXX object src/tests/CMakeFiles/mesos-tests.dir/common_validation_tests.cpp.o
cd /mesos/build/src/tests && /usr/bin/g++  -DBUILD_DIR=\"/mesos/build\" -DBUILD_FLAGS=\"\" -DBUILD_JAVA_JVM_LIBRARY=\"\" -DHAS_AUTHENTICATION=1 -DHAVE_LIBZ -DLIBDIR=\"/usr/local/libmesos\" -DPICOJSON_USE_INT64 -DPKGDATADIR=\"/usr/local/share/mesos\" -DPKGLIBEXECDIR=\"/usr/local/libexec/mesos\" -DPKGMODULEDIR=\"\" -DSBINDIR=\"\" -DSOURCE_DIR=\"/mesos\" -DTESTLIBEXECDIR=\"\" -DUSE_CMAKE_BUILD_CONFIG -DUSE_SSL_SOCKET=1 -DUSE_STATIC_LIB -DVERSION=\"1.5.0\" -DZOOKEEPER_VERSION=\"3.4.8\" -D__STDC_FORMAT_MACROS -I/mesos/include -I/mesos/build/include -I/mesos/build/include/mesos -I/mesos/build/src -I/mesos/src -I/mesos/3rdparty/libprocess/src/../include -I/mesos/3rdparty/stout/include -isystem /usr/include/apr-1.0 -isystem /mesos/build/3rdparty/boost-1.53.0/src/boost-1.53.0 -isystem /mesos/build/3rdparty/elfio-3.2/src/elfio-3.2 -isystem /mesos/build/3rdparty/glog-0.3.3/src/glog-0.3.3-build/include -isystem /mesos/build/3rdparty/picojson-1.3.0/src/picojson-1.3.0 -isystem /mesos/build/3rdparty/protobuf-3.3.0/src/protobuf-3.3.0/src -isystem /usr/include/subversion-1 -isystem /mesos/build/3rdparty/http_parser-2.6.2/src/http_parser-2.6.2 -isystem /mesos/build/3rdparty/zookeeper-3.4.8/src/zookeeper-3.4.8/src/c/include -isystem /mesos/build/3rdparty/zookeeper-3.4.8/src/zookeeper-3.4.8/src/c/generated -isystem /mesos/build/3rdparty/nvml-352.79/src/nvml-352.79 -isystem /mesos/build/3rdparty/leveldb-1.19/src/leveldb-1.19/include -isystem /mesos/build/3rdparty/googletest-1.8.0/src/googletest-1.8.0/googlemock/include -isystem /mesos/build/3rdparty/googletest-1.8.0/src/googletest-1.8.0/googletest/include  -std=c++11 -Wformat-security -fstack-protector -fPIE   -o CMakeFiles/mesos-tests.dir/common_validation_tests.cpp.o -c /mesos/src/tests/common_validation_tests.cpp
[ 85%] Building CXX object src/tests/CMakeFiles/mesos-tests.dir/credentials_tests.cpp.o
cd /mesos/build/src/tests && /usr/bin/g++  -DBUILD_DIR=\"/mesos/build\" -DBUILD_FLAGS=\"\" -DBUILD_JAVA_JVM_LIBRARY=\"\" -DHAS_AUTHENTICATION=1 -DHAVE_LIBZ -DLIBDIR=\"/usr/local/libmesos\" -DPICOJSON_USE_INT64 -DPKGDATADIR=\"/usr/local/share/mesos\" -DPKGLIBEXECDIR=\"/usr/local/libexec/mesos\" -DPKGMODULEDIR=\"\" -DSBINDIR=\"\" -DSOURCE_DIR=\"/mesos\" -DTESTLIBEXECDIR=\"\" -DUSE_CMAKE_BUILD_CONFIG -DUSE_SSL_SOCKET=1 -DUSE_STATIC_LIB -DVERSION=\"1.5.0\" -DZOOKEEPER_VERSION=\"3.4.8\" -D__STDC_FORMAT_MACROS -I/mesos/include -I/mesos/build/include -I/mesos/build/include/mesos -I/mesos/build/src -I/mesos/src -I/mesos/3rdparty/libprocess/src/../include -I/mesos/3rdparty/stout/include -isystem /usr/include/apr-1.0 -isystem /mesos/build/3rdparty/boost-1.53.0/src/boost-1.53.0 -isystem /mesos/build/3rdparty/elfio-3.2/src/elfio-3.2 -isystem /mesos/build/3rdparty/glog-0.3.3/src/glog-0.3.3-build/include -isystem /mesos/build/3rdparty/picojson-1.3.0/src/picojson-1.3.0 -isystem /mesos/build/3rdparty/protobuf-3.3.0/src/protobuf-3.3.0/src -isystem /usr/include/subversion-1 -isystem /mesos/build/3rdparty/http_parser-2.6.2/src/http_parser-2.6.2 -isystem /mesos/build/3rdparty/zookeeper-3.4.8/src/zookeeper-3.4.8/src/c/include -isystem /mesos/build/3rdparty/zookeeper-3.4.8/src/zookeeper-3.4.8/src/c/generated -isystem /mesos/build/3rdparty/nvml-352.79/src/nvml-352.79 -isystem /mesos/build/3rdparty/leveldb-1.19/src/leveldb-1.19/include -isystem /mesos/build/3rdparty/googletest-1.8.0/src/googletest-1.8.0/googlemock/include -isystem /mesos/build/3rdparty/googletest-1.8.0/src/googletest-1.8.0/googletest/include  -std=c++11 -Wformat-security -fstack-protector -fPIE   -o CMakeFiles/mesos-tests.dir/credentials_tests.cpp.o -c /mesos/src/tests/credentials_tests.cpp
[ 85%] Building CXX object src/tests/CMakeFiles/mesos-tests.dir/default_executor_tests.cpp.o
cd /mesos/build/src/tests && /usr/bin/g++  -DBUILD_DIR=\"/mesos/build\" -DBUILD_FLAGS=\"\" -DBUILD_JAVA_JVM_LIBRARY=\"\" -DHAS_AUTHENTICATION=1 -DHAVE_LIBZ -DLIBDIR=\"/usr/local/libmesos\" -DPICOJSON_USE_INT64 -DPKGDATADIR=\"/usr/local/share/mesos\" -DPKGLIBEXECDIR=\"/usr/local/libexec/mesos\" -DPKGMODULEDIR=\"\" -DSBINDIR=\"\" -DSOURCE_DIR=\"/mesos\" -DTESTLIBEXECDIR=\"\" -DUSE_CMAKE_BUILD_CONFIG -DUSE_SSL_SOCKET=1 -DUSE_STATIC_LIB -DVERSION=\"1.5.0\" -DZOOKEEPER_VERSION=\"3.4.8\" -D__STDC_FORMAT_MACROS -I/mesos/include -I/mesos/build/include -I/mesos/build/include/mesos -I/mesos/build/src -I/mesos/src -I/mesos/3rdparty/libprocess/src/../include -I/mesos/3rdparty/stout/include -isystem /usr/include/apr-1.0 -isystem /mesos/build/3rdparty/boost-1.53.0/src/boost-1.53.0 -isystem /mesos/build/3rdparty/elfio-3.2/src/elfio-3.2 -isystem /mesos/build/3rdparty/glog-0.3.3/src/glog-0.3.3-build/include -isystem /mesos/build/3rdparty/picojson-1.3.0/src/picojson-1.3.0 -isystem /mesos/build/3rdparty/protobuf-3.3.0/src/protobuf-3.3.0/src -isystem /usr/include/subversion-1 -isystem /mesos/build/3rdparty/http_parser-2.6.2/src/http_parser-2.6.2 -isystem /mesos/build/3rdparty/zookeeper-3.4.8/src/zookeeper-3.4.8/src/c/include -isystem /mesos/build/3rdparty/zookeeper-3.4.8/src/zookeeper-3.4.8/src/c/generated -isystem /mesos/build/3rdparty/nvml-352.79/src/nvml-352.79 -isystem /mesos/build/3rdparty/leveldb-1.19/src/leveldb-1.19/include -isystem /mesos/build/3rdparty/googletest-1.8.0/src/googletest-1.8.0/googlemock/include -isystem /mesos/build/3rdparty/googletest-1.8.0/src/googletest-1.8.0/googletest/include  -std=c++11 -Wformat-security -fstack-protector -fPIE   -o CMakeFiles/mesos-tests.dir/default_executor_tests.cpp.o -c /mesos/src/tests/default_executor_tests.cpp
[ 85%] Building CXX object src/tests/CMakeFiles/mesos-tests.dir/exception_tests.cpp.o
cd /mesos/build/src/tests && /usr/bin/g++  -DBUILD_DIR=\"/mesos/build\" -DBUILD_FLAGS=\"\" -DBUILD_JAVA_JVM_LIBRARY=\"\" -DHAS_AUTHENTICATION=1 -DHAVE_LIBZ -DLIBDIR=\"/usr/local/libmesos\" -DPICOJSON_USE_INT64 -DPKGDATADIR=\"/usr/local/share/mesos\" -DPKGLIBEXECDIR=\"/usr/local/libexec/mesos\" -DPKGMODULEDIR=\"\" -DSBINDIR=\"\" -DSOURCE_DIR=\"/mesos\" -DTESTLIBEXECDIR=\"\" -DUSE_CMAKE_BUILD_CONFIG -DUSE_SSL_SOCKET=1 -DUSE_STATIC_LIB -DVERSION=\"1.5.0\" -DZOOKEEPER_VERSION=\"3.4.8\" -D__STDC_FORMAT_MACROS -I/mesos/include -I/mesos/build/include -I/mesos/build/include/mesos -I/mesos/build/src -I/mesos/src -I/mesos/3rdparty/libprocess/src/../include -I/mesos/3rdparty/stout/include -isystem /usr/include/apr-1.0 -isystem /mesos/build/3rdparty/boost-1.53.0/src/boost-1.53.0 -isystem /mesos/build/3rdparty/elfio-3.2/src/elfio-3.2 -isystem /mesos/build/3rdparty/glog-0.3.3/src/glog-0.3.3-build/include -isystem /mesos/build/3rdparty/picojson-1.3.0/src/picojson-1.3.0 -isystem /mesos/build/3rdparty/protobuf-3.3.0/src/protobuf-3.3.0/src -isystem /usr/include/subversion-1 -isystem /mesos/build/3rdparty/http_parser-2.6.2/src/http_parser-2.6.2 -isystem /mesos/build/3rdparty/zookeeper-3.4.8/src/zookeeper-3.4.8/src/c/include -isystem /mesos/build/3rdparty/zookeeper-3.4.8/src/zookeeper-3.4.8/src/c/generated -isystem /mesos/build/3rdparty/nvml-352.79/src/nvml-352.79 -isystem /mesos/build/3rdparty/leveldb-1.19/src/leveldb-1.19/include -isystem /mesos/build/3rdparty/googletest-1.8.0/src/googletest-1.8.0/googlemock/include -isystem /mesos/build/3rdparty/googletest-1.8.0/src/googletest-1.8.0/googletest/include  -std=c++11 -Wformat-security -fstack-protector -fPIE   -o CMakeFiles/mesos-tests.dir/exception_tests.cpp.o -c /mesos/src/tests/exception_tests.cpp
[ 85%] Building CXX object src/tests/CMakeFiles/mesos-tests.dir/executor_http_api_tests.cpp.o
cd /mesos/build/src/tests && /usr/bin/g++  -DBUILD_DIR=\"/mesos/build\" -DBUILD_FLAGS=\"\" -DBUILD_JAVA_JVM_LIBRARY=\"\" -DHAS_AUTHENTICATION=1 -DHAVE_LIBZ -DLIBDIR=\"/usr/local/libmesos\" -DPICOJSON_USE_INT64 -DPKGDATADIR=\"/usr/local/share/mesos\" -DPKGLIBEXECDIR=\"/usr/local/libexec/mesos\" -DPKGMODULEDIR=\"\" -DSBINDIR=\"\" -DSOURCE_DIR=\"/mesos\" -DTESTLIBEXECDIR=\"\" -DUSE_CMAKE_BUILD_CONFIG -DUSE_SSL_SOCKET=1 -DUSE_STATIC_LIB -DVERSION=\"1.5.0\" -DZOOKEEPER_VERSION=\"3.4.8\" -D__STDC_FORMAT_MACROS -I/mesos/include -I/mesos/build/include -I/mesos/build/include/mesos -I/mesos/build/src -I/mesos/src -I/mesos/3rdparty/libprocess/src/../include -I/mesos/3rdparty/stout/include -isystem /usr/include/apr-1.0 -isystem /mesos/build/3rdparty/boost-1.53.0/src/boost-1.53.0 -isystem /mesos/build/3rdparty/elfio-3.2/src/elfio-3.2 -isystem /mesos/build/3rdparty/glog-0.3.3/src/glog-0.3.3-build/include -isystem /mesos/build/3rdparty/picojson-1.3.0/src/picojson-1.3.0 -isystem /mesos/build/3rdparty/protobuf-3.3.0/src/protobuf-3.3.0/src -isystem /usr/include/subversion-1 -isystem /mesos/build/3rdparty/http_parser-2.6.2/src/http_parser-2.6.2 -isystem /mesos/build/3rdparty/zookeeper-3.4.8/src/zookeeper-3.4.8/src/c/include -isystem /mesos/build/3rdparty/zookeeper-3.4.8/src/zookeeper-3.4.8/src/c/generated -isystem /mesos/build/3rdparty/nvml-352.79/src/nvml-352.79 -isystem /mesos/build/3rdparty/leveldb-1.19/src/leveldb-1.19/include -isystem /mesos/build/3rdparty/googletest-1.8.0/src/googletest-1.8.0/googlemock/include -isystem /mesos/build/3rdparty/googletest-1.8.0/src/googletest-1.8.0/googletest/include  -std=c++11 -Wformat-security -fstack-protector -fPIE   -o CMakeFiles/mesos-tests.dir/executor_http_api_tests.cpp.o -c /mesos/src/tests/executor_http_api_tests.cpp
[ 85%] Building CXX object src/tests/CMakeFiles/mesos-tests.dir/fault_tolerance_tests.cpp.o
cd /mesos/build/src/tests && /usr/bin/g++  -DBUILD_DIR=\"/mesos/build\" -DBUILD_FLAGS=\"\" -DBUILD_JAVA_JVM_LIBRARY=\"\" -DHAS_AUTHENTICATION=1 -DHAVE_LIBZ -DLIBDIR=\"/usr/local/libmesos\" -DPICOJSON_USE_INT64 -DPKGDATADIR=\"/usr/local/share/mesos\" -DPKGLIBEXECDIR=\"/usr/local/libexec/mesos\" -DPKGMODULEDIR=\"\" -DSBINDIR=\"\" -DSOURCE_DIR=\"/mesos\" -DTESTLIBEXECDIR=\"\" -DUSE_CMAKE_BUILD_CONFIG -DUSE_SSL_SOCKET=1 -DUSE_STATIC_LIB -DVERSION=\"1.5.0\" -DZOOKEEPER_VERSION=\"3.4.8\" -D__STDC_FORMAT_MACROS -I/mesos/include -I/mesos/build/include -I/mesos/build/include/mesos -I/mesos/build/src -I/mesos/src -I/mesos/3rdparty/libprocess/src/../include -I/mesos/3rdparty/stout/include -isystem /usr/include/apr-1.0 -isystem /mesos/build/3rdparty/boost-1.53.0/src/boost-1.53.0 -isystem /mesos/build/3rdparty/elfio-3.2/src/elfio-3.2 -isystem /mesos/build/3rdparty/glog-0.3.3/src/glog-0.3.3-build/include -isystem /mesos/build/3rdparty/picojson-1.3.0/src/picojson-1.3.0 -isystem /mesos/build/3rdparty/protobuf-3.3.0/src/protobuf-3.3.0/src -isystem /usr/include/subversion-1 -isystem /mesos/build/3rdparty/http_parser-2.6.2/src/http_parser-2.6.2 -isystem /mesos/build/3rdparty/zookeeper-3.4.8/src/zookeeper-3.4.8/src/c/include -isystem /mesos/build/3rdparty/zookeeper-3.4.8/src/zookeeper-3.4.8/src/c/generated -isystem /mesos/build/3rdparty/nvml-352.79/src/nvml-352.79 -isystem /mesos/build/3rdparty/leveldb-1.19/src/leveldb-1.19/include -isystem /mesos/build/3rdparty/googletest-1.8.0/src/googletest-1.8.0/googlemock/include -isystem /mesos/build/3rdparty/googletest-1.8.0/src/googletest-1.8.0/googletest/include  -std=c++11 -Wformat-security -fstack-protector -fPIE   -o CMakeFiles/mesos-tests.dir/fault_tolerance_tests.cpp.o -c /mesos/src/tests/fault_tolerance_tests.cpp
[ 86%] Building CXX object src/tests/CMakeFiles/mesos-tests.dir/fetcher_tests.cpp.o
cd /mesos/build/src/tests && /usr/bin/g++  -DBUILD_DIR=\"/mesos/build\" -DBUILD_FLAGS=\"\" -DBUILD_JAVA_JVM_LIBRARY=\"\" -DHAS_AUTHENTICATION=1 -DHAVE_LIBZ -DLIBDIR=\"/usr/local/libmesos\" -DPICOJSON_USE_INT64 -DPKGDATADIR=\"/usr/local/share/mesos\" -DPKGLIBEXECDIR=\"/usr/local/libexec/mesos\" -DPKGMODULEDIR=\"\" -DSBINDIR=\"\" -DSOURCE_DIR=\"/mesos\" -DTESTLIBEXECDIR=\"\" -DUSE_CMAKE_BUILD_CONFIG -DUSE_SSL_SOCKET=1 -DUSE_STATIC_LIB -DVERSION=\"1.5.0\" -DZOOKEEPER_VERSION=\"3.4.8\" -D__STDC_FORMAT_MACROS -I/mesos/include -I/mesos/build/include -I/mesos/build/include/mesos -I/mesos/build/src -I/mesos/src -I/mesos/3rdparty/libprocess/src/../include -I/mesos/3rdparty/stout/include -isystem /usr/include/apr-1.0 -isystem /mesos/build/3rdparty/boost-1.53.0/src/boost-1.53.0 -isystem /mesos/build/3rdparty/elfio-3.2/src/elfio-3.2 -isystem /mesos/build/3rdparty/glog-0.3.3/src/glog-0.3.3-build/include -isystem /mesos/build/3rdparty/picojson-1.3.0/src/picojson-1.3.0 -isystem /mesos/build/3rdparty/protobuf-3.3.0/src/protobuf-3.3.0/src -isystem /usr/include/subversion-1 -isystem /mesos/build/3rdparty/http_parser-2.6.2/src/http_parser-2.6.2 -isystem /mesos/build/3rdparty/zookeeper-3.4.8/src/zookeeper-3.4.8/src/c/include -isystem /mesos/build/3rdparty/zookeeper-3.4.8/src/zookeeper-3.4.8/src/c/generated -isystem /mesos/build/3rdparty/nvml-352.79/src/nvml-352.79 -isystem /mesos/build/3rdparty/leveldb-1.19/src/leveldb-1.19/include -isystem /mesos/build/3rdparty/googletest-1.8.0/src/googletest-1.8.0/googlemock/include -isystem /mesos/build/3rdparty/googletest-1.8.0/src/googletest-1.8.0/googletest/include  -std=c++11 -Wformat-security -fstack-protector -fPIE   -o CMakeFiles/mesos-tests.dir/fetcher_tests.cpp.o -c /mesos/src/tests/fetcher_tests.cpp
[ 86%] Building CXX object src/tests/CMakeFiles/mesos-tests.dir/files_tests.cpp.o
cd /mesos/build/src/tests && /usr/bin/g++  -DBUILD_DIR=\"/mesos/build\" -DBUILD_FLAGS=\"\" -DBUILD_JAVA_JVM_LIBRARY=\"\" -DHAS_AUTHENTICATION=1 -DHAVE_LIBZ -DLIBDIR=\"/usr/local/libmesos\" -DPICOJSON_USE_INT64 -DPKGDATADIR=\"/usr/local/share/mesos\" -DPKGLIBEXECDIR=\"/usr/local/libexec/mesos\" -DPKGMODULEDIR=\"\" -DSBINDIR=\"\" -DSOURCE_DIR=\"/mesos\" -DTESTLIBEXECDIR=\"\" -DUSE_CMAKE_BUILD_CONFIG -DUSE_SSL_SOCKET=1 -DUSE_STATIC_LIB -DVERSION=\"1.5.0\" -DZOOKEEPER_VERSION=\"3.4.8\" -D__STDC_FORMAT_MACROS -I/mesos/include -I/mesos/build/include -I/mesos/build/include/mesos -I/mesos/build/src -I/mesos/src -I/mesos/3rdparty/libprocess/src/../include -I/mesos/3rdparty/stout/include -isystem /usr/include/apr-1.0 -isystem /mesos/build/3rdparty/boost-1.53.0/src/boost-1.53.0 -isystem /mesos/build/3rdparty/elfio-3.2/src/elfio-3.2 -isystem /mesos/build/3rdparty/glog-0.3.3/src/glog-0.3.3-build/include -isystem /mesos/build/3rdparty/picojson-1.3.0/src/picojson-1.3.0 -isystem /mesos/build/3rdparty/protobuf-3.3.0/src/protobuf-3.3.0/src -isystem /usr/include/subversion-1 -isystem /mesos/build/3rdparty/http_parser-2.6.2/src/http_parser-2.6.2 -isystem /mesos/build/3rdparty/zookeeper-3.4.8/src/zookeeper-3.4.8/src/c/include -isystem /mesos/build/3rdparty/zookeeper-3.4.8/src/zookeeper-3.4.8/src/c/generated -isystem /mesos/build/3rdparty/nvml-352.79/src/nvml-352.79 -isystem /mesos/build/3rdparty/leveldb-1.19/src/leveldb-1.19/include -isystem /mesos/build/3rdparty/googletest-1.8.0/src/googletest-1.8.0/googlemock/include -isystem /mesos/build/3rdparty/googletest-1.8.0/src/googletest-1.8.0/googletest/include  -std=c++11 -Wformat-security -fstack-protector -fPIE   -o CMakeFiles/mesos-tests.dir/files_tests.cpp.o -c /mesos/src/tests/files_tests.cpp
[ 86%] Building CXX object src/tests/CMakeFiles/mesos-tests.dir/gc_tests.cpp.o
cd /mesos/build/src/tests && /usr/bin/g++  -DBUILD_DIR=\"/mesos/build\" -DBUILD_FLAGS=\"\" -DBUILD_JAVA_JVM_LIBRARY=\"\" -DHAS_AUTHENTICATION=1 -DHAVE_LIBZ -DLIBDIR=\"/usr/local/libmesos\" -DPICOJSON_USE_INT64 -DPKGDATADIR=\"/usr/local/share/mesos\" -DPKGLIBEXECDIR=\"/usr/local/libexec/mesos\" -DPKGMODULEDIR=\"\" -DSBINDIR=\"\" -DSOURCE_DIR=\"/mesos\" -DTESTLIBEXECDIR=\"\" -DUSE_CMAKE_BUILD_CONFIG -DUSE_SSL_SOCKET=1 -DUSE_STATIC_LIB -DVERSION=\"1.5.0\" -DZOOKEEPER_VERSION=\"3.4.8\" -D__STDC_FORMAT_MACROS -I/mesos/include -I/mesos/build/include -I/mesos/build/include/mesos -I/mesos/build/src -I/mesos/src -I/mesos/3rdparty/libprocess/src/../include -I/mesos/3rdparty/stout/include -isystem /usr/include/apr-1.0 -isystem /mesos/build/3rdparty/boost-1.53.0/src/boost-1.53.0 -isystem /mesos/build/3rdparty/elfio-3.2/src/elfio-3.2 -isystem /mesos/build/3rdparty/glog-0.3.3/src/glog-0.3.3-build/include -isystem /mesos/build/3rdparty/picojson-1.3.0/src/picojson-1.3.0 -isystem /mesos/build/3rdparty/protobuf-3.3.0/src/protobuf-3.3.0/src -isystem /usr/include/subversion-1 -isystem /mesos/build/3rdparty/http_parser-2.6.2/src/http_parser-2.6.2 -isystem /mesos/build/3rdparty/zookeeper-3.4.8/src/zookeeper-3.4.8/src/c/include -isystem /mesos/build/3rdparty/zookeeper-3.4.8/src/zookeeper-3.4.8/src/c/generated -isystem /mesos/build/3rdparty/nvml-352.79/src/nvml-352.79 -isystem /mesos/build/3rdparty/leveldb-1.19/src/leveldb-1.19/include -isystem /mesos/build/3rdparty/googletest-1.8.0/src/googletest-1.8.0/googlemock/include -isystem /mesos/build/3rdparty/googletest-1.8.0/src/googletest-1.8.0/googletest/include  -std=c++11 -Wformat-security -fstack-protector -fPIE   -o CMakeFiles/mesos-tests.dir/gc_tests.cpp.o -c /mesos/src/tests/gc_tests.cpp
[ 86%] Building CXX object src/tests/CMakeFiles/mesos-tests.dir/health_check_tests.cpp.o
cd /mesos/build/src/tests && /usr/bin/g++  -DBUILD_DIR=\"/mesos/build\" -DBUILD_FLAGS=\"\" -DBUILD_JAVA_JVM_LIBRARY=\"\" -DHAS_AUTHENTICATION=1 -DHAVE_LIBZ -DLIBDIR=\"/usr/local/libmesos\" -DPICOJSON_USE_INT64 -DPKGDATADIR=\"/usr/local/share/mesos\" -DPKGLIBEXECDIR=\"/usr/local/libexec/mesos\" -DPKGMODULEDIR=\"\" -DSBINDIR=\"\" -DSOURCE_DIR=\"/mesos\" -DTESTLIBEXECDIR=\"\" -DUSE_CMAKE_BUILD_CONFIG -DUSE_SSL_SOCKET=1 -DUSE_STATIC_LIB -DVERSION=\"1.5.0\" -DZOOKEEPER_VERSION=\"3.4.8\" -D__STDC_FORMAT_MACROS -I/mesos/include -I/mesos/build/include -I/mesos/build/include/mesos -I/mesos/build/src -I/mesos/src -I/mesos/3rdparty/libprocess/src/../include -I/mesos/3rdparty/stout/include -isystem /usr/include/apr-1.0 -isystem /mesos/build/3rdparty/boost-1.53.0/src/boost-1.53.0 -isystem /mesos/build/3rdparty/elfio-3.2/src/elfio-3.2 -isystem /mesos/build/3rdparty/glog-0.3.3/src/glog-0.3.3-build/include -isystem /mesos/build/3rdparty/picojson-1.3.0/src/picojson-1.3.0 -isystem /mesos/build/3rdparty/protobuf-3.3.0/src/protobuf-3.3.0/src -isystem /usr/include/subversion-1 -isystem /mesos/build/3rdparty/http_parser-2.6.2/src/http_parser-2.6.2 -isystem /mesos/build/3rdparty/zookeeper-3.4.8/src/zookeeper-3.4.8/src/c/include -isystem /mesos/build/3rdparty/zookeeper-3.4.8/src/zookeeper-3.4.8/src/c/generated -isystem /mesos/build/3rdparty/nvml-352.79/src/nvml-352.79 -isystem /mesos/build/3rdparty/leveldb-1.19/src/leveldb-1.19/include -isystem /mesos/build/3rdparty/googletest-1.8.0/src/googletest-1.8.0/googlemock/include -isystem /mesos/build/3rdparty/googletest-1.8.0/src/googletest-1.8.0/googletest/include  -std=c++11 -Wformat-security -fstack-protector -fPIE   -o CMakeFiles/mesos-tests.dir/health_check_tests.cpp.o -c /mesos/src/tests/health_check_tests.cpp
[ 86%] Building CXX object src/tests/CMakeFiles/mesos-tests.dir/hierarchical_allocator_tests.cpp.o
cd /mesos/build/src/tests && /usr/bin/g++  -DBUILD_DIR=\"/mesos/build\" -DBUILD_FLAGS=\"\" -DBUILD_JAVA_JVM_LIBRARY=\"\" -DHAS_AUTHENTICATION=1 -DHAVE_LIBZ -DLIBDIR=\"/usr/local/libmesos\" -DPICOJSON_USE_INT64 -DPKGDATADIR=\"/usr/local/share/mesos\" -DPKGLIBEXECDIR=\"/usr/local/libexec/mesos\" -DPKGMODULEDIR=\"\" -DSBINDIR=\"\" -DSOURCE_DIR=\"/mesos\" -DTESTLIBEXECDIR=\"\" -DUSE_CMAKE_BUILD_CONFIG -DUSE_SSL_SOCKET=1 -DUSE_STATIC_LIB -DVERSION=\"1.5.0\" -DZOOKEEPER_VERSION=\"3.4.8\" -D__STDC_FORMAT_MACROS -I/mesos/include -I/mesos/build/include -I/mesos/build/include/mesos -I/mesos/build/src -I/mesos/src -I/mesos/3rdparty/libprocess/src/../include -I/mesos/3rdparty/stout/include -isystem /usr/include/apr-1.0 -isystem /mesos/build/3rdparty/boost-1.53.0/src/boost-1.53.0 -isystem /mesos/build/3rdparty/elfio-3.2/src/elfio-3.2 -isystem /mesos/build/3rdparty/glog-0.3.3/src/glog-0.3.3-build/include -isystem /mesos/build/3rdparty/picojson-1.3.0/src/picojson-1.3.0 -isystem /mesos/build/3rdparty/protobuf-3.3.0/src/protobuf-3.3.0/src -isystem /usr/include/subversion-1 -isystem /mesos/build/3rdparty/http_parser-2.6.2/src/http_parser-2.6.2 -isystem /mesos/build/3rdparty/zookeeper-3.4.8/src/zookeeper-3.4.8/src/c/include -isystem /mesos/build/3rdparty/zookeeper-3.4.8/src/zookeeper-3.4.8/src/c/generated -isystem /mesos/build/3rdparty/nvml-352.79/src/nvml-352.79 -isystem /mesos/build/3rdparty/leveldb-1.19/src/leveldb-1.19/include -isystem /mesos/build/3rdparty/googletest-1.8.0/src/googletest-1.8.0/googlemock/include -isystem /mesos/build/3rdparty/googletest-1.8.0/src/googletest-1.8.0/googletest/include  -std=c++11 -Wformat-security -fstack-protector -fPIE   -o CMakeFiles/mesos-tests.dir/hierarchical_allocator_tests.cpp.o -c /mesos/src/tests/hierarchical_allocator_tests.cpp
[ 86%] Building CXX object src/tests/CMakeFiles/mesos-tests.dir/hook_tests.cpp.o
cd /mesos/build/src/tests && /usr/bin/g++  -DBUILD_DIR=\"/mesos/build\" -DBUILD_FLAGS=\"\" -DBUILD_JAVA_JVM_LIBRARY=\"\" -DHAS_AUTHENTICATION=1 -DHAVE_LIBZ -DLIBDIR=\"/usr/local/libmesos\" -DPICOJSON_USE_INT64 -DPKGDATADIR=\"/usr/local/share/mesos\" -DPKGLIBEXECDIR=\"/usr/local/libexec/mesos\" -DPKGMODULEDIR=\"\" -DSBINDIR=\"\" -DSOURCE_DIR=\"/mesos\" -DTESTLIBEXECDIR=\"\" -DUSE_CMAKE_BUILD_CONFIG -DUSE_SSL_SOCKET=1 -DUSE_STATIC_LIB -DVERSION=\"1.5.0\" -DZOOKEEPER_VERSION=\"3.4.8\" -D__STDC_FORMAT_MACROS -I/mesos/include -I/mesos/build/include -I/mesos/build/include/mesos -I/mesos/build/src -I/mesos/src -I/mesos/3rdparty/libprocess/src/../include -I/mesos/3rdparty/stout/include -isystem /usr/include/apr-1.0 -isystem /mesos/build/3rdparty/boost-1.53.0/src/boost-1.53.0 -isystem /mesos/build/3rdparty/elfio-3.2/src/elfio-3.2 -isystem /mesos/build/3rdparty/glog-0.3.3/src/glog-0.3.3-build/include -isystem /mesos/build/3rdparty/picojson-1.3.0/src/picojson-1.3.0 -isystem /mesos/build/3rdparty/protobuf-3.3.0/src/protobuf-3.3.0/src -isystem /usr/include/subversion-1 -isystem /mesos/build/3rdparty/http_parser-2.6.2/src/http_parser-2.6.2 -isystem /mesos/build/3rdparty/zookeeper-3.4.8/src/zookeeper-3.4.8/src/c/include -isystem /mesos/build/3rdparty/zookeeper-3.4.8/src/zookeeper-3.4.8/src/c/generated -isystem /mesos/build/3rdparty/nvml-352.79/src/nvml-352.79 -isystem /mesos/build/3rdparty/leveldb-1.19/src/leveldb-1.19/include -isystem /mesos/build/3rdparty/googletest-1.8.0/src/googletest-1.8.0/googlemock/include -isystem /mesos/build/3rdparty/googletest-1.8.0/src/googletest-1.8.0/googletest/include  -std=c++11 -Wformat-security -fstack-protector -fPIE   -o CMakeFiles/mesos-tests.dir/hook_tests.cpp.o -c /mesos/src/tests/hook_tests.cpp
[ 86%] Building CXX object src/tests/CMakeFiles/mesos-tests.dir/http_authentication_tests.cpp.o
cd /mesos/build/src/tests && /usr/bin/g++  -DBUILD_DIR=\"/mesos/build\" -DBUILD_FLAGS=\"\" -DBUILD_JAVA_JVM_LIBRARY=\"\" -DHAS_AUTHENTICATION=1 -DHAVE_LIBZ -DLIBDIR=\"/usr/local/libmesos\" -DPICOJSON_USE_INT64 -DPKGDATADIR=\"/usr/local/share/mesos\" -DPKGLIBEXECDIR=\"/usr/local/libexec/mesos\" -DPKGMODULEDIR=\"\" -DSBINDIR=\"\" -DSOURCE_DIR=\"/mesos\" -DTESTLIBEXECDIR=\"\" -DUSE_CMAKE_BUILD_CONFIG -DUSE_SSL_SOCKET=1 -DUSE_STATIC_LIB -DVERSION=\"1.5.0\" -DZOOKEEPER_VERSION=\"3.4.8\" -D__STDC_FORMAT_MACROS -I/mesos/include -I/mesos/build/include -I/mesos/build/include/mesos -I/mesos/build/src -I/mesos/src -I/mesos/3rdparty/libprocess/src/../include -I/mesos/3rdparty/stout/include -isystem /usr/include/apr-1.0 -isystem /mesos/build/3rdparty/boost-1.53.0/src/boost-1.53.0 -isystem /mesos/build/3rdparty/elfio-3.2/src/elfio-3.2 -isystem /mesos/build/3rdparty/glog-0.3.3/src/glog-0.3.3-build/include -isystem /mesos/build/3rdparty/picojson-1.3.0/src/picojson-1.3.0 -isystem /mesos/build/3rdparty/protobuf-3.3.0/src/protobuf-3.3.0/src -isystem /usr/include/subversion-1 -isystem /mesos/build/3rdparty/http_parser-2.6.2/src/http_parser-2.6.2 -isystem /mesos/build/3rdparty/zookeeper-3.4.8/src/zookeeper-3.4.8/src/c/include -isystem /mesos/build/3rdparty/zookeeper-3.4.8/src/zookeeper-3.4.8/src/c/generated -isystem /mesos/build/3rdparty/nvml-352.79/src/nvml-352.79 -isystem /mesos/build/3rdparty/leveldb-1.19/src/leveldb-1.19/include -isystem /mesos/build/3rdparty/googletest-1.8.0/src/googletest-1.8.0/googlemock/include -isystem /mesos/build/3rdparty/googletest-1.8.0/src/googletest-1.8.0/googletest/include  -std=c++11 -Wformat-security -fstack-protector -fPIE   -o CMakeFiles/mesos-tests.dir/http_authentication_tests.cpp.o -c /mesos/src/tests/http_authentication_tests.cpp
[ 87%] Building CXX object src/tests/CMakeFiles/mesos-tests.dir/http_fault_tolerance_tests.cpp.o
cd /mesos/build/src/tests && /usr/bin/g++  -DBUILD_DIR=\"/mesos/build\" -DBUILD_FLAGS=\"\" -DBUILD_JAVA_JVM_LIBRARY=\"\" -DHAS_AUTHENTICATION=1 -DHAVE_LIBZ -DLIBDIR=\"/usr/local/libmesos\" -DPICOJSON_USE_INT64 -DPKGDATADIR=\"/usr/local/share/mesos\" -DPKGLIBEXECDIR=\"/usr/local/libexec/mesos\" -DPKGMODULEDIR=\"\" -DSBINDIR=\"\" -DSOURCE_DIR=\"/mesos\" -DTESTLIBEXECDIR=\"\" -DUSE_CMAKE_BUILD_CONFIG -DUSE_SSL_SOCKET=1 -DUSE_STATIC_LIB -DVERSION=\"1.5.0\" -DZOOKEEPER_VERSION=\"3.4.8\" -D__STDC_FORMAT_MACROS -I/mesos/include -I/mesos/build/include -I/mesos/build/include/mesos -I/mesos/build/src -I/mesos/src -I/mesos/3rdparty/libprocess/src/../include -I/mesos/3rdparty/stout/include -isystem /usr/include/apr-1.0 -isystem /mesos/build/3rdparty/boost-1.53.0/src/boost-1.53.0 -isystem /mesos/build/3rdparty/elfio-3.2/src/elfio-3.2 -isystem /mesos/build/3rdparty/glog-0.3.3/src/glog-0.3.3-build/include -isystem /mesos/build/3rdparty/picojson-1.3.0/src/picojson-1.3.0 -isystem /mesos/build/3rdparty/protobuf-3.3.0/src/protobuf-3.3.0/src -isystem /usr/include/subversion-1 -isystem /mesos/build/3rdparty/http_parser-2.6.2/src/http_parser-2.6.2 -isystem /mesos/build/3rdparty/zookeeper-3.4.8/src/zookeeper-3.4.8/src/c/include -isystem /mesos/build/3rdparty/zookeeper-3.4.8/src/zookeeper-3.4.8/src/c/generated -isystem /mesos/build/3rdparty/nvml-352.79/src/nvml-352.79 -isystem /mesos/build/3rdparty/leveldb-1.19/src/leveldb-1.19/include -isystem /mesos/build/3rdparty/googletest-1.8.0/src/googletest-1.8.0/googlemock/include -isystem /mesos/build/3rdparty/googletest-1.8.0/src/googletest-1.8.0/googletest/include  -std=c++11 -Wformat-security -fstack-protector -fPIE   -o CMakeFiles/mesos-tests.dir/http_fault_tolerance_tests.cpp.o -c /mesos/src/tests/http_fault_tolerance_tests.cpp
[ 87%] Building CXX object src/tests/CMakeFiles/mesos-tests.dir/master_maintenance_tests.cpp.o
cd /mesos/build/src/tests && /usr/bin/g++  -DBUILD_DIR=\"/mesos/build\" -DBUILD_FLAGS=\"\" -DBUILD_JAVA_JVM_LIBRARY=\"\" -DHAS_AUTHENTICATION=1 -DHAVE_LIBZ -DLIBDIR=\"/usr/local/libmesos\" -DPICOJSON_USE_INT64 -DPKGDATADIR=\"/usr/local/share/mesos\" -DPKGLIBEXECDIR=\"/usr/local/libexec/mesos\" -DPKGMODULEDIR=\"\" -DSBINDIR=\"\" -DSOURCE_DIR=\"/mesos\" -DTESTLIBEXECDIR=\"\" -DUSE_CMAKE_BUILD_CONFIG -DUSE_SSL_SOCKET=1 -DUSE_STATIC_LIB -DVERSION=\"1.5.0\" -DZOOKEEPER_VERSION=\"3.4.8\" -D__STDC_FORMAT_MACROS -I/mesos/include -I/mesos/build/include -I/mesos/build/include/mesos -I/mesos/build/src -I/mesos/src -I/mesos/3rdparty/libprocess/src/../include -I/mesos/3rdparty/stout/include -isystem /usr/include/apr-1.0 -isystem /mesos/build/3rdparty/boost-1.53.0/src/boost-1.53.0 -isystem /mesos/build/3rdparty/elfio-3.2/src/elfio-3.2 -isystem /mesos/build/3rdparty/glog-0.3.3/src/glog-0.3.3-build/include -isystem /mesos/build/3rdparty/picojson-1.3.0/src/picojson-1.3.0 -isystem /mesos/build/3rdparty/protobuf-3.3.0/src/protobuf-3.3.0/src -isystem /usr/include/subversion-1 -isystem /mesos/build/3rdparty/http_parser-2.6.2/src/http_parser-2.6.2 -isystem /mesos/build/3rdparty/zookeeper-3.4.8/src/zookeeper-3.4.8/src/c/include -isystem /mesos/build/3rdparty/zookeeper-3.4.8/src/zookeeper-3.4.8/src/c/generated -isystem /mesos/build/3rdparty/nvml-352.79/src/nvml-352.79 -isystem /mesos/build/3rdparty/leveldb-1.19/src/leveldb-1.19/include -isystem /mesos/build/3rdparty/googletest-1.8.0/src/googletest-1.8.0/googlemock/include -isystem /mesos/build/3rdparty/googletest-1.8.0/src/googletest-1.8.0/googletest/include  -std=c++11 -Wformat-security -fstack-protector -fPIE   -o CMakeFiles/mesos-tests.dir/master_maintenance_tests.cpp.o -c /mesos/src/tests/master_maintenance_tests.cpp
[ 87%] Building CXX object src/tests/CMakeFiles/mesos-tests.dir/master_slave_reconciliation_tests.cpp.o
cd /mesos/build/src/tests && /usr/bin/g++  -DBUILD_DIR=\"/mesos/build\" -DBUILD_FLAGS=\"\" -DBUILD_JAVA_JVM_LIBRARY=\"\" -DHAS_AUTHENTICATION=1 -DHAVE_LIBZ -DLIBDIR=\"/usr/local/libmesos\" -DPICOJSON_USE_INT64 -DPKGDATADIR=\"/usr/local/share/mesos\" -DPKGLIBEXECDIR=\"/usr/local/libexec/mesos\" -DPKGMODULEDIR=\"\" -DSBINDIR=\"\" -DSOURCE_DIR=\"/mesos\" -DTESTLIBEXECDIR=\"\" -DUSE_CMAKE_BUILD_CONFIG -DUSE_SSL_SOCKET=1 -DUSE_STATIC_LIB -DVERSION=\"1.5.0\" -DZOOKEEPER_VERSION=\"3.4.8\" -D__STDC_FORMAT_MACROS -I/mesos/include -I/mesos/build/include -I/mesos/build/include/mesos -I/mesos/build/src -I/mesos/src -I/mesos/3rdparty/libprocess/src/../include -I/mesos/3rdparty/stout/include -isystem /usr/include/apr-1.0 -isystem /mesos/build/3rdparty/boost-1.53.0/src/boost-1.53.0 -isystem /mesos/build/3rdparty/elfio-3.2/src/elfio-3.2 -isystem /mesos/build/3rdparty/glog-0.3.3/src/glog-0.3.3-build/include -isystem /mesos/build/3rdparty/picojson-1.3.0/src/picojson-1.3.0 -isystem /mesos/build/3rdparty/protobuf-3.3.0/src/protobuf-3.3.0/src -isystem /usr/include/subversion-1 -isystem /mesos/build/3rdparty/http_parser-2.6.2/src/http_parser-2.6.2 -isystem /mesos/build/3rdparty/zookeeper-3.4.8/src/zookeeper-3.4.8/src/c/include -isystem /mesos/build/3rdparty/zookeeper-3.4.8/src/zookeeper-3.4.8/src/c/generated -isystem /mesos/build/3rdparty/nvml-352.79/src/nvml-352.79 -isystem /mesos/build/3rdparty/leveldb-1.19/src/leveldb-1.19/include -isystem /mesos/build/3rdparty/googletest-1.8.0/src/googletest-1.8.0/googlemock/include -isystem /mesos/build/3rdparty/googletest-1.8.0/src/googletest-1.8.0/googletest/include  -std=c++11 -Wformat-security -fstack-protector -fPIE   -o CMakeFiles/mesos-tests.dir/master_slave_reconciliation_tests.cpp.o -c /mesos/src/tests/master_slave_reconciliation_tests.cpp
[ 87%] Building CXX object src/tests/CMakeFiles/mesos-tests.dir/partition_tests.cpp.o
cd /mesos/build/src/tests && /usr/bin/g++  -DBUILD_DIR=\"/mesos/build\" -DBUILD_FLAGS=\"\" -DBUILD_JAVA_JVM_LIBRARY=\"\" -DHAS_AUTHENTICATION=1 -DHAVE_LIBZ -DLIBDIR=\"/usr/local/libmesos\" -DPICOJSON_USE_INT64 -DPKGDATADIR=\"/usr/local/share/mesos\" -DPKGLIBEXECDIR=\"/usr/local/libexec/mesos\" -DPKGMODULEDIR=\"\" -DSBINDIR=\"\" -DSOURCE_DIR=\"/mesos\" -DTESTLIBEXECDIR=\"\" -DUSE_CMAKE_BUILD_CONFIG -DUSE_SSL_SOCKET=1 -DUSE_STATIC_LIB -DVERSION=\"1.5.0\" -DZOOKEEPER_VERSION=\"3.4.8\" -D__STDC_FORMAT_MACROS -I/mesos/include -I/mesos/build/include -I/mesos/build/include/mesos -I/mesos/build/src -I/mesos/src -I/mesos/3rdparty/libprocess/src/../include -I/mesos/3rdparty/stout/include -isystem /usr/include/apr-1.0 -isystem /mesos/build/3rdparty/boost-1.53.0/src/boost-1.53.0 -isystem /mesos/build/3rdparty/elfio-3.2/src/elfio-3.2 -isystem /mesos/build/3rdparty/glog-0.3.3/src/glog-0.3.3-build/include -isystem /mesos/build/3rdparty/picojson-1.3.0/src/picojson-1.3.0 -isystem /mesos/build/3rdparty/protobuf-3.3.0/src/protobuf-3.3.0/src -isystem /usr/include/subversion-1 -isystem /mesos/build/3rdparty/http_parser-2.6.2/src/http_parser-2.6.2 -isystem /mesos/build/3rdparty/zookeeper-3.4.8/src/zookeeper-3.4.8/src/c/include -isystem /mesos/build/3rdparty/zookeeper-3.4.8/src/zookeeper-3.4.8/src/c/generated -isystem /mesos/build/3rdparty/nvml-352.79/src/nvml-352.79 -isystem /mesos/build/3rdparty/leveldb-1.19/src/leveldb-1.19/include -isystem /mesos/build/3rdparty/googletest-1.8.0/src/googletest-1.8.0/googlemock/include -isystem /mesos/build/3rdparty/googletest-1.8.0/src/googletest-1.8.0/googletest/include  -std=c++11 -Wformat-security -fstack-protector -fPIE   -o CMakeFiles/mesos-tests.dir/partition_tests.cpp.o -c /mesos/src/tests/partition_tests.cpp
[ 87%] Building CXX object src/tests/CMakeFiles/mesos-tests.dir/paths_tests.cpp.o
cd /mesos/build/src/tests && /usr/bin/g++  -DBUILD_DIR=\"/mesos/build\" -DBUILD_FLAGS=\"\" -DBUILD_JAVA_JVM_LIBRARY=\"\" -DHAS_AUTHENTICATION=1 -DHAVE_LIBZ -DLIBDIR=\"/usr/local/libmesos\" -DPICOJSON_USE_INT64 -DPKGDATADIR=\"/usr/local/share/mesos\" -DPKGLIBEXECDIR=\"/usr/local/libexec/mesos\" -DPKGMODULEDIR=\"\" -DSBINDIR=\"\" -DSOURCE_DIR=\"/mesos\" -DTESTLIBEXECDIR=\"\" -DUSE_CMAKE_BUILD_CONFIG -DUSE_SSL_SOCKET=1 -DUSE_STATIC_LIB -DVERSION=\"1.5.0\" -DZOOKEEPER_VERSION=\"3.4.8\" -D__STDC_FORMAT_MACROS -I/mesos/include -I/mesos/build/include -I/mesos/build/include/mesos -I/mesos/build/src -I/mesos/src -I/mesos/3rdparty/libprocess/src/../include -I/mesos/3rdparty/stout/include -isystem /usr/include/apr-1.0 -isystem /mesos/build/3rdparty/boost-1.53.0/src/boost-1.53.0 -isystem /mesos/build/3rdparty/elfio-3.2/src/elfio-3.2 -isystem /mesos/build/3rdparty/glog-0.3.3/src/glog-0.3.3-build/include -isystem /mesos/build/3rdparty/picojson-1.3.0/src/picojson-1.3.0 -isystem /mesos/build/3rdparty/protobuf-3.3.0/src/protobuf-3.3.0/src -isystem /usr/include/subversion-1 -isystem /mesos/build/3rdparty/http_parser-2.6.2/src/http_parser-2.6.2 -isystem /mesos/build/3rdparty/zookeeper-3.4.8/src/zookeeper-3.4.8/src/c/include -isystem /mesos/build/3rdparty/zookeeper-3.4.8/src/zookeeper-3.4.8/src/c/generated -isystem /mesos/build/3rdparty/nvml-352.79/src/nvml-352.79 -isystem /mesos/build/3rdparty/leveldb-1.19/src/leveldb-1.19/include -isystem /mesos/build/3rdparty/googletest-1.8.0/src/googletest-1.8.0/googlemock/include -isystem /mesos/build/3rdparty/googletest-1.8.0/src/googletest-1.8.0/googletest/include  -std=c++11 -Wformat-security -fstack-protector -fPIE   -o CMakeFiles/mesos-tests.dir/paths_tests.cpp.o -c /mesos/src/tests/paths_tests.cpp
[ 87%] Building CXX object src/tests/CMakeFiles/mesos-tests.dir/protobuf_io_tests.cpp.o
cd /mesos/build/src/tests && /usr/bin/g++  -DBUILD_DIR=\"/mesos/build\" -DBUILD_FLAGS=\"\" -DBUILD_JAVA_JVM_LIBRARY=\"\" -DHAS_AUTHENTICATION=1 -DHAVE_LIBZ -DLIBDIR=\"/usr/local/libmesos\" -DPICOJSON_USE_INT64 -DPKGDATADIR=\"/usr/local/share/mesos\" -DPKGLIBEXECDIR=\"/usr/local/libexec/mesos\" -DPKGMODULEDIR=\"\" -DSBINDIR=\"\" -DSOURCE_DIR=\"/mesos\" -DTESTLIBEXECDIR=\"\" -DUSE_CMAKE_BUILD_CONFIG -DUSE_SSL_SOCKET=1 -DUSE_STATIC_LIB -DVERSION=\"1.5.0\" -DZOOKEEPER_VERSION=\"3.4.8\" -D__STDC_FORMAT_MACROS -I/mesos/include -I/mesos/build/include -I/mesos/build/include/mesos -I/mesos/build/src -I/mesos/src -I/mesos/3rdparty/libprocess/src/../include -I/mesos/3rdparty/stout/include -isystem /usr/include/apr-1.0 -isystem /mesos/build/3rdparty/boost-1.53.0/src/boost-1.53.0 -isystem /mesos/build/3rdparty/elfio-3.2/src/elfio-3.2 -isystem /mesos/build/3rdparty/glog-0.3.3/src/glog-0.3.3-build/include -isystem /mesos/build/3rdparty/picojson-1.3.0/src/picojson-1.3.0 -isystem /mesos/build/3rdparty/protobuf-3.3.0/src/protobuf-3.3.0/src -isystem /usr/include/subversion-1 -isystem /mesos/build/3rdparty/http_parser-2.6.2/src/http_parser-2.6.2 -isystem /mesos/build/3rdparty/zookeeper-3.4.8/src/zookeeper-3.4.8/src/c/include -isystem /mesos/build/3rdparty/zookeeper-3.4.8/src/zookeeper-3.4.8/src/c/generated -isystem /mesos/build/3rdparty/nvml-352.79/src/nvml-352.79 -isystem /mesos/build/3rdparty/leveldb-1.19/src/leveldb-1.19/include -isystem /mesos/build/3rdparty/googletest-1.8.0/src/googletest-1.8.0/googlemock/include -isystem /mesos/build/3rdparty/googletest-1.8.0/src/googletest-1.8.0/googletest/include  -std=c++11 -Wformat-security -fstack-protector -fPIE   -o CMakeFiles/mesos-tests.dir/protobuf_io_tests.cpp.o -c /mesos/src/tests/protobuf_io_tests.cpp
[ 87%] Building CXX object src/tests/CMakeFiles/mesos-tests.dir/rate_limiting_tests.cpp.o
cd /mesos/build/src/tests && /usr/bin/g++  -DBUILD_DIR=\"/mesos/build\" -DBUILD_FLAGS=\"\" -DBUILD_JAVA_JVM_LIBRARY=\"\" -DHAS_AUTHENTICATION=1 -DHAVE_LIBZ -DLIBDIR=\"/usr/local/libmesos\" -DPICOJSON_USE_INT64 -DPKGDATADIR=\"/usr/local/share/mesos\" -DPKGLIBEXECDIR=\"/usr/local/libexec/mesos\" -DPKGMODULEDIR=\"\" -DSBINDIR=\"\" -DSOURCE_DIR=\"/mesos\" -DTESTLIBEXECDIR=\"\" -DUSE_CMAKE_BUILD_CONFIG -DUSE_SSL_SOCKET=1 -DUSE_STATIC_LIB -DVERSION=\"1.5.0\" -DZOOKEEPER_VERSION=\"3.4.8\" -D__STDC_FORMAT_MACROS -I/mesos/include -I/mesos/build/include -I/mesos/build/include/mesos -I/mesos/build/src -I/mesos/src -I/mesos/3rdparty/libprocess/src/../include -I/mesos/3rdparty/stout/include -isystem /usr/include/apr-1.0 -isystem /mesos/build/3rdparty/boost-1.53.0/src/boost-1.53.0 -isystem /mesos/build/3rdparty/elfio-3.2/src/elfio-3.2 -isystem /mesos/build/3rdparty/glog-0.3.3/src/glog-0.3.3-build/include -isystem /mesos/build/3rdparty/picojson-1.3.0/src/picojson-1.3.0 -isystem /mesos/build/3rdparty/protobuf-3.3.0/src/protobuf-3.3.0/src -isystem /usr/include/subversion-1 -isystem /mesos/build/3rdparty/http_parser-2.6.2/src/http_parser-2.6.2 -isystem /mesos/build/3rdparty/zookeeper-3.4.8/src/zookeeper-3.4.8/src/c/include -isystem /mesos/build/3rdparty/zookeeper-3.4.8/src/zookeeper-3.4.8/src/c/generated -isystem /mesos/build/3rdparty/nvml-352.79/src/nvml-352.79 -isystem /mesos/build/3rdparty/leveldb-1.19/src/leveldb-1.19/include -isystem /mesos/build/3rdparty/googletest-1.8.0/src/googletest-1.8.0/googlemock/include -isystem /mesos/build/3rdparty/googletest-1.8.0/src/googletest-1.8.0/googletest/include  -std=c++11 -Wformat-security -fstack-protector -fPIE   -o CMakeFiles/mesos-tests.dir/rate_limiting_tests.cpp.o -c /mesos/src/tests/rate_limiting_tests.cpp
[ 88%] Building CXX object src/tests/CMakeFiles/mesos-tests.dir/resource_offers_tests.cpp.o
cd /mesos/build/src/tests && /usr/bin/g++  -DBUILD_DIR=\"/mesos/build\" -DBUILD_FLAGS=\"\" -DBUILD_JAVA_JVM_LIBRARY=\"\" -DHAS_AUTHENTICATION=1 -DHAVE_LIBZ -DLIBDIR=\"/usr/local/libmesos\" -DPICOJSON_USE_INT64 -DPKGDATADIR=\"/usr/local/share/mesos\" -DPKGLIBEXECDIR=\"/usr/local/libexec/mesos\" -DPKGMODULEDIR=\"\" -DSBINDIR=\"\" -DSOURCE_DIR=\"/mesos\" -DTESTLIBEXECDIR=\"\" -DUSE_CMAKE_BUILD_CONFIG -DUSE_SSL_SOCKET=1 -DUSE_STATIC_LIB -DVERSION=\"1.5.0\" -DZOOKEEPER_VERSION=\"3.4.8\" -D__STDC_FORMAT_MACROS -I/mesos/include -I/mesos/build/include -I/mesos/build/include/mesos -I/mesos/build/src -I/mesos/src -I/mesos/3rdparty/libprocess/src/../include -I/mesos/3rdparty/stout/include -isystem /usr/include/apr-1.0 -isystem /mesos/build/3rdparty/boost-1.53.0/src/boost-1.53.0 -isystem /mesos/build/3rdparty/elfio-3.2/src/elfio-3.2 -isystem /mesos/build/3rdparty/glog-0.3.3/src/glog-0.3.3-build/include -isystem /mesos/build/3rdparty/picojson-1.3.0/src/picojson-1.3.0 -isystem /mesos/build/3rdparty/protobuf-3.3.0/src/protobuf-3.3.0/src -isystem /usr/include/subversion-1 -isystem /mesos/build/3rdparty/http_parser-2.6.2/src/http_parser-2.6.2 -isystem /mesos/build/3rdparty/zookeeper-3.4.8/src/zookeeper-3.4.8/src/c/include -isystem /mesos/build/3rdparty/zookeeper-3.4.8/src/zookeeper-3.4.8/src/c/generated -isystem /mesos/build/3rdparty/nvml-352.79/src/nvml-352.79 -isystem /mesos/build/3rdparty/leveldb-1.19/src/leveldb-1.19/include -isystem /mesos/build/3rdparty/googletest-1.8.0/src/googletest-1.8.0/googlemock/include -isystem /mesos/build/3rdparty/googletest-1.8.0/src/googletest-1.8.0/googletest/include  -std=c++11 -Wformat-security -fstack-protector -fPIE   -o CMakeFiles/mesos-tests.dir/resource_offers_tests.cpp.o -c /mesos/src/tests/resource_offers_tests.cpp
[ 88%] Building CXX object src/tests/CMakeFiles/mesos-tests.dir/resource_provider_manager_tests.cpp.o
cd /mesos/build/src/tests && /usr/bin/g++  -DBUILD_DIR=\"/mesos/build\" -DBUILD_FLAGS=\"\" -DBUILD_JAVA_JVM_LIBRARY=\"\" -DHAS_AUTHENTICATION=1 -DHAVE_LIBZ -DLIBDIR=\"/usr/local/libmesos\" -DPICOJSON_USE_INT64 -DPKGDATADIR=\"/usr/local/share/mesos\" -DPKGLIBEXECDIR=\"/usr/local/libexec/mesos\" -DPKGMODULEDIR=\"\" -DSBINDIR=\"\" -DSOURCE_DIR=\"/mesos\" -DTESTLIBEXECDIR=\"\" -DUSE_CMAKE_BUILD_CONFIG -DUSE_SSL_SOCKET=1 -DUSE_STATIC_LIB -DVERSION=\"1.5.0\" -DZOOKEEPER_VERSION=\"3.4.8\" -D__STDC_FORMAT_MACROS -I/mesos/include -I/mesos/build/include -I/mesos/build/include/mesos -I/mesos/build/src -I/mesos/src -I/mesos/3rdparty/libprocess/src/../include -I/mesos/3rdparty/stout/include -isystem /usr/include/apr-1.0 -isystem /mesos/build/3rdparty/boost-1.53.0/src/boost-1.53.0 -isystem /mesos/build/3rdparty/elfio-3.2/src/elfio-3.2 -isystem /mesos/build/3rdparty/glog-0.3.3/src/glog-0.3.3-build/include -isystem /mesos/build/3rdparty/picojson-1.3.0/src/picojson-1.3.0 -isystem /mesos/build/3rdparty/protobuf-3.3.0/src/protobuf-3.3.0/src -isystem /usr/include/subversion-1 -isystem /mesos/build/3rdparty/http_parser-2.6.2/src/http_parser-2.6.2 -isystem /mesos/build/3rdparty/zookeeper-3.4.8/src/zookeeper-3.4.8/src/c/include -isystem /mesos/build/3rdparty/zookeeper-3.4.8/src/zookeeper-3.4.8/src/c/generated -isystem /mesos/build/3rdparty/nvml-352.79/src/nvml-352.79 -isystem /mesos/build/3rdparty/leveldb-1.19/src/leveldb-1.19/include -isystem /mesos/build/3rdparty/googletest-1.8.0/src/googletest-1.8.0/googlemock/include -isystem /mesos/build/3rdparty/googletest-1.8.0/src/googletest-1.8.0/googletest/include  -std=c++11 -Wformat-security -fstack-protector -fPIE   -o CMakeFiles/mesos-tests.dir/resource_provider_manager_tests.cpp.o -c /mesos/src/tests/resource_provider_manager_tests.cpp
[ 88%] Building CXX object src/tests/CMakeFiles/mesos-tests.dir/resource_provider_validation_tests.cpp.o
cd /mesos/build/src/tests && /usr/bin/g++  -DBUILD_DIR=\"/mesos/build\" -DBUILD_FLAGS=\"\" -DBUILD_JAVA_JVM_LIBRARY=\"\" -DHAS_AUTHENTICATION=1 -DHAVE_LIBZ -DLIBDIR=\"/usr/local/libmesos\" -DPICOJSON_USE_INT64 -DPKGDATADIR=\"/usr/local/share/mesos\" -DPKGLIBEXECDIR=\"/usr/local/libexec/mesos\" -DPKGMODULEDIR=\"\" -DSBINDIR=\"\" -DSOURCE_DIR=\"/mesos\" -DTESTLIBEXECDIR=\"\" -DUSE_CMAKE_BUILD_CONFIG -DUSE_SSL_SOCKET=1 -DUSE_STATIC_LIB -DVERSION=\"1.5.0\" -DZOOKEEPER_VERSION=\"3.4.8\" -D__STDC_FORMAT_MACROS -I/mesos/include -I/mesos/build/include -I/mesos/build/include/mesos -I/mesos/build/src -I/mesos/src -I/mesos/3rdparty/libprocess/src/../include -I/mesos/3rdparty/stout/include -isystem /usr/include/apr-1.0 -isystem /mesos/build/3rdparty/boost-1.53.0/src/boost-1.53.0 -isystem /mesos/build/3rdparty/elfio-3.2/src/elfio-3.2 -isystem /mesos/build/3rdparty/glog-0.3.3/src/glog-0.3.3-build/include -isystem /mesos/build/3rdparty/picojson-1.3.0/src/picojson-1.3.0 -isystem /mesos/build/3rdparty/protobuf-3.3.0/src/protobuf-3.3.0/src -isystem /usr/include/subversion-1 -isystem /mesos/build/3rdparty/http_parser-2.6.2/src/http_parser-2.6.2 -isystem /mesos/build/3rdparty/zookeeper-3.4.8/src/zookeeper-3.4.8/src/c/include -isystem /mesos/build/3rdparty/zookeeper-3.4.8/src/zookeeper-3.4.8/src/c/generated -isystem /mesos/build/3rdparty/nvml-352.79/src/nvml-352.79 -isystem /mesos/build/3rdparty/leveldb-1.19/src/leveldb-1.19/include -isystem /mesos/build/3rdparty/googletest-1.8.0/src/googletest-1.8.0/googlemock/include -isystem /mesos/build/3rdparty/googletest-1.8.0/src/googletest-1.8.0/googletest/include  -std=c++11 -Wformat-security -fstack-protector -fPIE   -o CMakeFiles/mesos-tests.dir/resource_provider_validation_tests.cpp.o -c /mesos/src/tests/resource_provider_validation_tests.cpp
[ 88%] Building CXX object src/tests/CMakeFiles/mesos-tests.dir/resources_tests.cpp.o
cd /mesos/build/src/tests && /usr/bin/g++  -DBUILD_DIR=\"/mesos/build\" -DBUILD_FLAGS=\"\" -DBUILD_JAVA_JVM_LIBRARY=\"\" -DHAS_AUTHENTICATION=1 -DHAVE_LIBZ -DLIBDIR=\"/usr/local/libmesos\" -DPICOJSON_USE_INT64 -DPKGDATADIR=\"/usr/local/share/mesos\" -DPKGLIBEXECDIR=\"/usr/local/libexec/mesos\" -DPKGMODULEDIR=\"\" -DSBINDIR=\"\" -DSOURCE_DIR=\"/mesos\" -DTESTLIBEXECDIR=\"\" -DUSE_CMAKE_BUILD_CONFIG -DUSE_SSL_SOCKET=1 -DUSE_STATIC_LIB -DVERSION=\"1.5.0\" -DZOOKEEPER_VERSION=\"3.4.8\" -D__STDC_FORMAT_MACROS -I/mesos/include -I/mesos/build/include -I/mesos/build/include/mesos -I/mesos/build/src -I/mesos/src -I/mesos/3rdparty/libprocess/src/../include -I/mesos/3rdparty/stout/include -isystem /usr/include/apr-1.0 -isystem /mesos/build/3rdparty/boost-1.53.0/src/boost-1.53.0 -isystem /mesos/build/3rdparty/elfio-3.2/src/elfio-3.2 -isystem /mesos/build/3rdparty/glog-0.3.3/src/glog-0.3.3-build/include -isystem /mesos/build/3rdparty/picojson-1.3.0/src/picojson-1.3.0 -isystem /mesos/build/3rdparty/protobuf-3.3.0/src/protobuf-3.3.0/src -isystem /usr/include/subversion-1 -isystem /mesos/build/3rdparty/http_parser-2.6.2/src/http_parser-2.6.2 -isystem /mesos/build/3rdparty/zookeeper-3.4.8/src/zookeeper-3.4.8/src/c/include -isystem /mesos/build/3rdparty/zookeeper-3.4.8/src/zookeeper-3.4.8/src/c/generated -isystem /mesos/build/3rdparty/nvml-352.79/src/nvml-352.79 -isystem /mesos/build/3rdparty/leveldb-1.19/src/leveldb-1.19/include -isystem /mesos/build/3rdparty/googletest-1.8.0/src/googletest-1.8.0/googlemock/include -isystem /mesos/build/3rdparty/googletest-1.8.0/src/googletest-1.8.0/googletest/include  -std=c++11 -Wformat-security -fstack-protector -fPIE   -o CMakeFiles/mesos-tests.dir/resources_tests.cpp.o -c /mesos/src/tests/resources_tests.cpp
[ 88%] Building CXX object src/tests/CMakeFiles/mesos-tests.dir/role_tests.cpp.o
cd /mesos/build/src/tests && /usr/bin/g++  -DBUILD_DIR=\"/mesos/build\" -DBUILD_FLAGS=\"\" -DBUILD_JAVA_JVM_LIBRARY=\"\" -DHAS_AUTHENTICATION=1 -DHAVE_LIBZ -DLIBDIR=\"/usr/local/libmesos\" -DPICOJSON_USE_INT64 -DPKGDATADIR=\"/usr/local/share/mesos\" -DPKGLIBEXECDIR=\"/usr/local/libexec/mesos\" -DPKGMODULEDIR=\"\" -DSBINDIR=\"\" -DSOURCE_DIR=\"/mesos\" -DTESTLIBEXECDIR=\"\" -DUSE_CMAKE_BUILD_CONFIG -DUSE_SSL_SOCKET=1 -DUSE_STATIC_LIB -DVERSION=\"1.5.0\" -DZOOKEEPER_VERSION=\"3.4.8\" -D__STDC_FORMAT_MACROS -I/mesos/include -I/mesos/build/include -I/mesos/build/include/mesos -I/mesos/build/src -I/mesos/src -I/mesos/3rdparty/libprocess/src/../include -I/mesos/3rdparty/stout/include -isystem /usr/include/apr-1.0 -isystem /mesos/build/3rdparty/boost-1.53.0/src/boost-1.53.0 -isystem /mesos/build/3rdparty/elfio-3.2/src/elfio-3.2 -isystem /mesos/build/3rdparty/glog-0.3.3/src/glog-0.3.3-build/include -isystem /mesos/build/3rdparty/picojson-1.3.0/src/picojson-1.3.0 -isystem /mesos/build/3rdparty/protobuf-3.3.0/src/protobuf-3.3.0/src -isystem /usr/include/subversion-1 -isystem /mesos/build/3rdparty/http_parser-2.6.2/src/http_parser-2.6.2 -isystem /mesos/build/3rdparty/zookeeper-3.4.8/src/zookeeper-3.4.8/src/c/include -isystem /mesos/build/3rdparty/zookeeper-3.4.8/src/zookeeper-3.4.8/src/c/generated -isystem /mesos/build/3rdparty/nvml-352.79/src/nvml-352.79 -isystem /mesos/build/3rdparty/leveldb-1.19/src/leveldb-1.19/include -isystem /mesos/build/3rdparty/googletest-1.8.0/src/googletest-1.8.0/googlemock/include -isystem /mesos/build/3rdparty/googletest-1.8.0/src/googletest-1.8.0/googletest/include  -std=c++11 -Wformat-security -fstack-protector -fPIE   -o CMakeFiles/mesos-tests.dir/role_tests.cpp.o -c /mesos/src/tests/role_tests.cpp
[ 88%] Building CXX object src/tests/CMakeFiles/mesos-tests.dir/scheduler_driver_tests.cpp.o
cd /mesos/build/src/tests && /usr/bin/g++  -DBUILD_DIR=\"/mesos/build\" -DBUILD_FLAGS=\"\" -DBUILD_JAVA_JVM_LIBRARY=\"\" -DHAS_AUTHENTICATION=1 -DHAVE_LIBZ -DLIBDIR=\"/usr/local/libmesos\" -DPICOJSON_USE_INT64 -DPKGDATADIR=\"/usr/local/share/mesos\" -DPKGLIBEXECDIR=\"/usr/local/libexec/mesos\" -DPKGMODULEDIR=\"\" -DSBINDIR=\"\" -DSOURCE_DIR=\"/mesos\" -DTESTLIBEXECDIR=\"\" -DUSE_CMAKE_BUILD_CONFIG -DUSE_SSL_SOCKET=1 -DUSE_STATIC_LIB -DVERSION=\"1.5.0\" -DZOOKEEPER_VERSION=\"3.4.8\" -D__STDC_FORMAT_MACROS -I/mesos/include -I/mesos/build/include -I/mesos/build/include/mesos -I/mesos/build/src -I/mesos/src -I/mesos/3rdparty/libprocess/src/../include -I/mesos/3rdparty/stout/include -isystem /usr/include/apr-1.0 -isystem /mesos/build/3rdparty/boost-1.53.0/src/boost-1.53.0 -isystem /mesos/build/3rdparty/elfio-3.2/src/elfio-3.2 -isystem /mesos/build/3rdparty/glog-0.3.3/src/glog-0.3.3-build/include -isystem /mesos/build/3rdparty/picojson-1.3.0/src/picojson-1.3.0 -isystem /mesos/build/3rdparty/protobuf-3.3.0/src/protobuf-3.3.0/src -isystem /usr/include/subversion-1 -isystem /mesos/build/3rdparty/http_parser-2.6.2/src/http_parser-2.6.2 -isystem /mesos/build/3rdparty/zookeeper-3.4.8/src/zookeeper-3.4.8/src/c/include -isystem /mesos/build/3rdparty/zookeeper-3.4.8/src/zookeeper-3.4.8/src/c/generated -isystem /mesos/build/3rdparty/nvml-352.79/src/nvml-352.79 -isystem /mesos/build/3rdparty/leveldb-1.19/src/leveldb-1.19/include -isystem /mesos/build/3rdparty/googletest-1.8.0/src/googletest-1.8.0/googlemock/include -isystem /mesos/build/3rdparty/googletest-1.8.0/src/googletest-1.8.0/googletest/include  -std=c++11 -Wformat-security -fstack-protector -fPIE   -o CMakeFiles/mesos-tests.dir/scheduler_driver_tests.cpp.o -c /mesos/src/tests/scheduler_driver_tests.cpp
[ 88%] Building CXX object src/tests/CMakeFiles/mesos-tests.dir/scheduler_event_call_tests.cpp.o
cd /mesos/build/src/tests && /usr/bin/g++  -DBUILD_DIR=\"/mesos/build\" -DBUILD_FLAGS=\"\" -DBUILD_JAVA_JVM_LIBRARY=\"\" -DHAS_AUTHENTICATION=1 -DHAVE_LIBZ -DLIBDIR=\"/usr/local/libmesos\" -DPICOJSON_USE_INT64 -DPKGDATADIR=\"/usr/local/share/mesos\" -DPKGLIBEXECDIR=\"/usr/local/libexec/mesos\" -DPKGMODULEDIR=\"\" -DSBINDIR=\"\" -DSOURCE_DIR=\"/mesos\" -DTESTLIBEXECDIR=\"\" -DUSE_CMAKE_BUILD_CONFIG -DUSE_SSL_SOCKET=1 -DUSE_STATIC_LIB -DVERSION=\"1.5.0\" -DZOOKEEPER_VERSION=\"3.4.8\" -D__STDC_FORMAT_MACROS -I/mesos/include -I/mesos/build/include -I/mesos/build/include/mesos -I/mesos/build/src -I/mesos/src -I/mesos/3rdparty/libprocess/src/../include -I/mesos/3rdparty/stout/include -isystem /usr/include/apr-1.0 -isystem /mesos/build/3rdparty/boost-1.53.0/src/boost-1.53.0 -isystem /mesos/build/3rdparty/elfio-3.2/src/elfio-3.2 -isystem /mesos/build/3rdparty/glog-0.3.3/src/glog-0.3.3-build/include -isystem /mesos/build/3rdparty/picojson-1.3.0/src/picojson-1.3.0 -isystem /mesos/build/3rdparty/protobuf-3.3.0/src/protobuf-3.3.0/src -isystem /usr/include/subversion-1 -isystem /mesos/build/3rdparty/http_parser-2.6.2/src/http_parser-2.6.2 -isystem /mesos/build/3rdparty/zookeeper-3.4.8/src/zookeeper-3.4.8/src/c/include -isystem /mesos/build/3rdparty/zookeeper-3.4.8/src/zookeeper-3.4.8/src/c/generated -isystem /mesos/build/3rdparty/nvml-352.79/src/nvml-352.79 -isystem /mesos/build/3rdparty/leveldb-1.19/src/leveldb-1.19/include -isystem /mesos/build/3rdparty/googletest-1.8.0/src/googletest-1.8.0/googlemock/include -isystem /mesos/build/3rdparty/googletest-1.8.0/src/googletest-1.8.0/googletest/include  -std=c++11 -Wformat-security -fstack-protector -fPIE   -o CMakeFiles/mesos-tests.dir/scheduler_event_call_tests.cpp.o -c /mesos/src/tests/scheduler_event_call_tests.cpp
[ 88%] Building CXX object src/tests/CMakeFiles/mesos-tests.dir/scheduler_http_api_tests.cpp.o
cd /mesos/build/src/tests && /usr/bin/g++  -DBUILD_DIR=\"/mesos/build\" -DBUILD_FLAGS=\"\" -DBUILD_JAVA_JVM_LIBRARY=\"\" -DHAS_AUTHENTICATION=1 -DHAVE_LIBZ -DLIBDIR=\"/usr/local/libmesos\" -DPICOJSON_USE_INT64 -DPKGDATADIR=\"/usr/local/share/mesos\" -DPKGLIBEXECDIR=\"/usr/local/libexec/mesos\" -DPKGMODULEDIR=\"\" -DSBINDIR=\"\" -DSOURCE_DIR=\"/mesos\" -DTESTLIBEXECDIR=\"\" -DUSE_CMAKE_BUILD_CONFIG -DUSE_SSL_SOCKET=1 -DUSE_STATIC_LIB -DVERSION=\"1.5.0\" -DZOOKEEPER_VERSION=\"3.4.8\" -D__STDC_FORMAT_MACROS -I/mesos/include -I/mesos/build/include -I/mesos/build/include/mesos -I/mesos/build/src -I/mesos/src -I/mesos/3rdparty/libprocess/src/../include -I/mesos/3rdparty/stout/include -isystem /usr/include/apr-1.0 -isystem /mesos/build/3rdparty/boost-1.53.0/src/boost-1.53.0 -isystem /mesos/build/3rdparty/elfio-3.2/src/elfio-3.2 -isystem /mesos/build/3rdparty/glog-0.3.3/src/glog-0.3.3-build/include -isystem /mesos/build/3rdparty/picojson-1.3.0/src/picojson-1.3.0 -isystem /mesos/build/3rdparty/protobuf-3.3.0/src/protobuf-3.3.0/src -isystem /usr/include/subversion-1 -isystem /mesos/build/3rdparty/http_parser-2.6.2/src/http_parser-2.6.2 -isystem /mesos/build/3rdparty/zookeeper-3.4.8/src/zookeeper-3.4.8/src/c/include -isystem /mesos/build/3rdparty/zookeeper-3.4.8/src/zookeeper-3.4.8/src/c/generated -isystem /mesos/build/3rdparty/nvml-352.79/src/nvml-352.79 -isystem /mesos/build/3rdparty/leveldb-1.19/src/leveldb-1.19/include -isystem /mesos/build/3rdparty/googletest-1.8.0/src/googletest-1.8.0/googlemock/include -isystem /mesos/build/3rdparty/googletest-1.8.0/src/googletest-1.8.0/googletest/include  -std=c++11 -Wformat-security -fstack-protector -fPIE   -o CMakeFiles/mesos-tests.dir/scheduler_http_api_tests.cpp.o -c /mesos/src/tests/scheduler_http_api_tests.cpp
[ 89%] Building CXX object src/tests/CMakeFiles/mesos-tests.dir/scheduler_tests.cpp.o
cd /mesos/build/src/tests && /usr/bin/g++  -DBUILD_DIR=\"/mesos/build\" -DBUILD_FLAGS=\"\" -DBUILD_JAVA_JVM_LIBRARY=\"\" -DHAS_AUTHENTICATION=1 -DHAVE_LIBZ -DLIBDIR=\"/usr/local/libmesos\" -DPICOJSON_USE_INT64 -DPKGDATADIR=\"/usr/local/share/mesos\" -DPKGLIBEXECDIR=\"/usr/local/libexec/mesos\" -DPKGMODULEDIR=\"\" -DSBINDIR=\"\" -DSOURCE_DIR=\"/mesos\" -DTESTLIBEXECDIR=\"\" -DUSE_CMAKE_BUILD_CONFIG -DUSE_SSL_SOCKET=1 -DUSE_STATIC_LIB -DVERSION=\"1.5.0\" -DZOOKEEPER_VERSION=\"3.4.8\" -D__STDC_FORMAT_MACROS -I/mesos/include -I/mesos/build/include -I/mesos/build/include/mesos -I/mesos/build/src -I/mesos/src -I/mesos/3rdparty/libprocess/src/../include -I/mesos/3rdparty/stout/include -isystem /usr/include/apr-1.0 -isystem /mesos/build/3rdparty/boost-1.53.0/src/boost-1.53.0 -isystem /mesos/build/3rdparty/elfio-3.2/src/elfio-3.2 -isystem /mesos/build/3rdparty/glog-0.3.3/src/glog-0.3.3-build/include -isystem /mesos/build/3rdparty/picojson-1.3.0/src/picojson-1.3.0 -isystem /mesos/build/3rdparty/protobuf-3.3.0/src/protobuf-3.3.0/src -isystem /usr/include/subversion-1 -isystem /mesos/build/3rdparty/http_parser-2.6.2/src/http_parser-2.6.2 -isystem /mesos/build/3rdparty/zookeeper-3.4.8/src/zookeeper-3.4.8/src/c/include -isystem /mesos/build/3rdparty/zookeeper-3.4.8/src/zookeeper-3.4.8/src/c/generated -isystem /mesos/build/3rdparty/nvml-352.79/src/nvml-352.79 -isystem /mesos/build/3rdparty/leveldb-1.19/src/leveldb-1.19/include -isystem /mesos/build/3rdparty/googletest-1.8.0/src/googletest-1.8.0/googlemock/include -isystem /mesos/build/3rdparty/googletest-1.8.0/src/googletest-1.8.0/googletest/include  -std=c++11 -Wformat-security -fstack-protector -fPIE   -o CMakeFiles/mesos-tests.dir/scheduler_tests.cpp.o -c /mesos/src/tests/scheduler_tests.cpp
[ 89%] Building CXX object src/tests/CMakeFiles/mesos-tests.dir/slave_tests.cpp.o
cd /mesos/build/src/tests && /usr/bin/g++  -DBUILD_DIR=\"/mesos/build\" -DBUILD_FLAGS=\"\" -DBUILD_JAVA_JVM_LIBRARY=\"\" -DHAS_AUTHENTICATION=1 -DHAVE_LIBZ -DLIBDIR=\"/usr/local/libmesos\" -DPICOJSON_USE_INT64 -DPKGDATADIR=\"/usr/local/share/mesos\" -DPKGLIBEXECDIR=\"/usr/local/libexec/mesos\" -DPKGMODULEDIR=\"\" -DSBINDIR=\"\" -DSOURCE_DIR=\"/mesos\" -DTESTLIBEXECDIR=\"\" -DUSE_CMAKE_BUILD_CONFIG -DUSE_SSL_SOCKET=1 -DUSE_STATIC_LIB -DVERSION=\"1.5.0\" -DZOOKEEPER_VERSION=\"3.4.8\" -D__STDC_FORMAT_MACROS -I/mesos/include -I/mesos/build/include -I/mesos/build/include/mesos -I/mesos/build/src -I/mesos/src -I/mesos/3rdparty/libprocess/src/../include -I/mesos/3rdparty/stout/include -isystem /usr/include/apr-1.0 -isystem /mesos/build/3rdparty/boost-1.53.0/src/boost-1.53.0 -isystem /mesos/build/3rdparty/elfio-3.2/src/elfio-3.2 -isystem /mesos/build/3rdparty/glog-0.3.3/src/glog-0.3.3-build/include -isystem /mesos/build/3rdparty/picojson-1.3.0/src/picojson-1.3.0 -isystem /mesos/build/3rdparty/protobuf-3.3.0/src/protobuf-3.3.0/src -isystem /usr/include/subversion-1 -isystem /mesos/build/3rdparty/http_parser-2.6.2/src/http_parser-2.6.2 -isystem /mesos/build/3rdparty/zookeeper-3.4.8/src/zookeeper-3.4.8/src/c/include -isystem /mesos/build/3rdparty/zookeeper-3.4.8/src/zookeeper-3.4.8/src/c/generated -isystem /mesos/build/3rdparty/nvml-352.79/src/nvml-352.79 -isystem /mesos/build/3rdparty/leveldb-1.19/src/leveldb-1.19/include -isystem /mesos/build/3rdparty/googletest-1.8.0/src/googletest-1.8.0/googlemock/include -isystem /mesos/build/3rdparty/googletest-1.8.0/src/googletest-1.8.0/googletest/include  -std=c++11 -Wformat-security -fstack-protector -fPIE   -o CMakeFiles/mesos-tests.dir/slave_tests.cpp.o -c /mesos/src/tests/slave_tests.cpp
[ 89%] Building CXX object src/tests/CMakeFiles/mesos-tests.dir/slave_validation_tests.cpp.o
cd /mesos/build/src/tests && /usr/bin/g++  -DBUILD_DIR=\"/mesos/build\" -DBUILD_FLAGS=\"\" -DBUILD_JAVA_JVM_LIBRARY=\"\" -DHAS_AUTHENTICATION=1 -DHAVE_LIBZ -DLIBDIR=\"/usr/local/libmesos\" -DPICOJSON_USE_INT64 -DPKGDATADIR=\"/usr/local/share/mesos\" -DPKGLIBEXECDIR=\"/usr/local/libexec/mesos\" -DPKGMODULEDIR=\"\" -DSBINDIR=\"\" -DSOURCE_DIR=\"/mesos\" -DTESTLIBEXECDIR=\"\" -DUSE_CMAKE_BUILD_CONFIG -DUSE_SSL_SOCKET=1 -DUSE_STATIC_LIB -DVERSION=\"1.5.0\" -DZOOKEEPER_VERSION=\"3.4.8\" -D__STDC_FORMAT_MACROS -I/mesos/include -I/mesos/build/include -I/mesos/build/include/mesos -I/mesos/build/src -I/mesos/src -I/mesos/3rdparty/libprocess/src/../include -I/mesos/3rdparty/stout/include -isystem /usr/include/apr-1.0 -isystem /mesos/build/3rdparty/boost-1.53.0/src/boost-1.53.0 -isystem /mesos/build/3rdparty/elfio-3.2/src/elfio-3.2 -isystem /mesos/build/3rdparty/glog-0.3.3/src/glog-0.3.3-build/include -isystem /mesos/build/3rdparty/picojson-1.3.0/src/picojson-1.3.0 -isystem /mesos/build/3rdparty/protobuf-3.3.0/src/protobuf-3.3.0/src -isystem /usr/include/subversion-1 -isystem /mesos/build/3rdparty/http_parser-2.6.2/src/http_parser-2.6.2 -isystem /mesos/build/3rdparty/zookeeper-3.4.8/src/zookeeper-3.4.8/src/c/include -isystem /mesos/build/3rdparty/zookeeper-3.4.8/src/zookeeper-3.4.8/src/c/generated -isystem /mesos/build/3rdparty/nvml-352.79/src/nvml-352.79 -isystem /mesos/build/3rdparty/leveldb-1.19/src/leveldb-1.19/include -isystem /mesos/build/3rdparty/googletest-1.8.0/src/googletest-1.8.0/googlemock/include -isystem /mesos/build/3rdparty/googletest-1.8.0/src/googletest-1.8.0/googletest/include  -std=c++11 -Wformat-security -fstack-protector -fPIE   -o CMakeFiles/mesos-tests.dir/slave_validation_tests.cpp.o -c /mesos/src/tests/slave_validation_tests.cpp
[ 89%] Building CXX object src/tests/CMakeFiles/mesos-tests.dir/sorter_tests.cpp.o
cd /mesos/build/src/tests && /usr/bin/g++  -DBUILD_DIR=\"/mesos/build\" -DBUILD_FLAGS=\"\" -DBUILD_JAVA_JVM_LIBRARY=\"\" -DHAS_AUTHENTICATION=1 -DHAVE_LIBZ -DLIBDIR=\"/usr/local/libmesos\" -DPICOJSON_USE_INT64 -DPKGDATADIR=\"/usr/local/share/mesos\" -DPKGLIBEXECDIR=\"/usr/local/libexec/mesos\" -DPKGMODULEDIR=\"\" -DSBINDIR=\"\" -DSOURCE_DIR=\"/mesos\" -DTESTLIBEXECDIR=\"\" -DUSE_CMAKE_BUILD_CONFIG -DUSE_SSL_SOCKET=1 -DUSE_STATIC_LIB -DVERSION=\"1.5.0\" -DZOOKEEPER_VERSION=\"3.4.8\" -D__STDC_FORMAT_MACROS -I/mesos/include -I/mesos/build/include -I/mesos/build/include/mesos -I/mesos/build/src -I/mesos/src -I/mesos/3rdparty/libprocess/src/../include -I/mesos/3rdparty/stout/include -isystem /usr/include/apr-1.0 -isystem /mesos/build/3rdparty/boost-1.53.0/src/boost-1.53.0 -isystem /mesos/build/3rdparty/elfio-3.2/src/elfio-3.2 -isystem /mesos/build/3rdparty/glog-0.3.3/src/glog-0.3.3-build/include -isystem /mesos/build/3rdparty/picojson-1.3.0/src/picojson-1.3.0 -isystem /mesos/build/3rdparty/protobuf-3.3.0/src/protobuf-3.3.0/src -isystem /usr/include/subversion-1 -isystem /mesos/build/3rdparty/http_parser-2.6.2/src/http_parser-2.6.2 -isystem /mesos/build/3rdparty/zookeeper-3.4.8/src/zookeeper-3.4.8/src/c/include -isystem /mesos/build/3rdparty/zookeeper-3.4.8/src/zookeeper-3.4.8/src/c/generated -isystem /mesos/build/3rdparty/nvml-352.79/src/nvml-352.79 -isystem /mesos/build/3rdparty/leveldb-1.19/src/leveldb-1.19/include -isystem /mesos/build/3rdparty/googletest-1.8.0/src/googletest-1.8.0/googlemock/include -isystem /mesos/build/3rdparty/googletest-1.8.0/src/googletest-1.8.0/googletest/include  -std=c++11 -Wformat-security -fstack-protector -fPIE   -o CMakeFiles/mesos-tests.dir/sorter_tests.cpp.o -c /mesos/src/tests/sorter_tests.cpp
[ 89%] Building CXX object src/tests/CMakeFiles/mesos-tests.dir/status_update_manager_tests.cpp.o
cd /mesos/build/src/tests && /usr/bin/g++  -DBUILD_DIR=\"/mesos/build\" -DBUILD_FLAGS=\"\" -DBUILD_JAVA_JVM_LIBRARY=\"\" -DHAS_AUTHENTICATION=1 -DHAVE_LIBZ -DLIBDIR=\"/usr/local/libmesos\" -DPICOJSON_USE_INT64 -DPKGDATADIR=\"/usr/local/share/mesos\" -DPKGLIBEXECDIR=\"/usr/local/libexec/mesos\" -DPKGMODULEDIR=\"\" -DSBINDIR=\"\" -DSOURCE_DIR=\"/mesos\" -DTESTLIBEXECDIR=\"\" -DUSE_CMAKE_BUILD_CONFIG -DUSE_SSL_SOCKET=1 -DUSE_STATIC_LIB -DVERSION=\"1.5.0\" -DZOOKEEPER_VERSION=\"3.4.8\" -D__STDC_FORMAT_MACROS -I/mesos/include -I/mesos/build/include -I/mesos/build/include/mesos -I/mesos/build/src -I/mesos/src -I/mesos/3rdparty/libprocess/src/../include -I/mesos/3rdparty/stout/include -isystem /usr/include/apr-1.0 -isystem /mesos/build/3rdparty/boost-1.53.0/src/boost-1.53.0 -isystem /mesos/build/3rdparty/elfio-3.2/src/elfio-3.2 -isystem /mesos/build/3rdparty/glog-0.3.3/src/glog-0.3.3-build/include -isystem /mesos/build/3rdparty/picojson-1.3.0/src/picojson-1.3.0 -isystem /mesos/build/3rdparty/protobuf-3.3.0/src/protobuf-3.3.0/src -isystem /usr/include/subversion-1 -isystem /mesos/build/3rdparty/http_parser-2.6.2/src/http_parser-2.6.2 -isystem /mesos/build/3rdparty/zookeeper-3.4.8/src/zookeeper-3.4.8/src/c/include -isystem /mesos/build/3rdparty/zookeeper-3.4.8/src/zookeeper-3.4.8/src/c/generated -isystem /mesos/build/3rdparty/nvml-352.79/src/nvml-352.79 -isystem /mesos/build/3rdparty/leveldb-1.19/src/leveldb-1.19/include -isystem /mesos/build/3rdparty/googletest-1.8.0/src/googletest-1.8.0/googlemock/include -isystem /mesos/build/3rdparty/googletest-1.8.0/src/googletest-1.8.0/googletest/include  -std=c++11 -Wformat-security -fstack-protector -fPIE   -o CMakeFiles/mesos-tests.dir/status_update_manager_tests.cpp.o -c /mesos/src/tests/status_update_manager_tests.cpp
[ 89%] Building CXX object src/tests/CMakeFiles/mesos-tests.dir/uri_tests.cpp.o
cd /mesos/build/src/tests && /usr/bin/g++  -DBUILD_DIR=\"/mesos/build\" -DBUILD_FLAGS=\"\" -DBUILD_JAVA_JVM_LIBRARY=\"\" -DHAS_AUTHENTICATION=1 -DHAVE_LIBZ -DLIBDIR=\"/usr/local/libmesos\" -DPICOJSON_USE_INT64 -DPKGDATADIR=\"/usr/local/share/mesos\" -DPKGLIBEXECDIR=\"/usr/local/libexec/mesos\" -DPKGMODULEDIR=\"\" -DSBINDIR=\"\" -DSOURCE_DIR=\"/mesos\" -DTESTLIBEXECDIR=\"\" -DUSE_CMAKE_BUILD_CONFIG -DUSE_SSL_SOCKET=1 -DUSE_STATIC_LIB -DVERSION=\"1.5.0\" -DZOOKEEPER_VERSION=\"3.4.8\" -D__STDC_FORMAT_MACROS -I/mesos/include -I/mesos/build/include -I/mesos/build/include/mesos -I/mesos/build/src -I/mesos/src -I/mesos/3rdparty/libprocess/src/../include -I/mesos/3rdparty/stout/include -isystem /usr/include/apr-1.0 -isystem /mesos/build/3rdparty/boost-1.53.0/src/boost-1.53.0 -isystem /mesos/build/3rdparty/elfio-3.2/src/elfio-3.2 -isystem /mesos/build/3rdparty/glog-0.3.3/src/glog-0.3.3-build/include -isystem /mesos/build/3rdparty/picojson-1.3.0/src/picojson-1.3.0 -isystem /mesos/build/3rdparty/protobuf-3.3.0/src/protobuf-3.3.0/src -isystem /usr/include/subversion-1 -isystem /mesos/build/3rdparty/http_parser-2.6.2/src/http_parser-2.6.2 -isystem /mesos/build/3rdparty/zookeeper-3.4.8/src/zookeeper-3.4.8/src/c/include -isystem /mesos/build/3rdparty/zookeeper-3.4.8/src/zookeeper-3.4.8/src/c/generated -isystem /mesos/build/3rdparty/nvml-352.79/src/nvml-352.79 -isystem /mesos/build/3rdparty/leveldb-1.19/src/leveldb-1.19/include -isystem /mesos/build/3rdparty/googletest-1.8.0/src/googletest-1.8.0/googlemock/include -isystem /mesos/build/3rdparty/googletest-1.8.0/src/googletest-1.8.0/googletest/include  -std=c++11 -Wformat-security -fstack-protector -fPIE   -o CMakeFiles/mesos-tests.dir/uri_tests.cpp.o -c /mesos/src/tests/uri_tests.cpp
[ 89%] Building CXX object src/tests/CMakeFiles/mesos-tests.dir/uri_fetcher_tests.cpp.o
cd /mesos/build/src/tests && /usr/bin/g++  -DBUILD_DIR=\"/mesos/build\" -DBUILD_FLAGS=\"\" -DBUILD_JAVA_JVM_LIBRARY=\"\" -DHAS_AUTHENTICATION=1 -DHAVE_LIBZ -DLIBDIR=\"/usr/local/libmesos\" -DPICOJSON_USE_INT64 -DPKGDATADIR=\"/usr/local/share/mesos\" -DPKGLIBEXECDIR=\"/usr/local/libexec/mesos\" -DPKGMODULEDIR=\"\" -DSBINDIR=\"\" -DSOURCE_DIR=\"/mesos\" -DTESTLIBEXECDIR=\"\" -DUSE_CMAKE_BUILD_CONFIG -DUSE_SSL_SOCKET=1 -DUSE_STATIC_LIB -DVERSION=\"1.5.0\" -DZOOKEEPER_VERSION=\"3.4.8\" -D__STDC_FORMAT_MACROS -I/mesos/include -I/mesos/build/include -I/mesos/build/include/mesos -I/mesos/build/src -I/mesos/src -I/mesos/3rdparty/libprocess/src/../include -I/mesos/3rdparty/stout/include -isystem /usr/include/apr-1.0 -isystem /mesos/build/3rdparty/boost-1.53.0/src/boost-1.53.0 -isystem /mesos/build/3rdparty/elfio-3.2/src/elfio-3.2 -isystem /mesos/build/3rdparty/glog-0.3.3/src/glog-0.3.3-build/include -isystem /mesos/build/3rdparty/picojson-1.3.0/src/picojson-1.3.0 -isystem /mesos/build/3rdparty/protobuf-3.3.0/src/protobuf-3.3.0/src -isystem /usr/include/subversion-1 -isystem /mesos/build/3rdparty/http_parser-2.6.2/src/http_parser-2.6.2 -isystem /mesos/build/3rdparty/zookeeper-3.4.8/src/zookeeper-3.4.8/src/c/include -isystem /mesos/build/3rdparty/zookeeper-3.4.8/src/zookeeper-3.4.8/src/c/generated -isystem /mesos/build/3rdparty/nvml-352.79/src/nvml-352.79 -isystem /mesos/build/3rdparty/leveldb-1.19/src/leveldb-1.19/include -isystem /mesos/build/3rdparty/googletest-1.8.0/src/googletest-1.8.0/googlemock/include -isystem /mesos/build/3rdparty/googletest-1.8.0/src/googletest-1.8.0/googletest/include  -std=c++11 -Wformat-security -fstack-protector -fPIE   -o CMakeFiles/mesos-tests.dir/uri_fetcher_tests.cpp.o -c /mesos/src/tests/uri_fetcher_tests.cpp
[ 90%] Building CXX object src/tests/CMakeFiles/mesos-tests.dir/values_tests.cpp.o
cd /mesos/build/src/tests && /usr/bin/g++  -DBUILD_DIR=\"/mesos/build\" -DBUILD_FLAGS=\"\" -DBUILD_JAVA_JVM_LIBRARY=\"\" -DHAS_AUTHENTICATION=1 -DHAVE_LIBZ -DLIBDIR=\"/usr/local/libmesos\" -DPICOJSON_USE_INT64 -DPKGDATADIR=\"/usr/local/share/mesos\" -DPKGLIBEXECDIR=\"/usr/local/libexec/mesos\" -DPKGMODULEDIR=\"\" -DSBINDIR=\"\" -DSOURCE_DIR=\"/mesos\" -DTESTLIBEXECDIR=\"\" -DUSE_CMAKE_BUILD_CONFIG -DUSE_SSL_SOCKET=1 -DUSE_STATIC_LIB -DVERSION=\"1.5.0\" -DZOOKEEPER_VERSION=\"3.4.8\" -D__STDC_FORMAT_MACROS -I/mesos/include -I/mesos/build/include -I/mesos/build/include/mesos -I/mesos/build/src -I/mesos/src -I/mesos/3rdparty/libprocess/src/../include -I/mesos/3rdparty/stout/include -isystem /usr/include/apr-1.0 -isystem /mesos/build/3rdparty/boost-1.53.0/src/boost-1.53.0 -isystem /mesos/build/3rdparty/elfio-3.2/src/elfio-3.2 -isystem /mesos/build/3rdparty/glog-0.3.3/src/glog-0.3.3-build/include -isystem /mesos/build/3rdparty/picojson-1.3.0/src/picojson-1.3.0 -isystem /mesos/build/3rdparty/protobuf-3.3.0/src/protobuf-3.3.0/src -isystem /usr/include/subversion-1 -isystem /mesos/build/3rdparty/http_parser-2.6.2/src/http_parser-2.6.2 -isystem /mesos/build/3rdparty/zookeeper-3.4.8/src/zookeeper-3.4.8/src/c/include -isystem /mesos/build/3rdparty/zookeeper-3.4.8/src/zookeeper-3.4.8/src/c/generated -isystem /mesos/build/3rdparty/nvml-352.79/src/nvml-352.79 -isystem /mesos/build/3rdparty/leveldb-1.19/src/leveldb-1.19/include -isystem /mesos/build/3rdparty/googletest-1.8.0/src/googletest-1.8.0/googlemock/include -isystem /mesos/build/3rdparty/googletest-1.8.0/src/googletest-1.8.0/googletest/include  -std=c++11 -Wformat-security -fstack-protector -fPIE   -o CMakeFiles/mesos-tests.dir/values_tests.cpp.o -c /mesos/src/tests/values_tests.cpp
[ 90%] Building CXX object src/tests/CMakeFiles/mesos-tests.dir/zookeeper_url_tests.cpp.o
cd /mesos/build/src/tests && /usr/bin/g++  -DBUILD_DIR=\"/mesos/build\" -DBUILD_FLAGS=\"\" -DBUILD_JAVA_JVM_LIBRARY=\"\" -DHAS_AUTHENTICATION=1 -DHAVE_LIBZ -DLIBDIR=\"/usr/local/libmesos\" -DPICOJSON_USE_INT64 -DPKGDATADIR=\"/usr/local/share/mesos\" -DPKGLIBEXECDIR=\"/usr/local/libexec/mesos\" -DPKGMODULEDIR=\"\" -DSBINDIR=\"\" -DSOURCE_DIR=\"/mesos\" -DTESTLIBEXECDIR=\"\" -DUSE_CMAKE_BUILD_CONFIG -DUSE_SSL_SOCKET=1 -DUSE_STATIC_LIB -DVERSION=\"1.5.0\" -DZOOKEEPER_VERSION=\"3.4.8\" -D__STDC_FORMAT_MACROS -I/mesos/include -I/mesos/build/include -I/mesos/build/include/mesos -I/mesos/build/src -I/mesos/src -I/mesos/3rdparty/libprocess/src/../include -I/mesos/3rdparty/stout/include -isystem /usr/include/apr-1.0 -isystem /mesos/build/3rdparty/boost-1.53.0/src/boost-1.53.0 -isystem /mesos/build/3rdparty/elfio-3.2/src/elfio-3.2 -isystem /mesos/build/3rdparty/glog-0.3.3/src/glog-0.3.3-build/include -isystem /mesos/build/3rdparty/picojson-1.3.0/src/picojson-1.3.0 -isystem /mesos/build/3rdparty/protobuf-3.3.0/src/protobuf-3.3.0/src -isystem /usr/include/subversion-1 -isystem /mesos/build/3rdparty/http_parser-2.6.2/src/http_parser-2.6.2 -isystem /mesos/build/3rdparty/zookeeper-3.4.8/src/zookeeper-3.4.8/src/c/include -isystem /mesos/build/3rdparty/zookeeper-3.4.8/src/zookeeper-3.4.8/src/c/generated -isystem /mesos/build/3rdparty/nvml-352.79/src/nvml-352.79 -isystem /mesos/build/3rdparty/leveldb-1.19/src/leveldb-1.19/include -isystem /mesos/build/3rdparty/googletest-1.8.0/src/googletest-1.8.0/googlemock/include -isystem /mesos/build/3rdparty/googletest-1.8.0/src/googletest-1.8.0/googletest/include  -std=c++11 -Wformat-security -fstack-protector -fPIE   -o CMakeFiles/mesos-tests.dir/zookeeper_url_tests.cpp.o -c /mesos/src/tests/zookeeper_url_tests.cpp
[ 90%] Building CXX object src/tests/CMakeFiles/mesos-tests.dir/secret_generator_tests.cpp.o
cd /mesos/build/src/tests && /usr/bin/g++  -DBUILD_DIR=\"/mesos/build\" -DBUILD_FLAGS=\"\" -DBUILD_JAVA_JVM_LIBRARY=\"\" -DHAS_AUTHENTICATION=1 -DHAVE_LIBZ -DLIBDIR=\"/usr/local/libmesos\" -DPICOJSON_USE_INT64 -DPKGDATADIR=\"/usr/local/share/mesos\" -DPKGLIBEXECDIR=\"/usr/local/libexec/mesos\" -DPKGMODULEDIR=\"\" -DSBINDIR=\"\" -DSOURCE_DIR=\"/mesos\" -DTESTLIBEXECDIR=\"\" -DUSE_CMAKE_BUILD_CONFIG -DUSE_SSL_SOCKET=1 -DUSE_STATIC_LIB -DVERSION=\"1.5.0\" -DZOOKEEPER_VERSION=\"3.4.8\" -D__STDC_FORMAT_MACROS -I/mesos/include -I/mesos/build/include -I/mesos/build/include/mesos -I/mesos/build/src -I/mesos/src -I/mesos/3rdparty/libprocess/src/../include -I/mesos/3rdparty/stout/include -isystem /usr/include/apr-1.0 -isystem /mesos/build/3rdparty/boost-1.53.0/src/boost-1.53.0 -isystem /mesos/build/3rdparty/elfio-3.2/src/elfio-3.2 -isystem /mesos/build/3rdparty/glog-0.3.3/src/glog-0.3.3-build/include -isystem /mesos/build/3rdparty/picojson-1.3.0/src/picojson-1.3.0 -isystem /mesos/build/3rdparty/protobuf-3.3.0/src/protobuf-3.3.0/src -isystem /usr/include/subversion-1 -isystem /mesos/build/3rdparty/http_parser-2.6.2/src/http_parser-2.6.2 -isystem /mesos/build/3rdparty/zookeeper-3.4.8/src/zookeeper-3.4.8/src/c/include -isystem /mesos/build/3rdparty/zookeeper-3.4.8/src/zookeeper-3.4.8/src/c/generated -isystem /mesos/build/3rdparty/nvml-352.79/src/nvml-352.79 -isystem /mesos/build/3rdparty/leveldb-1.19/src/leveldb-1.19/include -isystem /mesos/build/3rdparty/googletest-1.8.0/src/googletest-1.8.0/googlemock/include -isystem /mesos/build/3rdparty/googletest-1.8.0/src/googletest-1.8.0/googletest/include  -std=c++11 -Wformat-security -fstack-protector -fPIE   -o CMakeFiles/mesos-tests.dir/secret_generator_tests.cpp.o -c /mesos/src/tests/secret_generator_tests.cpp
[ 90%] Building CXX object src/tests/CMakeFiles/mesos-tests.dir/common/http_tests.cpp.o
cd /mesos/build/src/tests && /usr/bin/g++  -DBUILD_DIR=\"/mesos/build\" -DBUILD_FLAGS=\"\" -DBUILD_JAVA_JVM_LIBRARY=\"\" -DHAS_AUTHENTICATION=1 -DHAVE_LIBZ -DLIBDIR=\"/usr/local/libmesos\" -DPICOJSON_USE_INT64 -DPKGDATADIR=\"/usr/local/share/mesos\" -DPKGLIBEXECDIR=\"/usr/local/libexec/mesos\" -DPKGMODULEDIR=\"\" -DSBINDIR=\"\" -DSOURCE_DIR=\"/mesos\" -DTESTLIBEXECDIR=\"\" -DUSE_CMAKE_BUILD_CONFIG -DUSE_SSL_SOCKET=1 -DUSE_STATIC_LIB -DVERSION=\"1.5.0\" -DZOOKEEPER_VERSION=\"3.4.8\" -D__STDC_FORMAT_MACROS -I/mesos/include -I/mesos/build/include -I/mesos/build/include/mesos -I/mesos/build/src -I/mesos/src -I/mesos/3rdparty/libprocess/src/../include -I/mesos/3rdparty/stout/include -isystem /usr/include/apr-1.0 -isystem /mesos/build/3rdparty/boost-1.53.0/src/boost-1.53.0 -isystem /mesos/build/3rdparty/elfio-3.2/src/elfio-3.2 -isystem /mesos/build/3rdparty/glog-0.3.3/src/glog-0.3.3-build/include -isystem /mesos/build/3rdparty/picojson-1.3.0/src/picojson-1.3.0 -isystem /mesos/build/3rdparty/protobuf-3.3.0/src/protobuf-3.3.0/src -isystem /usr/include/subversion-1 -isystem /mesos/build/3rdparty/http_parser-2.6.2/src/http_parser-2.6.2 -isystem /mesos/build/3rdparty/zookeeper-3.4.8/src/zookeeper-3.4.8/src/c/include -isystem /mesos/build/3rdparty/zookeeper-3.4.8/src/zookeeper-3.4.8/src/c/generated -isystem /mesos/build/3rdparty/nvml-352.79/src/nvml-352.79 -isystem /mesos/build/3rdparty/leveldb-1.19/src/leveldb-1.19/include -isystem /mesos/build/3rdparty/googletest-1.8.0/src/googletest-1.8.0/googlemock/include -isystem /mesos/build/3rdparty/googletest-1.8.0/src/googletest-1.8.0/googletest/include  -std=c++11 -Wformat-security -fstack-protector -fPIE   -o CMakeFiles/mesos-tests.dir/common/http_tests.cpp.o -c /mesos/src/tests/common/http_tests.cpp
[ 90%] Building CXX object src/tests/CMakeFiles/mesos-tests.dir/common/recordio_tests.cpp.o
cd /mesos/build/src/tests && /usr/bin/g++  -DBUILD_DIR=\"/mesos/build\" -DBUILD_FLAGS=\"\" -DBUILD_JAVA_JVM_LIBRARY=\"\" -DHAS_AUTHENTICATION=1 -DHAVE_LIBZ -DLIBDIR=\"/usr/local/libmesos\" -DPICOJSON_USE_INT64 -DPKGDATADIR=\"/usr/local/share/mesos\" -DPKGLIBEXECDIR=\"/usr/local/libexec/mesos\" -DPKGMODULEDIR=\"\" -DSBINDIR=\"\" -DSOURCE_DIR=\"/mesos\" -DTESTLIBEXECDIR=\"\" -DUSE_CMAKE_BUILD_CONFIG -DUSE_SSL_SOCKET=1 -DUSE_STATIC_LIB -DVERSION=\"1.5.0\" -DZOOKEEPER_VERSION=\"3.4.8\" -D__STDC_FORMAT_MACROS -I/mesos/include -I/mesos/build/include -I/mesos/build/include/mesos -I/mesos/build/src -I/mesos/src -I/mesos/3rdparty/libprocess/src/../include -I/mesos/3rdparty/stout/include -isystem /usr/include/apr-1.0 -isystem /mesos/build/3rdparty/boost-1.53.0/src/boost-1.53.0 -isystem /mesos/build/3rdparty/elfio-3.2/src/elfio-3.2 -isystem /mesos/build/3rdparty/glog-0.3.3/src/glog-0.3.3-build/include -isystem /mesos/build/3rdparty/picojson-1.3.0/src/picojson-1.3.0 -isystem /mesos/build/3rdparty/protobuf-3.3.0/src/protobuf-3.3.0/src -isystem /usr/include/subversion-1 -isystem /mesos/build/3rdparty/http_parser-2.6.2/src/http_parser-2.6.2 -isystem /mesos/build/3rdparty/zookeeper-3.4.8/src/zookeeper-3.4.8/src/c/include -isystem /mesos/build/3rdparty/zookeeper-3.4.8/src/zookeeper-3.4.8/src/c/generated -isystem /mesos/build/3rdparty/nvml-352.79/src/nvml-352.79 -isystem /mesos/build/3rdparty/leveldb-1.19/src/leveldb-1.19/include -isystem /mesos/build/3rdparty/googletest-1.8.0/src/googletest-1.8.0/googlemock/include -isystem /mesos/build/3rdparty/googletest-1.8.0/src/googletest-1.8.0/googletest/include  -std=c++11 -Wformat-security -fstack-protector -fPIE   -o CMakeFiles/mesos-tests.dir/common/recordio_tests.cpp.o -c /mesos/src/tests/common/recordio_tests.cpp
[ 90%] Building CXX object src/tests/CMakeFiles/mesos-tests.dir/common/type_utils_tests.cpp.o
cd /mesos/build/src/tests && /usr/bin/g++  -DBUILD_DIR=\"/mesos/build\" -DBUILD_FLAGS=\"\" -DBUILD_JAVA_JVM_LIBRARY=\"\" -DHAS_AUTHENTICATION=1 -DHAVE_LIBZ -DLIBDIR=\"/usr/local/libmesos\" -DPICOJSON_USE_INT64 -DPKGDATADIR=\"/usr/local/share/mesos\" -DPKGLIBEXECDIR=\"/usr/local/libexec/mesos\" -DPKGMODULEDIR=\"\" -DSBINDIR=\"\" -DSOURCE_DIR=\"/mesos\" -DTESTLIBEXECDIR=\"\" -DUSE_CMAKE_BUILD_CONFIG -DUSE_SSL_SOCKET=1 -DUSE_STATIC_LIB -DVERSION=\"1.5.0\" -DZOOKEEPER_VERSION=\"3.4.8\" -D__STDC_FORMAT_MACROS -I/mesos/include -I/mesos/build/include -I/mesos/build/include/mesos -I/mesos/build/src -I/mesos/src -I/mesos/3rdparty/libprocess/src/../include -I/mesos/3rdparty/stout/include -isystem /usr/include/apr-1.0 -isystem /mesos/build/3rdparty/boost-1.53.0/src/boost-1.53.0 -isystem /mesos/build/3rdparty/elfio-3.2/src/elfio-3.2 -isystem /mesos/build/3rdparty/glog-0.3.3/src/glog-0.3.3-build/include -isystem /mesos/build/3rdparty/picojson-1.3.0/src/picojson-1.3.0 -isystem /mesos/build/3rdparty/protobuf-3.3.0/src/protobuf-3.3.0/src -isystem /usr/include/subversion-1 -isystem /mesos/build/3rdparty/http_parser-2.6.2/src/http_parser-2.6.2 -isystem /mesos/build/3rdparty/zookeeper-3.4.8/src/zookeeper-3.4.8/src/c/include -isystem /mesos/build/3rdparty/zookeeper-3.4.8/src/zookeeper-3.4.8/src/c/generated -isystem /mesos/build/3rdparty/nvml-352.79/src/nvml-352.79 -isystem /mesos/build/3rdparty/leveldb-1.19/src/leveldb-1.19/include -isystem /mesos/build/3rdparty/googletest-1.8.0/src/googletest-1.8.0/googlemock/include -isystem /mesos/build/3rdparty/googletest-1.8.0/src/googletest-1.8.0/googletest/include  -std=c++11 -Wformat-security -fstack-protector -fPIE   -o CMakeFiles/mesos-tests.dir/common/type_utils_tests.cpp.o -c /mesos/src/tests/common/type_utils_tests.cpp
[ 90%] Building CXX object src/tests/CMakeFiles/mesos-tests.dir/containerizer/containerizer_tests.cpp.o
cd /mesos/build/src/tests && /usr/bin/g++  -DBUILD_DIR=\"/mesos/build\" -DBUILD_FLAGS=\"\" -DBUILD_JAVA_JVM_LIBRARY=\"\" -DHAS_AUTHENTICATION=1 -DHAVE_LIBZ -DLIBDIR=\"/usr/local/libmesos\" -DPICOJSON_USE_INT64 -DPKGDATADIR=\"/usr/local/share/mesos\" -DPKGLIBEXECDIR=\"/usr/local/libexec/mesos\" -DPKGMODULEDIR=\"\" -DSBINDIR=\"\" -DSOURCE_DIR=\"/mesos\" -DTESTLIBEXECDIR=\"\" -DUSE_CMAKE_BUILD_CONFIG -DUSE_SSL_SOCKET=1 -DUSE_STATIC_LIB -DVERSION=\"1.5.0\" -DZOOKEEPER_VERSION=\"3.4.8\" -D__STDC_FORMAT_MACROS -I/mesos/include -I/mesos/build/include -I/mesos/build/include/mesos -I/mesos/build/src -I/mesos/src -I/mesos/3rdparty/libprocess/src/../include -I/mesos/3rdparty/stout/include -isystem /usr/include/apr-1.0 -isystem /mesos/build/3rdparty/boost-1.53.0/src/boost-1.53.0 -isystem /mesos/build/3rdparty/elfio-3.2/src/elfio-3.2 -isystem /mesos/build/3rdparty/glog-0.3.3/src/glog-0.3.3-build/include -isystem /mesos/build/3rdparty/picojson-1.3.0/src/picojson-1.3.0 -isystem /mesos/build/3rdparty/protobuf-3.3.0/src/protobuf-3.3.0/src -isystem /usr/include/subversion-1 -isystem /mesos/build/3rdparty/http_parser-2.6.2/src/http_parser-2.6.2 -isystem /mesos/build/3rdparty/zookeeper-3.4.8/src/zookeeper-3.4.8/src/c/include -isystem /mesos/build/3rdparty/zookeeper-3.4.8/src/zookeeper-3.4.8/src/c/generated -isystem /mesos/build/3rdparty/nvml-352.79/src/nvml-352.79 -isystem /mesos/build/3rdparty/leveldb-1.19/src/leveldb-1.19/include -isystem /mesos/build/3rdparty/googletest-1.8.0/src/googletest-1.8.0/googlemock/include -isystem /mesos/build/3rdparty/googletest-1.8.0/src/googletest-1.8.0/googletest/include  -std=c++11 -Wformat-security -fstack-protector -fPIE   -o CMakeFiles/mesos-tests.dir/containerizer/containerizer_tests.cpp.o -c /mesos/src/tests/containerizer/containerizer_tests.cpp
[ 91%] Building CXX object src/tests/CMakeFiles/mesos-tests.dir/containerizer/docker_tests.cpp.o
cd /mesos/build/src/tests && /usr/bin/g++  -DBUILD_DIR=\"/mesos/build\" -DBUILD_FLAGS=\"\" -DBUILD_JAVA_JVM_LIBRARY=\"\" -DHAS_AUTHENTICATION=1 -DHAVE_LIBZ -DLIBDIR=\"/usr/local/libmesos\" -DPICOJSON_USE_INT64 -DPKGDATADIR=\"/usr/local/share/mesos\" -DPKGLIBEXECDIR=\"/usr/local/libexec/mesos\" -DPKGMODULEDIR=\"\" -DSBINDIR=\"\" -DSOURCE_DIR=\"/mesos\" -DTESTLIBEXECDIR=\"\" -DUSE_CMAKE_BUILD_CONFIG -DUSE_SSL_SOCKET=1 -DUSE_STATIC_LIB -DVERSION=\"1.5.0\" -DZOOKEEPER_VERSION=\"3.4.8\" -D__STDC_FORMAT_MACROS -I/mesos/include -I/mesos/build/include -I/mesos/build/include/mesos -I/mesos/build/src -I/mesos/src -I/mesos/3rdparty/libprocess/src/../include -I/mesos/3rdparty/stout/include -isystem /usr/include/apr-1.0 -isystem /mesos/build/3rdparty/boost-1.53.0/src/boost-1.53.0 -isystem /mesos/build/3rdparty/elfio-3.2/src/elfio-3.2 -isystem /mesos/build/3rdparty/glog-0.3.3/src/glog-0.3.3-build/include -isystem /mesos/build/3rdparty/picojson-1.3.0/src/picojson-1.3.0 -isystem /mesos/build/3rdparty/protobuf-3.3.0/src/protobuf-3.3.0/src -isystem /usr/include/subversion-1 -isystem /mesos/build/3rdparty/http_parser-2.6.2/src/http_parser-2.6.2 -isystem /mesos/build/3rdparty/zookeeper-3.4.8/src/zookeeper-3.4.8/src/c/include -isystem /mesos/build/3rdparty/zookeeper-3.4.8/src/zookeeper-3.4.8/src/c/generated -isystem /mesos/build/3rdparty/nvml-352.79/src/nvml-352.79 -isystem /mesos/build/3rdparty/leveldb-1.19/src/leveldb-1.19/include -isystem /mesos/build/3rdparty/googletest-1.8.0/src/googletest-1.8.0/googlemock/include -isystem /mesos/build/3rdparty/googletest-1.8.0/src/googletest-1.8.0/googletest/include  -std=c++11 -Wformat-security -fstack-protector -fPIE   -o CMakeFiles/mesos-tests.dir/containerizer/docker_tests.cpp.o -c /mesos/src/tests/containerizer/docker_tests.cpp
[ 91%] Building CXX object src/tests/CMakeFiles/mesos-tests.dir/authorization_tests.cpp.o
cd /mesos/build/src/tests && /usr/bin/g++  -DBUILD_DIR=\"/mesos/build\" -DBUILD_FLAGS=\"\" -DBUILD_JAVA_JVM_LIBRARY=\"\" -DHAS_AUTHENTICATION=1 -DHAVE_LIBZ -DLIBDIR=\"/usr/local/libmesos\" -DPICOJSON_USE_INT64 -DPKGDATADIR=\"/usr/local/share/mesos\" -DPKGLIBEXECDIR=\"/usr/local/libexec/mesos\" -DPKGMODULEDIR=\"\" -DSBINDIR=\"\" -DSOURCE_DIR=\"/mesos\" -DTESTLIBEXECDIR=\"\" -DUSE_CMAKE_BUILD_CONFIG -DUSE_SSL_SOCKET=1 -DUSE_STATIC_LIB -DVERSION=\"1.5.0\" -DZOOKEEPER_VERSION=\"3.4.8\" -D__STDC_FORMAT_MACROS -I/mesos/include -I/mesos/build/include -I/mesos/build/include/mesos -I/mesos/build/src -I/mesos/src -I/mesos/3rdparty/libprocess/src/../include -I/mesos/3rdparty/stout/include -isystem /usr/include/apr-1.0 -isystem /mesos/build/3rdparty/boost-1.53.0/src/boost-1.53.0 -isystem /mesos/build/3rdparty/elfio-3.2/src/elfio-3.2 -isystem /mesos/build/3rdparty/glog-0.3.3/src/glog-0.3.3-build/include -isystem /mesos/build/3rdparty/picojson-1.3.0/src/picojson-1.3.0 -isystem /mesos/build/3rdparty/protobuf-3.3.0/src/protobuf-3.3.0/src -isystem /usr/include/subversion-1 -isystem /mesos/build/3rdparty/http_parser-2.6.2/src/http_parser-2.6.2 -isystem /mesos/build/3rdparty/zookeeper-3.4.8/src/zookeeper-3.4.8/src/c/include -isystem /mesos/build/3rdparty/zookeeper-3.4.8/src/zookeeper-3.4.8/src/c/generated -isystem /mesos/build/3rdparty/nvml-352.79/src/nvml-352.79 -isystem /mesos/build/3rdparty/leveldb-1.19/src/leveldb-1.19/include -isystem /mesos/build/3rdparty/googletest-1.8.0/src/googletest-1.8.0/googlemock/include -isystem /mesos/build/3rdparty/googletest-1.8.0/src/googletest-1.8.0/googletest/include  -std=c++11 -Wformat-security -fstack-protector -fPIE   -o CMakeFiles/mesos-tests.dir/authorization_tests.cpp.o -c /mesos/src/tests/authorization_tests.cpp
[ 91%] Building CXX object src/tests/CMakeFiles/mesos-tests.dir/container_logger_tests.cpp.o
cd /mesos/build/src/tests && /usr/bin/g++  -DBUILD_DIR=\"/mesos/build\" -DBUILD_FLAGS=\"\" -DBUILD_JAVA_JVM_LIBRARY=\"\" -DHAS_AUTHENTICATION=1 -DHAVE_LIBZ -DLIBDIR=\"/usr/local/libmesos\" -DPICOJSON_USE_INT64 -DPKGDATADIR=\"/usr/local/share/mesos\" -DPKGLIBEXECDIR=\"/usr/local/libexec/mesos\" -DPKGMODULEDIR=\"\" -DSBINDIR=\"\" -DSOURCE_DIR=\"/mesos\" -DTESTLIBEXECDIR=\"\" -DUSE_CMAKE_BUILD_CONFIG -DUSE_SSL_SOCKET=1 -DUSE_STATIC_LIB -DVERSION=\"1.5.0\" -DZOOKEEPER_VERSION=\"3.4.8\" -D__STDC_FORMAT_MACROS -I/mesos/include -I/mesos/build/include -I/mesos/build/include/mesos -I/mesos/build/src -I/mesos/src -I/mesos/3rdparty/libprocess/src/../include -I/mesos/3rdparty/stout/include -isystem /usr/include/apr-1.0 -isystem /mesos/build/3rdparty/boost-1.53.0/src/boost-1.53.0 -isystem /mesos/build/3rdparty/elfio-3.2/src/elfio-3.2 -isystem /mesos/build/3rdparty/glog-0.3.3/src/glog-0.3.3-build/include -isystem /mesos/build/3rdparty/picojson-1.3.0/src/picojson-1.3.0 -isystem /mesos/build/3rdparty/protobuf-3.3.0/src/protobuf-3.3.0/src -isystem /usr/include/subversion-1 -isystem /mesos/build/3rdparty/http_parser-2.6.2/src/http_parser-2.6.2 -isystem /mesos/build/3rdparty/zookeeper-3.4.8/src/zookeeper-3.4.8/src/c/include -isystem /mesos/build/3rdparty/zookeeper-3.4.8/src/zookeeper-3.4.8/src/c/generated -isystem /mesos/build/3rdparty/nvml-352.79/src/nvml-352.79 -isystem /mesos/build/3rdparty/leveldb-1.19/src/leveldb-1.19/include -isystem /mesos/build/3rdparty/googletest-1.8.0/src/googletest-1.8.0/googlemock/include -isystem /mesos/build/3rdparty/googletest-1.8.0/src/googletest-1.8.0/googletest/include  -std=c++11 -Wformat-security -fstack-protector -fPIE   -o CMakeFiles/mesos-tests.dir/container_logger_tests.cpp.o -c /mesos/src/tests/container_logger_tests.cpp
[ 91%] Building CXX object src/tests/CMakeFiles/mesos-tests.dir/cram_md5_authentication_tests.cpp.o
cd /mesos/build/src/tests && /usr/bin/g++  -DBUILD_DIR=\"/mesos/build\" -DBUILD_FLAGS=\"\" -DBUILD_JAVA_JVM_LIBRARY=\"\" -DHAS_AUTHENTICATION=1 -DHAVE_LIBZ -DLIBDIR=\"/usr/local/libmesos\" -DPICOJSON_USE_INT64 -DPKGDATADIR=\"/usr/local/share/mesos\" -DPKGLIBEXECDIR=\"/usr/local/libexec/mesos\" -DPKGMODULEDIR=\"\" -DSBINDIR=\"\" -DSOURCE_DIR=\"/mesos\" -DTESTLIBEXECDIR=\"\" -DUSE_CMAKE_BUILD_CONFIG -DUSE_SSL_SOCKET=1 -DUSE_STATIC_LIB -DVERSION=\"1.5.0\" -DZOOKEEPER_VERSION=\"3.4.8\" -D__STDC_FORMAT_MACROS -I/mesos/include -I/mesos/build/include -I/mesos/build/include/mesos -I/mesos/build/src -I/mesos/src -I/mesos/3rdparty/libprocess/src/../include -I/mesos/3rdparty/stout/include -isystem /usr/include/apr-1.0 -isystem /mesos/build/3rdparty/boost-1.53.0/src/boost-1.53.0 -isystem /mesos/build/3rdparty/elfio-3.2/src/elfio-3.2 -isystem /mesos/build/3rdparty/glog-0.3.3/src/glog-0.3.3-build/include -isystem /mesos/build/3rdparty/picojson-1.3.0/src/picojson-1.3.0 -isystem /mesos/build/3rdparty/protobuf-3.3.0/src/protobuf-3.3.0/src -isystem /usr/include/subversion-1 -isystem /mesos/build/3rdparty/http_parser-2.6.2/src/http_parser-2.6.2 -isystem /mesos/build/3rdparty/zookeeper-3.4.8/src/zookeeper-3.4.8/src/c/include -isystem /mesos/build/3rdparty/zookeeper-3.4.8/src/zookeeper-3.4.8/src/c/generated -isystem /mesos/build/3rdparty/nvml-352.79/src/nvml-352.79 -isystem /mesos/build/3rdparty/leveldb-1.19/src/leveldb-1.19/include -isystem /mesos/build/3rdparty/googletest-1.8.0/src/googletest-1.8.0/googlemock/include -isystem /mesos/build/3rdparty/googletest-1.8.0/src/googletest-1.8.0/googletest/include  -std=c++11 -Wformat-security -fstack-protector -fPIE   -o CMakeFiles/mesos-tests.dir/cram_md5_authentication_tests.cpp.o -c /mesos/src/tests/cram_md5_authentication_tests.cpp
[ 91%] Building CXX object src/tests/CMakeFiles/mesos-tests.dir/disk_quota_tests.cpp.o
cd /mesos/build/src/tests && /usr/bin/g++  -DBUILD_DIR=\"/mesos/build\" -DBUILD_FLAGS=\"\" -DBUILD_JAVA_JVM_LIBRARY=\"\" -DHAS_AUTHENTICATION=1 -DHAVE_LIBZ -DLIBDIR=\"/usr/local/libmesos\" -DPICOJSON_USE_INT64 -DPKGDATADIR=\"/usr/local/share/mesos\" -DPKGLIBEXECDIR=\"/usr/local/libexec/mesos\" -DPKGMODULEDIR=\"\" -DSBINDIR=\"\" -DSOURCE_DIR=\"/mesos\" -DTESTLIBEXECDIR=\"\" -DUSE_CMAKE_BUILD_CONFIG -DUSE_SSL_SOCKET=1 -DUSE_STATIC_LIB -DVERSION=\"1.5.0\" -DZOOKEEPER_VERSION=\"3.4.8\" -D__STDC_FORMAT_MACROS -I/mesos/include -I/mesos/build/include -I/mesos/build/include/mesos -I/mesos/build/src -I/mesos/src -I/mesos/3rdparty/libprocess/src/../include -I/mesos/3rdparty/stout/include -isystem /usr/include/apr-1.0 -isystem /mesos/build/3rdparty/boost-1.53.0/src/boost-1.53.0 -isystem /mesos/build/3rdparty/elfio-3.2/src/elfio-3.2 -isystem /mesos/build/3rdparty/glog-0.3.3/src/glog-0.3.3-build/include -isystem /mesos/build/3rdparty/picojson-1.3.0/src/picojson-1.3.0 -isystem /mesos/build/3rdparty/protobuf-3.3.0/src/protobuf-3.3.0/src -isystem /usr/include/subversion-1 -isystem /mesos/build/3rdparty/http_parser-2.6.2/src/http_parser-2.6.2 -isystem /mesos/build/3rdparty/zookeeper-3.4.8/src/zookeeper-3.4.8/src/c/include -isystem /mesos/build/3rdparty/zookeeper-3.4.8/src/zookeeper-3.4.8/src/c/generated -isystem /mesos/build/3rdparty/nvml-352.79/src/nvml-352.79 -isystem /mesos/build/3rdparty/leveldb-1.19/src/leveldb-1.19/include -isystem /mesos/build/3rdparty/googletest-1.8.0/src/googletest-1.8.0/googlemock/include -isystem /mesos/build/3rdparty/googletest-1.8.0/src/googletest-1.8.0/googletest/include  -std=c++11 -Wformat-security -fstack-protector -fPIE   -o CMakeFiles/mesos-tests.dir/disk_quota_tests.cpp.o -c /mesos/src/tests/disk_quota_tests.cpp
[ 91%] Building CXX object src/tests/CMakeFiles/mesos-tests.dir/dynamic_weights_tests.cpp.o
cd /mesos/build/src/tests && /usr/bin/g++  -DBUILD_DIR=\"/mesos/build\" -DBUILD_FLAGS=\"\" -DBUILD_JAVA_JVM_LIBRARY=\"\" -DHAS_AUTHENTICATION=1 -DHAVE_LIBZ -DLIBDIR=\"/usr/local/libmesos\" -DPICOJSON_USE_INT64 -DPKGDATADIR=\"/usr/local/share/mesos\" -DPKGLIBEXECDIR=\"/usr/local/libexec/mesos\" -DPKGMODULEDIR=\"\" -DSBINDIR=\"\" -DSOURCE_DIR=\"/mesos\" -DTESTLIBEXECDIR=\"\" -DUSE_CMAKE_BUILD_CONFIG -DUSE_SSL_SOCKET=1 -DUSE_STATIC_LIB -DVERSION=\"1.5.0\" -DZOOKEEPER_VERSION=\"3.4.8\" -D__STDC_FORMAT_MACROS -I/mesos/include -I/mesos/build/include -I/mesos/build/include/mesos -I/mesos/build/src -I/mesos/src -I/mesos/3rdparty/libprocess/src/../include -I/mesos/3rdparty/stout/include -isystem /usr/include/apr-1.0 -isystem /mesos/build/3rdparty/boost-1.53.0/src/boost-1.53.0 -isystem /mesos/build/3rdparty/elfio-3.2/src/elfio-3.2 -isystem /mesos/build/3rdparty/glog-0.3.3/src/glog-0.3.3-build/include -isystem /mesos/build/3rdparty/picojson-1.3.0/src/picojson-1.3.0 -isystem /mesos/build/3rdparty/protobuf-3.3.0/src/protobuf-3.3.0/src -isystem /usr/include/subversion-1 -isystem /mesos/build/3rdparty/http_parser-2.6.2/src/http_parser-2.6.2 -isystem /mesos/build/3rdparty/zookeeper-3.4.8/src/zookeeper-3.4.8/src/c/include -isystem /mesos/build/3rdparty/zookeeper-3.4.8/src/zookeeper-3.4.8/src/c/generated -isystem /mesos/build/3rdparty/nvml-352.79/src/nvml-352.79 -isystem /mesos/build/3rdparty/leveldb-1.19/src/leveldb-1.19/include -isystem /mesos/build/3rdparty/googletest-1.8.0/src/googletest-1.8.0/googlemock/include -isystem /mesos/build/3rdparty/googletest-1.8.0/src/googletest-1.8.0/googletest/include  -std=c++11 -Wformat-security -fstack-protector -fPIE   -o CMakeFiles/mesos-tests.dir/dynamic_weights_tests.cpp.o -c /mesos/src/tests/dynamic_weights_tests.cpp
[ 91%] Building CXX object src/tests/CMakeFiles/mesos-tests.dir/examples_tests.cpp.o
cd /mesos/build/src/tests && /usr/bin/g++  -DBUILD_DIR=\"/mesos/build\" -DBUILD_FLAGS=\"\" -DBUILD_JAVA_JVM_LIBRARY=\"\" -DHAS_AUTHENTICATION=1 -DHAVE_LIBZ -DLIBDIR=\"/usr/local/libmesos\" -DPICOJSON_USE_INT64 -DPKGDATADIR=\"/usr/local/share/mesos\" -DPKGLIBEXECDIR=\"/usr/local/libexec/mesos\" -DPKGMODULEDIR=\"\" -DSBINDIR=\"\" -DSOURCE_DIR=\"/mesos\" -DTESTLIBEXECDIR=\"\" -DUSE_CMAKE_BUILD_CONFIG -DUSE_SSL_SOCKET=1 -DUSE_STATIC_LIB -DVERSION=\"1.5.0\" -DZOOKEEPER_VERSION=\"3.4.8\" -D__STDC_FORMAT_MACROS -I/mesos/include -I/mesos/build/include -I/mesos/build/include/mesos -I/mesos/build/src -I/mesos/src -I/mesos/3rdparty/libprocess/src/../include -I/mesos/3rdparty/stout/include -isystem /usr/include/apr-1.0 -isystem /mesos/build/3rdparty/boost-1.53.0/src/boost-1.53.0 -isystem /mesos/build/3rdparty/elfio-3.2/src/elfio-3.2 -isystem /mesos/build/3rdparty/glog-0.3.3/src/glog-0.3.3-build/include -isystem /mesos/build/3rdparty/picojson-1.3.0/src/picojson-1.3.0 -isystem /mesos/build/3rdparty/protobuf-3.3.0/src/protobuf-3.3.0/src -isystem /usr/include/subversion-1 -isystem /mesos/build/3rdparty/http_parser-2.6.2/src/http_parser-2.6.2 -isystem /mesos/build/3rdparty/zookeeper-3.4.8/src/zookeeper-3.4.8/src/c/include -isystem /mesos/build/3rdparty/zookeeper-3.4.8/src/zookeeper-3.4.8/src/c/generated -isystem /mesos/build/3rdparty/nvml-352.79/src/nvml-352.79 -isystem /mesos/build/3rdparty/leveldb-1.19/src/leveldb-1.19/include -isystem /mesos/build/3rdparty/googletest-1.8.0/src/googletest-1.8.0/googlemock/include -isystem /mesos/build/3rdparty/googletest-1.8.0/src/googletest-1.8.0/googletest/include  -std=c++11 -Wformat-security -fstack-protector -fPIE   -o CMakeFiles/mesos-tests.dir/examples_tests.cpp.o -c /mesos/src/tests/examples_tests.cpp
[ 91%] Building CXX object src/tests/CMakeFiles/mesos-tests.dir/fetcher_cache_tests.cpp.o
cd /mesos/build/src/tests && /usr/bin/g++  -DBUILD_DIR=\"/mesos/build\" -DBUILD_FLAGS=\"\" -DBUILD_JAVA_JVM_LIBRARY=\"\" -DHAS_AUTHENTICATION=1 -DHAVE_LIBZ -DLIBDIR=\"/usr/local/libmesos\" -DPICOJSON_USE_INT64 -DPKGDATADIR=\"/usr/local/share/mesos\" -DPKGLIBEXECDIR=\"/usr/local/libexec/mesos\" -DPKGMODULEDIR=\"\" -DSBINDIR=\"\" -DSOURCE_DIR=\"/mesos\" -DTESTLIBEXECDIR=\"\" -DUSE_CMAKE_BUILD_CONFIG -DUSE_SSL_SOCKET=1 -DUSE_STATIC_LIB -DVERSION=\"1.5.0\" -DZOOKEEPER_VERSION=\"3.4.8\" -D__STDC_FORMAT_MACROS -I/mesos/include -I/mesos/build/include -I/mesos/build/include/mesos -I/mesos/build/src -I/mesos/src -I/mesos/3rdparty/libprocess/src/../include -I/mesos/3rdparty/stout/include -isystem /usr/include/apr-1.0 -isystem /mesos/build/3rdparty/boost-1.53.0/src/boost-1.53.0 -isystem /mesos/build/3rdparty/elfio-3.2/src/elfio-3.2 -isystem /mesos/build/3rdparty/glog-0.3.3/src/glog-0.3.3-build/include -isystem /mesos/build/3rdparty/picojson-1.3.0/src/picojson-1.3.0 -isystem /mesos/build/3rdparty/protobuf-3.3.0/src/protobuf-3.3.0/src -isystem /usr/include/subversion-1 -isystem /mesos/build/3rdparty/http_parser-2.6.2/src/http_parser-2.6.2 -isystem /mesos/build/3rdparty/zookeeper-3.4.8/src/zookeeper-3.4.8/src/c/include -isystem /mesos/build/3rdparty/zookeeper-3.4.8/src/zookeeper-3.4.8/src/c/generated -isystem /mesos/build/3rdparty/nvml-352.79/src/nvml-352.79 -isystem /mesos/build/3rdparty/leveldb-1.19/src/leveldb-1.19/include -isystem /mesos/build/3rdparty/googletest-1.8.0/src/googletest-1.8.0/googlemock/include -isystem /mesos/build/3rdparty/googletest-1.8.0/src/googletest-1.8.0/googletest/include  -std=c++11 -Wformat-security -fstack-protector -fPIE   -o CMakeFiles/mesos-tests.dir/fetcher_cache_tests.cpp.o -c /mesos/src/tests/fetcher_cache_tests.cpp
[ 92%] Building CXX object src/tests/CMakeFiles/mesos-tests.dir/hdfs_tests.cpp.o
cd /mesos/build/src/tests && /usr/bin/g++  -DBUILD_DIR=\"/mesos/build\" -DBUILD_FLAGS=\"\" -DBUILD_JAVA_JVM_LIBRARY=\"\" -DHAS_AUTHENTICATION=1 -DHAVE_LIBZ -DLIBDIR=\"/usr/local/libmesos\" -DPICOJSON_USE_INT64 -DPKGDATADIR=\"/usr/local/share/mesos\" -DPKGLIBEXECDIR=\"/usr/local/libexec/mesos\" -DPKGMODULEDIR=\"\" -DSBINDIR=\"\" -DSOURCE_DIR=\"/mesos\" -DTESTLIBEXECDIR=\"\" -DUSE_CMAKE_BUILD_CONFIG -DUSE_SSL_SOCKET=1 -DUSE_STATIC_LIB -DVERSION=\"1.5.0\" -DZOOKEEPER_VERSION=\"3.4.8\" -D__STDC_FORMAT_MACROS -I/mesos/include -I/mesos/build/include -I/mesos/build/include/mesos -I/mesos/build/src -I/mesos/src -I/mesos/3rdparty/libprocess/src/../include -I/mesos/3rdparty/stout/include -isystem /usr/include/apr-1.0 -isystem /mesos/build/3rdparty/boost-1.53.0/src/boost-1.53.0 -isystem /mesos/build/3rdparty/elfio-3.2/src/elfio-3.2 -isystem /mesos/build/3rdparty/glog-0.3.3/src/glog-0.3.3-build/include -isystem /mesos/build/3rdparty/picojson-1.3.0/src/picojson-1.3.0 -isystem /mesos/build/3rdparty/protobuf-3.3.0/src/protobuf-3.3.0/src -isystem /usr/include/subversion-1 -isystem /mesos/build/3rdparty/http_parser-2.6.2/src/http_parser-2.6.2 -isystem /mesos/build/3rdparty/zookeeper-3.4.8/src/zookeeper-3.4.8/src/c/include -isystem /mesos/build/3rdparty/zookeeper-3.4.8/src/zookeeper-3.4.8/src/c/generated -isystem /mesos/build/3rdparty/nvml-352.79/src/nvml-352.79 -isystem /mesos/build/3rdparty/leveldb-1.19/src/leveldb-1.19/include -isystem /mesos/build/3rdparty/googletest-1.8.0/src/googletest-1.8.0/googlemock/include -isystem /mesos/build/3rdparty/googletest-1.8.0/src/googletest-1.8.0/googletest/include  -std=c++11 -Wformat-security -fstack-protector -fPIE   -o CMakeFiles/mesos-tests.dir/hdfs_tests.cpp.o -c /mesos/src/tests/hdfs_tests.cpp
[ 92%] Building CXX object src/tests/CMakeFiles/mesos-tests.dir/log_tests.cpp.o
cd /mesos/build/src/tests && /usr/bin/g++  -DBUILD_DIR=\"/mesos/build\" -DBUILD_FLAGS=\"\" -DBUILD_JAVA_JVM_LIBRARY=\"\" -DHAS_AUTHENTICATION=1 -DHAVE_LIBZ -DLIBDIR=\"/usr/local/libmesos\" -DPICOJSON_USE_INT64 -DPKGDATADIR=\"/usr/local/share/mesos\" -DPKGLIBEXECDIR=\"/usr/local/libexec/mesos\" -DPKGMODULEDIR=\"\" -DSBINDIR=\"\" -DSOURCE_DIR=\"/mesos\" -DTESTLIBEXECDIR=\"\" -DUSE_CMAKE_BUILD_CONFIG -DUSE_SSL_SOCKET=1 -DUSE_STATIC_LIB -DVERSION=\"1.5.0\" -DZOOKEEPER_VERSION=\"3.4.8\" -D__STDC_FORMAT_MACROS -I/mesos/include -I/mesos/build/include -I/mesos/build/include/mesos -I/mesos/build/src -I/mesos/src -I/mesos/3rdparty/libprocess/src/../include -I/mesos/3rdparty/stout/include -isystem /usr/include/apr-1.0 -isystem /mesos/build/3rdparty/boost-1.53.0/src/boost-1.53.0 -isystem /mesos/build/3rdparty/elfio-3.2/src/elfio-3.2 -isystem /mesos/build/3rdparty/glog-0.3.3/src/glog-0.3.3-build/include -isystem /mesos/build/3rdparty/picojson-1.3.0/src/picojson-1.3.0 -isystem /mesos/build/3rdparty/protobuf-3.3.0/src/protobuf-3.3.0/src -isystem /usr/include/subversion-1 -isystem /mesos/build/3rdparty/http_parser-2.6.2/src/http_parser-2.6.2 -isystem /mesos/build/3rdparty/zookeeper-3.4.8/src/zookeeper-3.4.8/src/c/include -isystem /mesos/build/3rdparty/zookeeper-3.4.8/src/zookeeper-3.4.8/src/c/generated -isystem /mesos/build/3rdparty/nvml-352.79/src/nvml-352.79 -isystem /mesos/build/3rdparty/leveldb-1.19/src/leveldb-1.19/include -isystem /mesos/build/3rdparty/googletest-1.8.0/src/googletest-1.8.0/googlemock/include -isystem /mesos/build/3rdparty/googletest-1.8.0/src/googletest-1.8.0/googletest/include  -std=c++11 -Wformat-security -fstack-protector -fPIE   -o CMakeFiles/mesos-tests.dir/log_tests.cpp.o -c /mesos/src/tests/log_tests.cpp
[ 92%] Building CXX object src/tests/CMakeFiles/mesos-tests.dir/logging_tests.cpp.o
cd /mesos/build/src/tests && /usr/bin/g++  -DBUILD_DIR=\"/mesos/build\" -DBUILD_FLAGS=\"\" -DBUILD_JAVA_JVM_LIBRARY=\"\" -DHAS_AUTHENTICATION=1 -DHAVE_LIBZ -DLIBDIR=\"/usr/local/libmesos\" -DPICOJSON_USE_INT64 -DPKGDATADIR=\"/usr/local/share/mesos\" -DPKGLIBEXECDIR=\"/usr/local/libexec/mesos\" -DPKGMODULEDIR=\"\" -DSBINDIR=\"\" -DSOURCE_DIR=\"/mesos\" -DTESTLIBEXECDIR=\"\" -DUSE_CMAKE_BUILD_CONFIG -DUSE_SSL_SOCKET=1 -DUSE_STATIC_LIB -DVERSION=\"1.5.0\" -DZOOKEEPER_VERSION=\"3.4.8\" -D__STDC_FORMAT_MACROS -I/mesos/include -I/mesos/build/include -I/mesos/build/include/mesos -I/mesos/build/src -I/mesos/src -I/mesos/3rdparty/libprocess/src/../include -I/mesos/3rdparty/stout/include -isystem /usr/include/apr-1.0 -isystem /mesos/build/3rdparty/boost-1.53.0/src/boost-1.53.0 -isystem /mesos/build/3rdparty/elfio-3.2/src/elfio-3.2 -isystem /mesos/build/3rdparty/glog-0.3.3/src/glog-0.3.3-build/include -isystem /mesos/build/3rdparty/picojson-1.3.0/src/picojson-1.3.0 -isystem /mesos/build/3rdparty/protobuf-3.3.0/src/protobuf-3.3.0/src -isystem /usr/include/subversion-1 -isystem /mesos/build/3rdparty/http_parser-2.6.2/src/http_parser-2.6.2 -isystem /mesos/build/3rdparty/zookeeper-3.4.8/src/zookeeper-3.4.8/src/c/include -isystem /mesos/build/3rdparty/zookeeper-3.4.8/src/zookeeper-3.4.8/src/c/generated -isystem /mesos/build/3rdparty/nvml-352.79/src/nvml-352.79 -isystem /mesos/build/3rdparty/leveldb-1.19/src/leveldb-1.19/include -isystem /mesos/build/3rdparty/googletest-1.8.0/src/googletest-1.8.0/googlemock/include -isystem /mesos/build/3rdparty/googletest-1.8.0/src/googletest-1.8.0/googletest/include  -std=c++11 -Wformat-security -fstack-protector -fPIE   -o CMakeFiles/mesos-tests.dir/logging_tests.cpp.o -c /mesos/src/tests/logging_tests.cpp
[ 92%] Building CXX object src/tests/CMakeFiles/mesos-tests.dir/master_allocator_tests.cpp.o
cd /mesos/build/src/tests && /usr/bin/g++  -DBUILD_DIR=\"/mesos/build\" -DBUILD_FLAGS=\"\" -DBUILD_JAVA_JVM_LIBRARY=\"\" -DHAS_AUTHENTICATION=1 -DHAVE_LIBZ -DLIBDIR=\"/usr/local/libmesos\" -DPICOJSON_USE_INT64 -DPKGDATADIR=\"/usr/local/share/mesos\" -DPKGLIBEXECDIR=\"/usr/local/libexec/mesos\" -DPKGMODULEDIR=\"\" -DSBINDIR=\"\" -DSOURCE_DIR=\"/mesos\" -DTESTLIBEXECDIR=\"\" -DUSE_CMAKE_BUILD_CONFIG -DUSE_SSL_SOCKET=1 -DUSE_STATIC_LIB -DVERSION=\"1.5.0\" -DZOOKEEPER_VERSION=\"3.4.8\" -D__STDC_FORMAT_MACROS -I/mesos/include -I/mesos/build/include -I/mesos/build/include/mesos -I/mesos/build/src -I/mesos/src -I/mesos/3rdparty/libprocess/src/../include -I/mesos/3rdparty/stout/include -isystem /usr/include/apr-1.0 -isystem /mesos/build/3rdparty/boost-1.53.0/src/boost-1.53.0 -isystem /mesos/build/3rdparty/elfio-3.2/src/elfio-3.2 -isystem /mesos/build/3rdparty/glog-0.3.3/src/glog-0.3.3-build/include -isystem /mesos/build/3rdparty/picojson-1.3.0/src/picojson-1.3.0 -isystem /mesos/build/3rdparty/protobuf-3.3.0/src/protobuf-3.3.0/src -isystem /usr/include/subversion-1 -isystem /mesos/build/3rdparty/http_parser-2.6.2/src/http_parser-2.6.2 -isystem /mesos/build/3rdparty/zookeeper-3.4.8/src/zookeeper-3.4.8/src/c/include -isystem /mesos/build/3rdparty/zookeeper-3.4.8/src/zookeeper-3.4.8/src/c/generated -isystem /mesos/build/3rdparty/nvml-352.79/src/nvml-352.79 -isystem /mesos/build/3rdparty/leveldb-1.19/src/leveldb-1.19/include -isystem /mesos/build/3rdparty/googletest-1.8.0/src/googletest-1.8.0/googlemock/include -isystem /mesos/build/3rdparty/googletest-1.8.0/src/googletest-1.8.0/googletest/include  -std=c++11 -Wformat-security -fstack-protector -fPIE   -o CMakeFiles/mesos-tests.dir/master_allocator_tests.cpp.o -c /mesos/src/tests/master_allocator_tests.cpp
[ 92%] Building CXX object src/tests/CMakeFiles/mesos-tests.dir/master_authorization_tests.cpp.o
cd /mesos/build/src/tests && /usr/bin/g++  -DBUILD_DIR=\"/mesos/build\" -DBUILD_FLAGS=\"\" -DBUILD_JAVA_JVM_LIBRARY=\"\" -DHAS_AUTHENTICATION=1 -DHAVE_LIBZ -DLIBDIR=\"/usr/local/libmesos\" -DPICOJSON_USE_INT64 -DPKGDATADIR=\"/usr/local/share/mesos\" -DPKGLIBEXECDIR=\"/usr/local/libexec/mesos\" -DPKGMODULEDIR=\"\" -DSBINDIR=\"\" -DSOURCE_DIR=\"/mesos\" -DTESTLIBEXECDIR=\"\" -DUSE_CMAKE_BUILD_CONFIG -DUSE_SSL_SOCKET=1 -DUSE_STATIC_LIB -DVERSION=\"1.5.0\" -DZOOKEEPER_VERSION=\"3.4.8\" -D__STDC_FORMAT_MACROS -I/mesos/include -I/mesos/build/include -I/mesos/build/include/mesos -I/mesos/build/src -I/mesos/src -I/mesos/3rdparty/libprocess/src/../include -I/mesos/3rdparty/stout/include -isystem /usr/include/apr-1.0 -isystem /mesos/build/3rdparty/boost-1.53.0/src/boost-1.53.0 -isystem /mesos/build/3rdparty/elfio-3.2/src/elfio-3.2 -isystem /mesos/build/3rdparty/glog-0.3.3/src/glog-0.3.3-build/include -isystem /mesos/build/3rdparty/picojson-1.3.0/src/picojson-1.3.0 -isystem /mesos/build/3rdparty/protobuf-3.3.0/src/protobuf-3.3.0/src -isystem /usr/include/subversion-1 -isystem /mesos/build/3rdparty/http_parser-2.6.2/src/http_parser-2.6.2 -isystem /mesos/build/3rdparty/zookeeper-3.4.8/src/zookeeper-3.4.8/src/c/include -isystem /mesos/build/3rdparty/zookeeper-3.4.8/src/zookeeper-3.4.8/src/c/generated -isystem /mesos/build/3rdparty/nvml-352.79/src/nvml-352.79 -isystem /mesos/build/3rdparty/leveldb-1.19/src/leveldb-1.19/include -isystem /mesos/build/3rdparty/googletest-1.8.0/src/googletest-1.8.0/googlemock/include -isystem /mesos/build/3rdparty/googletest-1.8.0/src/googletest-1.8.0/googletest/include  -std=c++11 -Wformat-security -fstack-protector -fPIE   -o CMakeFiles/mesos-tests.dir/master_authorization_tests.cpp.o -c /mesos/src/tests/master_authorization_tests.cpp
[ 92%] Building CXX object src/tests/CMakeFiles/mesos-tests.dir/master_contender_detector_tests.cpp.o
cd /mesos/build/src/tests && /usr/bin/g++  -DBUILD_DIR=\"/mesos/build\" -DBUILD_FLAGS=\"\" -DBUILD_JAVA_JVM_LIBRARY=\"\" -DHAS_AUTHENTICATION=1 -DHAVE_LIBZ -DLIBDIR=\"/usr/local/libmesos\" -DPICOJSON_USE_INT64 -DPKGDATADIR=\"/usr/local/share/mesos\" -DPKGLIBEXECDIR=\"/usr/local/libexec/mesos\" -DPKGMODULEDIR=\"\" -DSBINDIR=\"\" -DSOURCE_DIR=\"/mesos\" -DTESTLIBEXECDIR=\"\" -DUSE_CMAKE_BUILD_CONFIG -DUSE_SSL_SOCKET=1 -DUSE_STATIC_LIB -DVERSION=\"1.5.0\" -DZOOKEEPER_VERSION=\"3.4.8\" -D__STDC_FORMAT_MACROS -I/mesos/include -I/mesos/build/include -I/mesos/build/include/mesos -I/mesos/build/src -I/mesos/src -I/mesos/3rdparty/libprocess/src/../include -I/mesos/3rdparty/stout/include -isystem /usr/include/apr-1.0 -isystem /mesos/build/3rdparty/boost-1.53.0/src/boost-1.53.0 -isystem /mesos/build/3rdparty/elfio-3.2/src/elfio-3.2 -isystem /mesos/build/3rdparty/glog-0.3.3/src/glog-0.3.3-build/include -isystem /mesos/build/3rdparty/picojson-1.3.0/src/picojson-1.3.0 -isystem /mesos/build/3rdparty/protobuf-3.3.0/src/protobuf-3.3.0/src -isystem /usr/include/subversion-1 -isystem /mesos/build/3rdparty/http_parser-2.6.2/src/http_parser-2.6.2 -isystem /mesos/build/3rdparty/zookeeper-3.4.8/src/zookeeper-3.4.8/src/c/include -isystem /mesos/build/3rdparty/zookeeper-3.4.8/src/zookeeper-3.4.8/src/c/generated -isystem /mesos/build/3rdparty/nvml-352.79/src/nvml-352.79 -isystem /mesos/build/3rdparty/leveldb-1.19/src/leveldb-1.19/include -isystem /mesos/build/3rdparty/googletest-1.8.0/src/googletest-1.8.0/googlemock/include -isystem /mesos/build/3rdparty/googletest-1.8.0/src/googletest-1.8.0/googletest/include  -std=c++11 -Wformat-security -fstack-protector -fPIE   -o CMakeFiles/mesos-tests.dir/master_contender_detector_tests.cpp.o -c /mesos/src/tests/master_contender_detector_tests.cpp
[ 92%] Building CXX object src/tests/CMakeFiles/mesos-tests.dir/master_quota_tests.cpp.o
cd /mesos/build/src/tests && /usr/bin/g++  -DBUILD_DIR=\"/mesos/build\" -DBUILD_FLAGS=\"\" -DBUILD_JAVA_JVM_LIBRARY=\"\" -DHAS_AUTHENTICATION=1 -DHAVE_LIBZ -DLIBDIR=\"/usr/local/libmesos\" -DPICOJSON_USE_INT64 -DPKGDATADIR=\"/usr/local/share/mesos\" -DPKGLIBEXECDIR=\"/usr/local/libexec/mesos\" -DPKGMODULEDIR=\"\" -DSBINDIR=\"\" -DSOURCE_DIR=\"/mesos\" -DTESTLIBEXECDIR=\"\" -DUSE_CMAKE_BUILD_CONFIG -DUSE_SSL_SOCKET=1 -DUSE_STATIC_LIB -DVERSION=\"1.5.0\" -DZOOKEEPER_VERSION=\"3.4.8\" -D__STDC_FORMAT_MACROS -I/mesos/include -I/mesos/build/include -I/mesos/build/include/mesos -I/mesos/build/src -I/mesos/src -I/mesos/3rdparty/libprocess/src/../include -I/mesos/3rdparty/stout/include -isystem /usr/include/apr-1.0 -isystem /mesos/build/3rdparty/boost-1.53.0/src/boost-1.53.0 -isystem /mesos/build/3rdparty/elfio-3.2/src/elfio-3.2 -isystem /mesos/build/3rdparty/glog-0.3.3/src/glog-0.3.3-build/include -isystem /mesos/build/3rdparty/picojson-1.3.0/src/picojson-1.3.0 -isystem /mesos/build/3rdparty/protobuf-3.3.0/src/protobuf-3.3.0/src -isystem /usr/include/subversion-1 -isystem /mesos/build/3rdparty/http_parser-2.6.2/src/http_parser-2.6.2 -isystem /mesos/build/3rdparty/zookeeper-3.4.8/src/zookeeper-3.4.8/src/c/include -isystem /mesos/build/3rdparty/zookeeper-3.4.8/src/zookeeper-3.4.8/src/c/generated -isystem /mesos/build/3rdparty/nvml-352.79/src/nvml-352.79 -isystem /mesos/build/3rdparty/leveldb-1.19/src/leveldb-1.19/include -isystem /mesos/build/3rdparty/googletest-1.8.0/src/googletest-1.8.0/googlemock/include -isystem /mesos/build/3rdparty/googletest-1.8.0/src/googletest-1.8.0/googletest/include  -std=c++11 -Wformat-security -fstack-protector -fPIE   -o CMakeFiles/mesos-tests.dir/master_quota_tests.cpp.o -c /mesos/src/tests/master_quota_tests.cpp
[ 93%] Building CXX object src/tests/CMakeFiles/mesos-tests.dir/master_tests.cpp.o
cd /mesos/build/src/tests && /usr/bin/g++  -DBUILD_DIR=\"/mesos/build\" -DBUILD_FLAGS=\"\" -DBUILD_JAVA_JVM_LIBRARY=\"\" -DHAS_AUTHENTICATION=1 -DHAVE_LIBZ -DLIBDIR=\"/usr/local/libmesos\" -DPICOJSON_USE_INT64 -DPKGDATADIR=\"/usr/local/share/mesos\" -DPKGLIBEXECDIR=\"/usr/local/libexec/mesos\" -DPKGMODULEDIR=\"\" -DSBINDIR=\"\" -DSOURCE_DIR=\"/mesos\" -DTESTLIBEXECDIR=\"\" -DUSE_CMAKE_BUILD_CONFIG -DUSE_SSL_SOCKET=1 -DUSE_STATIC_LIB -DVERSION=\"1.5.0\" -DZOOKEEPER_VERSION=\"3.4.8\" -D__STDC_FORMAT_MACROS -I/mesos/include -I/mesos/build/include -I/mesos/build/include/mesos -I/mesos/build/src -I/mesos/src -I/mesos/3rdparty/libprocess/src/../include -I/mesos/3rdparty/stout/include -isystem /usr/include/apr-1.0 -isystem /mesos/build/3rdparty/boost-1.53.0/src/boost-1.53.0 -isystem /mesos/build/3rdparty/elfio-3.2/src/elfio-3.2 -isystem /mesos/build/3rdparty/glog-0.3.3/src/glog-0.3.3-build/include -isystem /mesos/build/3rdparty/picojson-1.3.0/src/picojson-1.3.0 -isystem /mesos/build/3rdparty/protobuf-3.3.0/src/protobuf-3.3.0/src -isystem /usr/include/subversion-1 -isystem /mesos/build/3rdparty/http_parser-2.6.2/src/http_parser-2.6.2 -isystem /mesos/build/3rdparty/zookeeper-3.4.8/src/zookeeper-3.4.8/src/c/include -isystem /mesos/build/3rdparty/zookeeper-3.4.8/src/zookeeper-3.4.8/src/c/generated -isystem /mesos/build/3rdparty/nvml-352.79/src/nvml-352.79 -isystem /mesos/build/3rdparty/leveldb-1.19/src/leveldb-1.19/include -isystem /mesos/build/3rdparty/googletest-1.8.0/src/googletest-1.8.0/googlemock/include -isystem /mesos/build/3rdparty/googletest-1.8.0/src/googletest-1.8.0/googletest/include  -std=c++11 -Wformat-security -fstack-protector -fPIE   -o CMakeFiles/mesos-tests.dir/master_tests.cpp.o -c /mesos/src/tests/master_tests.cpp
[ 93%] Building CXX object src/tests/CMakeFiles/mesos-tests.dir/master_validation_tests.cpp.o
cd /mesos/build/src/tests && /usr/bin/g++  -DBUILD_DIR=\"/mesos/build\" -DBUILD_FLAGS=\"\" -DBUILD_JAVA_JVM_LIBRARY=\"\" -DHAS_AUTHENTICATION=1 -DHAVE_LIBZ -DLIBDIR=\"/usr/local/libmesos\" -DPICOJSON_USE_INT64 -DPKGDATADIR=\"/usr/local/share/mesos\" -DPKGLIBEXECDIR=\"/usr/local/libexec/mesos\" -DPKGMODULEDIR=\"\" -DSBINDIR=\"\" -DSOURCE_DIR=\"/mesos\" -DTESTLIBEXECDIR=\"\" -DUSE_CMAKE_BUILD_CONFIG -DUSE_SSL_SOCKET=1 -DUSE_STATIC_LIB -DVERSION=\"1.5.0\" -DZOOKEEPER_VERSION=\"3.4.8\" -D__STDC_FORMAT_MACROS -I/mesos/include -I/mesos/build/include -I/mesos/build/include/mesos -I/mesos/build/src -I/mesos/src -I/mesos/3rdparty/libprocess/src/../include -I/mesos/3rdparty/stout/include -isystem /usr/include/apr-1.0 -isystem /mesos/build/3rdparty/boost-1.53.0/src/boost-1.53.0 -isystem /mesos/build/3rdparty/elfio-3.2/src/elfio-3.2 -isystem /mesos/build/3rdparty/glog-0.3.3/src/glog-0.3.3-build/include -isystem /mesos/build/3rdparty/picojson-1.3.0/src/picojson-1.3.0 -isystem /mesos/build/3rdparty/protobuf-3.3.0/src/protobuf-3.3.0/src -isystem /usr/include/subversion-1 -isystem /mesos/build/3rdparty/http_parser-2.6.2/src/http_parser-2.6.2 -isystem /mesos/build/3rdparty/zookeeper-3.4.8/src/zookeeper-3.4.8/src/c/include -isystem /mesos/build/3rdparty/zookeeper-3.4.8/src/zookeeper-3.4.8/src/c/generated -isystem /mesos/build/3rdparty/nvml-352.79/src/nvml-352.79 -isystem /mesos/build/3rdparty/leveldb-1.19/src/leveldb-1.19/include -isystem /mesos/build/3rdparty/googletest-1.8.0/src/googletest-1.8.0/googlemock/include -isystem /mesos/build/3rdparty/googletest-1.8.0/src/googletest-1.8.0/googletest/include  -std=c++11 -Wformat-security -fstack-protector -fPIE   -o CMakeFiles/mesos-tests.dir/master_validation_tests.cpp.o -c /mesos/src/tests/master_validation_tests.cpp
[ 93%] Building CXX object src/tests/CMakeFiles/mesos-tests.dir/metrics_tests.cpp.o
cd /mesos/build/src/tests && /usr/bin/g++  -DBUILD_DIR=\"/mesos/build\" -DBUILD_FLAGS=\"\" -DBUILD_JAVA_JVM_LIBRARY=\"\" -DHAS_AUTHENTICATION=1 -DHAVE_LIBZ -DLIBDIR=\"/usr/local/libmesos\" -DPICOJSON_USE_INT64 -DPKGDATADIR=\"/usr/local/share/mesos\" -DPKGLIBEXECDIR=\"/usr/local/libexec/mesos\" -DPKGMODULEDIR=\"\" -DSBINDIR=\"\" -DSOURCE_DIR=\"/mesos\" -DTESTLIBEXECDIR=\"\" -DUSE_CMAKE_BUILD_CONFIG -DUSE_SSL_SOCKET=1 -DUSE_STATIC_LIB -DVERSION=\"1.5.0\" -DZOOKEEPER_VERSION=\"3.4.8\" -D__STDC_FORMAT_MACROS -I/mesos/include -I/mesos/build/include -I/mesos/build/include/mesos -I/mesos/build/src -I/mesos/src -I/mesos/3rdparty/libprocess/src/../include -I/mesos/3rdparty/stout/include -isystem /usr/include/apr-1.0 -isystem /mesos/build/3rdparty/boost-1.53.0/src/boost-1.53.0 -isystem /mesos/build/3rdparty/elfio-3.2/src/elfio-3.2 -isystem /mesos/build/3rdparty/glog-0.3.3/src/glog-0.3.3-build/include -isystem /mesos/build/3rdparty/picojson-1.3.0/src/picojson-1.3.0 -isystem /mesos/build/3rdparty/protobuf-3.3.0/src/protobuf-3.3.0/src -isystem /usr/include/subversion-1 -isystem /mesos/build/3rdparty/http_parser-2.6.2/src/http_parser-2.6.2 -isystem /mesos/build/3rdparty/zookeeper-3.4.8/src/zookeeper-3.4.8/src/c/include -isystem /mesos/build/3rdparty/zookeeper-3.4.8/src/zookeeper-3.4.8/src/c/generated -isystem /mesos/build/3rdparty/nvml-352.79/src/nvml-352.79 -isystem /mesos/build/3rdparty/leveldb-1.19/src/leveldb-1.19/include -isystem /mesos/build/3rdparty/googletest-1.8.0/src/googletest-1.8.0/googlemock/include -isystem /mesos/build/3rdparty/googletest-1.8.0/src/googletest-1.8.0/googletest/include  -std=c++11 -Wformat-security -fstack-protector -fPIE   -o CMakeFiles/mesos-tests.dir/metrics_tests.cpp.o -c /mesos/src/tests/metrics_tests.cpp
[ 93%] Building CXX object src/tests/CMakeFiles/mesos-tests.dir/module_tests.cpp.o
cd /mesos/build/src/tests && /usr/bin/g++  -DBUILD_DIR=\"/mesos/build\" -DBUILD_FLAGS=\"\" -DBUILD_JAVA_JVM_LIBRARY=\"\" -DHAS_AUTHENTICATION=1 -DHAVE_LIBZ -DLIBDIR=\"/usr/local/libmesos\" -DPICOJSON_USE_INT64 -DPKGDATADIR=\"/usr/local/share/mesos\" -DPKGLIBEXECDIR=\"/usr/local/libexec/mesos\" -DPKGMODULEDIR=\"\" -DSBINDIR=\"\" -DSOURCE_DIR=\"/mesos\" -DTESTLIBEXECDIR=\"\" -DUSE_CMAKE_BUILD_CONFIG -DUSE_SSL_SOCKET=1 -DUSE_STATIC_LIB -DVERSION=\"1.5.0\" -DZOOKEEPER_VERSION=\"3.4.8\" -D__STDC_FORMAT_MACROS -I/mesos/include -I/mesos/build/include -I/mesos/build/include/mesos -I/mesos/build/src -I/mesos/src -I/mesos/3rdparty/libprocess/src/../include -I/mesos/3rdparty/stout/include -isystem /usr/include/apr-1.0 -isystem /mesos/build/3rdparty/boost-1.53.0/src/boost-1.53.0 -isystem /mesos/build/3rdparty/elfio-3.2/src/elfio-3.2 -isystem /mesos/build/3rdparty/glog-0.3.3/src/glog-0.3.3-build/include -isystem /mesos/build/3rdparty/picojson-1.3.0/src/picojson-1.3.0 -isystem /mesos/build/3rdparty/protobuf-3.3.0/src/protobuf-3.3.0/src -isystem /usr/include/subversion-1 -isystem /mesos/build/3rdparty/http_parser-2.6.2/src/http_parser-2.6.2 -isystem /mesos/build/3rdparty/zookeeper-3.4.8/src/zookeeper-3.4.8/src/c/include -isystem /mesos/build/3rdparty/zookeeper-3.4.8/src/zookeeper-3.4.8/src/c/generated -isystem /mesos/build/3rdparty/nvml-352.79/src/nvml-352.79 -isystem /mesos/build/3rdparty/leveldb-1.19/src/leveldb-1.19/include -isystem /mesos/build/3rdparty/googletest-1.8.0/src/googletest-1.8.0/googlemock/include -isystem /mesos/build/3rdparty/googletest-1.8.0/src/googletest-1.8.0/googletest/include  -std=c++11 -Wformat-security -fstack-protector -fPIE   -o CMakeFiles/mesos-tests.dir/module_tests.cpp.o -c /mesos/src/tests/module_tests.cpp
virtual memory exhausted: Cannot allocate memory
virtual memory exhausted: Cannot allocate memory
virtual memory exhausted: Cannot allocate memory
make[3]: *** [src/tests/CMakeFiles/mesos-tests.dir/module_tests.cpp.o] Error 1
make[3]: *** Waiting for unfinished jobs....
make[3]: *** [src/tests/CMakeFiles/mesos-tests.dir/master_quota_tests.cpp.o] Error 1
make[3]: *** [src/tests/CMakeFiles/mesos-tests.dir/master_allocator_tests.cpp.o] Error 1
make[3]: Leaving directory `/mesos/build'
make[2]: *** [src/tests/CMakeFiles/mesos-tests.dir/all] Error 2
make[2]: Leaving directory `/mesos/build'
make[1]: *** [CMakeFiles/check.dir/rule] Error 2
make[1]: Leaving directory `/mesos/build'
make: *** [check] Error 2
+ docker rmi mesos-1504718841-26042
Untagged: mesos-1504718841-26042:latest
Deleted: sha256:b0753e43bb01f34d0c2c3145b420d7175acb1534439ccd09d63346e8a0ab3a6f
Deleted: sha256:5e31792fa5014612a4c65db1057abbcac35f083551d359de4acb9c92cb261948
Deleted: sha256:5fa575aceb1a1f9285f439ebd4d0135037182d2b8c7c656d64005a3be7566f58
Deleted: sha256:aec04c29152044b7363d90589c2914ede7708503c5fcbce9e9a73ce7965c3e1d
Deleted: sha256:f92c96238578ce62b5fea920f54a5afebfe8456255f35c39b21a8b51b3db4e6e
Deleted: sha256:00d7b20743eb93312c9ecaa9c7b3342cf9b1773bb1302fbdbf3edde81e0a815c
Deleted: sha256:a5e24625a3b66bd551c354058514235559ac41b01567f4da8cd254863b0c1245
Deleted: sha256:6c6ef57d8fe725444397fa23bdbe63b838151c44a367cc955309e9f3c49164e7
Deleted: sha256:123b1caab2533f7c91c4c9ed61264348fb194db1042d780efe86a127863b7093
Deleted: sha256:6f748087517369f07c5284bdfe4ca23090c7b052ae4f8acd11502c65890142cb
Deleted: sha256:df82e27e4dc13c8382cf3d87fb1b84fab398f8cfa36b629c168eab91580dbb74
Deleted: sha256:808c0e1d1373cf844e1575f8dc333178fa9a25b47e6a58f2922c34072c1d73eb
Deleted: sha256:a86d126ebde1263f9d1779b9bee4e71a95bebed71859f632955279921603edfd
Deleted: sha256:914dcdbc9ae3cb9cb49c403e904d563d69e8d9da86c6eba910ef220d8dfa9e89
Deleted: sha256:9d37eda1d000789bd2f856c7e864756cbef194ebceac034697ac9fa6e26ca15a
Deleted: sha256:6c1d973a21cc98c2330c84be4eac34fd54d866416d0fa94c342d98c6c6aa7a4b
Deleted: sha256:e1d90f716a308b4d5f3e4364c8cfa5181d4d27021a486aae63982bbd0ec8c1df
Deleted: sha256:f483ee7f375bfc9409262e82eb65b713c1cc965cbfc501abccc8bf1e8074f93c
Deleted: sha256:117e49b751afa5fe19a9f6620acb094c54a63319c866ca1fcbe4285670863ed4
Deleted: sha256:45f9899e361b3770793286c19f37fe60c6cde0ef564bca6ad566f0715d3cdd4a
Deleted: sha256:283ff952771029999b41e231431cedddf19b0ecae12e1b4ed37667dbfaac92ee
Deleted: sha256:a118786ebb647f70945fa14aeb3a535559c2ae05dacb80dfa87b1bd13ab6bb9f
Deleted: sha256:fae9f8cc03627e5a891f314fe7424d56efd1be5875d866d96b86ee7ce68c40da
Deleted: sha256:32b91b84f53b3541a341b7b3211b3f5d31af3538f60c957a3c7dc23c06861574
Deleted: sha256:ab8a881601e5ce6c24bfc12ee5187166dc6864c256ad06ea1317510fbe839b23
Deleted: sha256:7dd3e57c40e8aa3e75631a8de6a39c8cf63043cdc87fedd8ba580b3fa4ed0783
Deleted: sha256:ef494d57acd4d3298bd723742e0604bfa60daac06ad5c599f4d510c9a4b57dc6
Deleted: sha256:408f7c9dfbfefead974e0570cc9aceb60eb10828d9853462d4dcaa712964c3ae
Build step 'Execute shell' marked build as failure
Not sending mail to unregistered user yujie.jay@gmail.com
Not sending mail to unregistered user zhq527725@gmail.com

Mime
View raw message