mesos-builds mailing list archives

Site index · List index
Message view « Date » · « Thread »
Top « Date » · « Thread »
From Apache Jenkins Server <jenk...@builds.apache.org>
Subject Build failed in Jenkins: Mesos-Buildbot » autotools,gcc,--verbose --enable-libevent --enable-ssl,GLOG_v=1 MESOS_VERBOSE=1,centos:7,(ubuntu)&&(!ubuntu-us1)&&(!ubuntu-eu2) #4179
Date Fri, 01 Sep 2017 05:02:56 GMT
See <https://builds.apache.org/job/Mesos-Buildbot/BUILDTOOL=autotools,COMPILER=gcc,CONFIGURATION=--verbose%20--enable-libevent%20--enable-ssl,ENVIRONMENT=GLOG_v=1%20MESOS_VERBOSE=1,OS=centos%3A7,label_exp=(ubuntu)&&(!ubuntu-us1)&&(!ubuntu-eu2)/4179/display/redirect?page=changes>

Changes:

[yujie.jay] Used 'undiscardable' to protect a future in MesosContainerizer.

[yujie.jay] Added MESOS-7926 to 1.3.2 CHANGELOG.

[yujie.jay] Added MESOS-7926 to 1.2.3 CHANGELOG.

------------------------------------------
[...truncated 32.61 MB...]
I0901 05:02:43.359191 30636 slave.cpp:285] Agent using credential for: test-principal
I0901 05:02:43.359215 30636 credentials.hpp:37] Loading credentials for authentication from
'/tmp/Endpoint_SlaveEndpointTest_UnauthorizedRequest_0_g06Q1Y/http_credentials'
I0901 05:02:43.359513 30636 http.cpp:1045] Creating default 'basic' HTTP authenticator for
realm 'mesos-agent-executor'
I0901 05:02:43.359640 30636 http.cpp:1066] Creating default 'jwt' HTTP authenticator for realm
'mesos-agent-executor'
I0901 05:02:43.359872 30636 http.cpp:1045] Creating default 'basic' HTTP authenticator for
realm 'mesos-agent-readonly'
I0901 05:02:43.359978 30636 http.cpp:1066] Creating default 'jwt' HTTP authenticator for realm
'mesos-agent-readonly'
I0901 05:02:43.360149 30636 http.cpp:1045] Creating default 'basic' HTTP authenticator for
realm 'mesos-agent-readwrite'
I0901 05:02:43.360255 30636 http.cpp:1066] Creating default 'jwt' HTTP authenticator for realm
'mesos-agent-readwrite'
I0901 05:02:43.361620 30636 slave.cpp:581] Agent resources: [{"name":"cpus","scalar":{"value":2.0},"type":"SCALAR"},{"name":"mem","scalar":{"value":1024.0},"type":"SCALAR"},{"name":"disk","scalar":{"value":1024.0},"type":"SCALAR"},{"name":"ports","ranges":{"range":[{"begin":31000,"end":32000}]},"type":"RANGES"}]
I0901 05:02:43.361840 30636 slave.cpp:589] Agent attributes: [  ]
I0901 05:02:43.361855 30636 slave.cpp:598] Agent hostname: 4100df12693e
I0901 05:02:43.361999 30633 status_update_manager.cpp:177] Pausing sending status updates
I0901 05:02:43.363595 30629 state.cpp:64] Recovering state from '/tmp/Endpoint_SlaveEndpointTest_UnauthorizedRequest_0_81aIPe/meta'
I0901 05:02:43.363865 30650 status_update_manager.cpp:203] Recovering status update manager
I0901 05:02:43.364048 30640 containerizer.cpp:646] Recovering containerizer
I0901 05:02:43.365257 30632 provisioner.cpp:416] Provisioner recovery complete
I0901 05:02:43.365558 30648 slave.cpp:6296] Finished recovery
I0901 05:02:43.366139 30648 slave.cpp:6478] Querying resource estimator for oversubscribable
resources
I0901 05:02:43.366415 30649 slave.cpp:6492] Received oversubscribable resources {} from the
resource estimator
I0901 05:02:43.368985 30631 process.cpp:3956] Handling HTTP event for process 'slave(813)'
with path: '/slave(813)/monitor/statistics'
I0901 05:02:43.370779 30650 http.cpp:1185] HTTP GET for /slave(813)/monitor/statistics from
172.17.0.7:59452
I0901 05:02:43.370857 30650 http.cpp:976] Authorizing principal 'test-principal' to GET the
'/monitor/statistics' endpoint
I0901 05:02:43.372421 30635 slave.cpp:859] Agent terminating
[       OK ] Endpoint/SlaveEndpointTest.UnauthorizedRequest/0 (30 ms)
[ RUN      ] Endpoint/SlaveEndpointTest.UnauthorizedRequest/1
I0901 05:02:43.384069  9652 containerizer.cpp:290] Using isolation { environment_secret, posix/cpu,
posix/mem, filesystem/posix, network/cni }
W0901 05:02:43.384548  9652 backend.cpp:76] Failed to create 'aufs' backend: AufsBackend requires
root privileges
W0901 05:02:43.384658  9652 backend.cpp:76] Failed to create 'bind' backend: BindBackend requires
root privileges
I0901 05:02:43.384691  9652 provisioner.cpp:255] Using default backend 'copy'
I0901 05:02:43.388064 30630 slave.cpp:252] Mesos agent started on (814)@172.17.0.7:33465
I0901 05:02:43.388087 30630 slave.cpp:253] Flags at startup: --acls="" --appc_simple_discovery_uri_prefix="http://"
--appc_store_dir="/tmp/Endpoint_SlaveEndpointTest_UnauthorizedRequest_1_ldXe4X/store/appc"
--authenticate_http_executors="true" --authenticate_http_readonly="true" --authenticate_http_readwrite="true"
--authenticatee="crammd5" --authentication_backoff_factor="1secs" --authorizer="local" --cgroups_cpu_enable_pids_and_tids_count="false"
--cgroups_enable_cfs="false" --cgroups_hierarchy="/sys/fs/cgroup" --cgroups_limit_swap="false"
--cgroups_root="mesos" --container_disk_watch_interval="15secs" --containerizers="mesos" --credential="/tmp/Endpoint_SlaveEndpointTest_UnauthorizedRequest_1_ldXe4X/credential"
--default_role="*" --disallow_sharing_agent_pid_namespace="false" --disk_watch_interval="1mins"
--docker="docker" --docker_kill_orphans="true" --docker_registry="https://registry-1.docker.io"
--docker_remove_delay="6hrs" --docker_socket="/var/run/docker.sock" --docker_stop_timeout="0ns"
--docker_store_dir="/tmp/Endpoint_SlaveEndpointTest_UnauthorizedRequest_1_ldXe4X/store/docker"
--docker_volume_checkpoint_dir="/var/run/mesos/isolators/docker/volume" --enforce_container_disk_quota="false"
--executor_registration_timeout="1mins" --executor_reregistration_timeout="2secs" --executor_secret_key="/tmp/Endpoint_SlaveEndpointTest_UnauthorizedRequest_1_ldXe4X/executor_secret_key"
--executor_shutdown_grace_period="5secs" --fetcher_cache_dir="/tmp/Endpoint_SlaveEndpointTest_UnauthorizedRequest_1_ldXe4X/fetch"
--fetcher_cache_size="2GB" --frameworks_home="" --gc_delay="1weeks" --gc_disk_headroom="0.1"
--hadoop_home="" --help="false" --hostname_lookup="true" --http_command_executor="false" --http_credentials="/tmp/Endpoint_SlaveEndpointTest_UnauthorizedRequest_1_ldXe4X/http_credentials"
--http_heartbeat_interval="30secs" --initialize_driver_logging="true" --isolation="posix/cpu,posix/mem"
--launcher="posix" --launcher_dir="/mesos/mesos-1.5.0/_build/src" --logbufsecs="0" --logging_level="INFO"
--max_completed_executors_per_framework="150" --oversubscribed_resources_interval="15secs"
--perf_duration="10secs" --perf_interval="1mins" --port="5051" --qos_correction_interval_min="0ns"
--quiet="false" --recover="reconnect" --recovery_timeout="15mins" --registration_backoff_factor="10ms"
--resources="cpus:2;gpus:0;mem:1024;disk:1024;ports:[31000-32000]" --revocable_cpu_low_priority="true"
--runtime_dir="/tmp/Endpoint_SlaveEndpointTest_UnauthorizedRequest_1_ldXe4X" --sandbox_directory="/mnt/mesos/sandbox"
--strict="true" --switch_user="true" --systemd_enable_support="true" --systemd_runtime_directory="/run/systemd/system"
--version="false" --work_dir="/tmp/Endpoint_SlaveEndpointTest_UnauthorizedRequest_1_VyQtNd"
--zk_session_timeout="10secs"
I0901 05:02:43.388515 30630 credentials.hpp:86] Loading credential for authentication from
'/tmp/Endpoint_SlaveEndpointTest_UnauthorizedRequest_1_ldXe4X/credential'
I0901 05:02:43.388711 30630 slave.cpp:285] Agent using credential for: test-principal
I0901 05:02:43.388732 30630 credentials.hpp:37] Loading credentials for authentication from
'/tmp/Endpoint_SlaveEndpointTest_UnauthorizedRequest_1_ldXe4X/http_credentials'
I0901 05:02:43.389055 30630 http.cpp:1045] Creating default 'basic' HTTP authenticator for
realm 'mesos-agent-executor'
I0901 05:02:43.389184 30630 http.cpp:1066] Creating default 'jwt' HTTP authenticator for realm
'mesos-agent-executor'
I0901 05:02:43.389395 30630 http.cpp:1045] Creating default 'basic' HTTP authenticator for
realm 'mesos-agent-readonly'
I0901 05:02:43.389495 30630 http.cpp:1066] Creating default 'jwt' HTTP authenticator for realm
'mesos-agent-readonly'
I0901 05:02:43.389679 30630 http.cpp:1045] Creating default 'basic' HTTP authenticator for
realm 'mesos-agent-readwrite'
I0901 05:02:43.389786 30630 http.cpp:1066] Creating default 'jwt' HTTP authenticator for realm
'mesos-agent-readwrite'
I0901 05:02:43.391122 30630 slave.cpp:581] Agent resources: [{"name":"cpus","scalar":{"value":2.0},"type":"SCALAR"},{"name":"mem","scalar":{"value":1024.0},"type":"SCALAR"},{"name":"disk","scalar":{"value":1024.0},"type":"SCALAR"},{"name":"ports","ranges":{"range":[{"begin":31000,"end":32000}]},"type":"RANGES"}]
I0901 05:02:43.391345 30630 slave.cpp:589] Agent attributes: [  ]
I0901 05:02:43.391366 30630 slave.cpp:598] Agent hostname: 4100df12693e
I0901 05:02:43.391500 30632 status_update_manager.cpp:177] Pausing sending status updates
I0901 05:02:43.393081 30644 state.cpp:64] Recovering state from '/tmp/Endpoint_SlaveEndpointTest_UnauthorizedRequest_1_VyQtNd/meta'
I0901 05:02:43.393463 30644 status_update_manager.cpp:203] Recovering status update manager
I0901 05:02:43.393728 30633 containerizer.cpp:646] Recovering containerizer
I0901 05:02:43.395313 30648 provisioner.cpp:416] Provisioner recovery complete
I0901 05:02:43.395721 30630 slave.cpp:6296] Finished recovery
I0901 05:02:43.396265 30630 slave.cpp:6478] Querying resource estimator for oversubscribable
resources
I0901 05:02:43.396512 30647 slave.cpp:6492] Received oversubscribable resources {} from the
resource estimator
I0901 05:02:43.399050 30636 process.cpp:3956] Handling HTTP event for process 'slave(814)'
with path: '/slave(814)/monitor/statistics.json'
I0901 05:02:43.400744 30644 http.cpp:1185] HTTP GET for /slave(814)/monitor/statistics.json
from 172.17.0.7:59454
I0901 05:02:43.400827 30644 http.cpp:976] Authorizing principal 'test-principal' to GET the
'/monitor/statistics.json' endpoint
I0901 05:02:43.406772 30640 slave.cpp:859] Agent terminating
[       OK ] Endpoint/SlaveEndpointTest.UnauthorizedRequest/1 (33 ms)
[ RUN      ] Endpoint/SlaveEndpointTest.UnauthorizedRequest/2
I0901 05:02:43.418426  9652 containerizer.cpp:290] Using isolation { environment_secret, posix/cpu,
posix/mem, filesystem/posix, network/cni }
W0901 05:02:43.418887  9652 backend.cpp:76] Failed to create 'aufs' backend: AufsBackend requires
root privileges
W0901 05:02:43.418994  9652 backend.cpp:76] Failed to create 'bind' backend: BindBackend requires
root privileges
I0901 05:02:43.419028  9652 provisioner.cpp:255] Using default backend 'copy'
I0901 05:02:43.422493 30643 slave.cpp:252] Mesos agent started on (815)@172.17.0.7:33465
I0901 05:02:43.422518 30643 slave.cpp:253] Flags at startup: --acls="" --appc_simple_discovery_uri_prefix="http://"
--appc_store_dir="/tmp/Endpoint_SlaveEndpointTest_UnauthorizedRequest_2_2KbpqX/store/appc"
--authenticate_http_executors="true" --authenticate_http_readonly="true" --authenticate_http_readwrite="true"
--authenticatee="crammd5" --authentication_backoff_factor="1secs" --authorizer="local" --cgroups_cpu_enable_pids_and_tids_count="false"
--cgroups_enable_cfs="false" --cgroups_hierarchy="/sys/fs/cgroup" --cgroups_limit_swap="false"
--cgroups_root="mesos" --container_disk_watch_interval="15secs" --containerizers="mesos" --credential="/tmp/Endpoint_SlaveEndpointTest_UnauthorizedRequest_2_2KbpqX/credential"
--default_role="*" --disallow_sharing_agent_pid_namespace="false" --disk_watch_interval="1mins"
--docker="docker" --docker_kill_orphans="true" --docker_registry="https://registry-1.docker.io"
--docker_remove_delay="6hrs" --docker_socket="/var/run/docker.sock" --docker_stop_timeout="0ns"
--docker_store_dir="/tmp/Endpoint_SlaveEndpointTest_UnauthorizedRequest_2_2KbpqX/store/docker"
--docker_volume_checkpoint_dir="/var/run/mesos/isolators/docker/volume" --enforce_container_disk_quota="false"
--executor_registration_timeout="1mins" --executor_reregistration_timeout="2secs" --executor_secret_key="/tmp/Endpoint_SlaveEndpointTest_UnauthorizedRequest_2_2KbpqX/executor_secret_key"
--executor_shutdown_grace_period="5secs" --fetcher_cache_dir="/tmp/Endpoint_SlaveEndpointTest_UnauthorizedRequest_2_2KbpqX/fetch"
--fetcher_cache_size="2GB" --frameworks_home="" --gc_delay="1weeks" --gc_disk_headroom="0.1"
--hadoop_home="" --help="false" --hostname_lookup="true" --http_command_executor="false" --http_credentials="/tmp/Endpoint_SlaveEndpointTest_UnauthorizedRequest_2_2KbpqX/http_credentials"
--http_heartbeat_interval="30secs" --initialize_driver_logging="true" --isolation="posix/cpu,posix/mem"
--launcher="posix" --launcher_dir="/mesos/mesos-1.5.0/_build/src" --logbufsecs="0" --logging_level="INFO"
--max_completed_executors_per_framework="150" --oversubscribed_resources_interval="15secs"
--perf_duration="10secs" --perf_interval="1mins" --port="5051" --qos_correction_interval_min="0ns"
--quiet="false" --recover="reconnect" --recovery_timeout="15mins" --registration_backoff_factor="10ms"
--resources="cpus:2;gpus:0;mem:1024;disk:1024;ports:[31000-32000]" --revocable_cpu_low_priority="true"
--runtime_dir="/tmp/Endpoint_SlaveEndpointTest_UnauthorizedRequest_2_2KbpqX" --sandbox_directory="/mnt/mesos/sandbox"
--strict="true" --switch_user="true" --systemd_enable_support="true" --systemd_runtime_directory="/run/systemd/system"
--version="false" --work_dir="/tmp/Endpoint_SlaveEndpointTest_UnauthorizedRequest_2_d8Bx4c"
--zk_session_timeout="10secs"
I0901 05:02:43.422924 30643 credentials.hpp:86] Loading credential for authentication from
'/tmp/Endpoint_SlaveEndpointTest_UnauthorizedRequest_2_2KbpqX/credential'
I0901 05:02:43.423099 30643 slave.cpp:285] Agent using credential for: test-principal
I0901 05:02:43.423120 30643 credentials.hpp:37] Loading credentials for authentication from
'/tmp/Endpoint_SlaveEndpointTest_UnauthorizedRequest_2_2KbpqX/http_credentials'
I0901 05:02:43.423387 30643 http.cpp:1045] Creating default 'basic' HTTP authenticator for
realm 'mesos-agent-executor'
I0901 05:02:43.423511 30643 http.cpp:1066] Creating default 'jwt' HTTP authenticator for realm
'mesos-agent-executor'
I0901 05:02:43.423710 30643 http.cpp:1045] Creating default 'basic' HTTP authenticator for
realm 'mesos-agent-readonly'
I0901 05:02:43.423801 30643 http.cpp:1066] Creating default 'jwt' HTTP authenticator for realm
'mesos-agent-readonly'
I0901 05:02:43.423964 30643 http.cpp:1045] Creating default 'basic' HTTP authenticator for
realm 'mesos-agent-readwrite'
I0901 05:02:43.424057 30643 http.cpp:1066] Creating default 'jwt' HTTP authenticator for realm
'mesos-agent-readwrite'
I0901 05:02:43.425390 30643 slave.cpp:581] Agent resources: [{"name":"cpus","scalar":{"value":2.0},"type":"SCALAR"},{"name":"mem","scalar":{"value":1024.0},"type":"SCALAR"},{"name":"disk","scalar":{"value":1024.0},"type":"SCALAR"},{"name":"ports","ranges":{"range":[{"begin":31000,"end":32000}]},"type":"RANGES"}]
I0901 05:02:43.425606 30643 slave.cpp:589] Agent attributes: [  ]
I0901 05:02:43.425621 30643 slave.cpp:598] Agent hostname: 4100df12693e
I0901 05:02:43.425762 30644 status_update_manager.cpp:177] Pausing sending status updates
I0901 05:02:43.427410 30636 state.cpp:64] Recovering state from '/tmp/Endpoint_SlaveEndpointTest_UnauthorizedRequest_2_d8Bx4c/meta'
I0901 05:02:43.427716 30640 status_update_manager.cpp:203] Recovering status update manager
I0901 05:02:43.427909 30640 containerizer.cpp:646] Recovering containerizer
I0901 05:02:43.429158 30638 provisioner.cpp:416] Provisioner recovery complete
I0901 05:02:43.429517 30643 slave.cpp:6296] Finished recovery
I0901 05:02:43.430074 30643 slave.cpp:6478] Querying resource estimator for oversubscribable
resources
I0901 05:02:43.430341 30651 slave.cpp:6492] Received oversubscribable resources {} from the
resource estimator
I0901 05:02:43.432632 30633 process.cpp:3956] Handling HTTP event for process 'slave(815)'
with path: '/slave(815)/containers'
I0901 05:02:43.434279 30646 http.cpp:1185] HTTP GET for /slave(815)/containers from 172.17.0.7:59456
I0901 05:02:43.434350 30646 http.cpp:976] Authorizing principal 'test-principal' to GET the
'/containers' endpoint
I0901 05:02:43.436156 30628 slave.cpp:859] Agent terminating
[       OK ] Endpoint/SlaveEndpointTest.UnauthorizedRequest/2 (28 ms)
[ RUN      ] Endpoint/SlaveEndpointTest.NoAuthorizer/0
I0901 05:02:43.447644  9652 containerizer.cpp:290] Using isolation { environment_secret, posix/cpu,
posix/mem, filesystem/posix, network/cni }
W0901 05:02:43.448423  9652 backend.cpp:76] Failed to create 'aufs' backend: AufsBackend requires
root privileges
W0901 05:02:43.448616  9652 backend.cpp:76] Failed to create 'bind' backend: BindBackend requires
root privileges
I0901 05:02:43.448654  9652 provisioner.cpp:255] Using default backend 'copy'
I0901 05:02:43.450539  9652 cluster.cpp:448] Creating default 'local' authorizer
I0901 05:02:43.452491 30643 slave.cpp:252] Mesos agent started on (816)@172.17.0.7:33465
I0901 05:02:43.452517 30643 slave.cpp:253] Flags at startup: --acls="" --appc_simple_discovery_uri_prefix="http://"
--appc_store_dir="/tmp/Endpoint_SlaveEndpointTest_NoAuthorizer_0_Lv9o4W/store/appc" --authenticate_http_executors="true"
--authenticate_http_readonly="true" --authenticate_http_readwrite="true" --authenticatee="crammd5"
--authentication_backoff_factor="1secs" --authorizer="local" --cgroups_cpu_enable_pids_and_tids_count="false"
--cgroups_enable_cfs="false" --cgroups_hierarchy="/sys/fs/cgroup" --cgroups_limit_swap="false"
--cgroups_root="mesos" --container_disk_watch_interval="15secs" --containerizers="mesos" --credential="/tmp/Endpoint_SlaveEndpointTest_NoAuthorizer_0_Lv9o4W/credential"
--default_role="*" --disallow_sharing_agent_pid_namespace="false" --disk_watch_interval="1mins"
--docker="docker" --docker_kill_orphans="true" --docker_registry="https://registry-1.docker.io"
--docker_remove_delay="6hrs" --docker_socket="/var/run/docker.sock" --docker_stop_timeout="0ns"
--docker_store_dir="/tmp/Endpoint_SlaveEndpointTest_NoAuthorizer_0_Lv9o4W/store/docker" --docker_volume_checkpoint_dir="/var/run/mesos/isolators/docker/volume"
--enforce_container_disk_quota="false" --executor_registration_timeout="1mins" --executor_reregistration_timeout="2secs"
--executor_secret_key="/tmp/Endpoint_SlaveEndpointTest_NoAuthorizer_0_Lv9o4W/executor_secret_key"
--executor_shutdown_grace_period="5secs" --fetcher_cache_dir="/tmp/Endpoint_SlaveEndpointTest_NoAuthorizer_0_Lv9o4W/fetch"
--fetcher_cache_size="2GB" --frameworks_home="" --gc_delay="1weeks" --gc_disk_headroom="0.1"
--hadoop_home="" --help="false" --hostname_lookup="true" --http_command_executor="false" --http_credentials="/tmp/Endpoint_SlaveEndpointTest_NoAuthorizer_0_Lv9o4W/http_credentials"
--http_heartbeat_interval="30secs" --initialize_driver_logging="true" --isolation="posix/cpu,posix/mem"
--launcher="posix" --launcher_dir="/mesos/mesos-1.5.0/_build/src" --logbufsecs="0" --logging_level="INFO"
--max_completed_executors_per_framework="150" --oversubscribed_resources_interval="15secs"
--perf_duration="10secs" --perf_interval="1mins" --port="5051" --qos_correction_interval_min="0ns"
--quiet="false" --recover="reconnect" --recovery_timeout="15mins" --registration_backoff_factor="10ms"
--resources="cpus:2;gpus:0;mem:1024;disk:1024;ports:[31000-32000]" --revocable_cpu_low_priority="true"
--runtime_dir="/tmp/Endpoint_SlaveEndpointTest_NoAuthorizer_0_Lv9o4W" --sandbox_directory="/mnt/mesos/sandbox"
--strict="true" --switch_user="true" --systemd_enable_support="true" --systemd_runtime_directory="/run/systemd/system"
--version="false" --work_dir="/tmp/Endpoint_SlaveEndpointTest_NoAuthorizer_0_GkVhEc" --zk_session_timeout="10secs"
I0901 05:02:43.452935 30643 credentials.hpp:86] Loading credential for authentication from
'/tmp/Endpoint_SlaveEndpointTest_NoAuthorizer_0_Lv9o4W/credential'
I0901 05:02:43.453186 30643 slave.cpp:285] Agent using credential for: test-principal
I0901 05:02:43.453208 30643 credentials.hpp:37] Loading credentials for authentication from
'/tmp/Endpoint_SlaveEndpointTest_NoAuthorizer_0_Lv9o4W/http_credentials'
I0901 05:02:43.453495 30643 http.cpp:1045] Creating default 'basic' HTTP authenticator for
realm 'mesos-agent-executor'
I0901 05:02:43.453636 30643 http.cpp:1066] Creating default 'jwt' HTTP authenticator for realm
'mesos-agent-executor'
I0901 05:02:43.453855 30643 http.cpp:1045] Creating default 'basic' HTTP authenticator for
realm 'mesos-agent-readonly'
I0901 05:02:43.453946 30643 http.cpp:1066] Creating default 'jwt' HTTP authenticator for realm
'mesos-agent-readonly'
I0901 05:02:43.454107 30643 http.cpp:1045] Creating default 'basic' HTTP authenticator for
realm 'mesos-agent-readwrite'
I0901 05:02:43.454221 30643 http.cpp:1066] Creating default 'jwt' HTTP authenticator for realm
'mesos-agent-readwrite'
I0901 05:02:43.455615 30643 slave.cpp:581] Agent resources: [{"name":"cpus","scalar":{"value":2.0},"type":"SCALAR"},{"name":"mem","scalar":{"value":1024.0},"type":"SCALAR"},{"name":"disk","scalar":{"value":1024.0},"type":"SCALAR"},{"name":"ports","ranges":{"range":[{"begin":31000,"end":32000}]},"type":"RANGES"}]
I0901 05:02:43.455849 30643 slave.cpp:589] Agent attributes: [  ]
I0901 05:02:43.455869 30643 slave.cpp:598] Agent hostname: 4100df12693e
I0901 05:02:43.456019 30646 status_update_manager.cpp:177] Pausing sending status updates
I0901 05:02:43.457989 30629 state.cpp:64] Recovering state from '/tmp/Endpoint_SlaveEndpointTest_NoAuthorizer_0_GkVhEc/meta'
I0901 05:02:43.458304 30634 status_update_manager.cpp:203] Recovering status update manager
I0901 05:02:43.458544 30630 containerizer.cpp:646] Recovering containerizer
I0901 05:02:43.459880 30628 provisioner.cpp:416] Provisioner recovery complete
I0901 05:02:43.460227 30648 slave.cpp:6296] Finished recovery
I0901 05:02:43.460769 30648 slave.cpp:6478] Querying resource estimator for oversubscribable
resources
I0901 05:02:43.461021 30647 slave.cpp:6492] Received oversubscribable resources {} from the
resource estimator
I0901 05:02:43.463151 30651 process.cpp:3956] Handling HTTP event for process 'slave(816)'
with path: '/slave(816)/monitor/statistics'
I0901 05:02:43.464781 30649 http.cpp:1185] HTTP GET for /slave(816)/monitor/statistics from
172.17.0.7:59460
I0901 05:02:43.464860 30649 http.cpp:976] Authorizing principal 'test-principal' to GET the
'/monitor/statistics' endpoint
I0901 05:02:43.467864  9652 slave.cpp:859] Agent terminating
[       OK ] Endpoint/SlaveEndpointTest.NoAuthorizer/0 (31 ms)
[ RUN      ] Endpoint/SlaveEndpointTest.NoAuthorizer/1
I0901 05:02:43.479239  9652 containerizer.cpp:290] Using isolation { environment_secret, posix/cpu,
posix/mem, filesystem/posix, network/cni }
W0901 05:02:43.479786  9652 backend.cpp:76] Failed to create 'aufs' backend: AufsBackend requires
root privileges
W0901 05:02:43.479914  9652 backend.cpp:76] Failed to create 'bind' backend: BindBackend requires
root privileges
I0901 05:02:43.479949  9652 provisioner.cpp:255] Using default backend 'copy'
I0901 05:02:43.481807  9652 cluster.cpp:448] Creating default 'local' authorizer
I0901 05:02:43.483710 30636 slave.cpp:252] Mesos agent started on (817)@172.17.0.7:33465
I0901 05:02:43.483736 30636 slave.cpp:253] Flags at startup: --acls="" --appc_simple_discovery_uri_prefix="http://"
--appc_store_dir="/tmp/Endpoint_SlaveEndpointTest_NoAuthorizer_1_6sE90W/store/appc" --authenticate_http_executors="true"
--authenticate_http_readonly="true" --authenticate_http_readwrite="true" --authenticatee="crammd5"
--authentication_backoff_factor="1secs" --authorizer="local" --cgroups_cpu_enable_pids_and_tids_count="false"
--cgroups_enable_cfs="false" --cgroups_hierarchy="/sys/fs/cgroup" --cgroups_limit_swap="false"
--cgroups_root="mesos" --container_disk_watch_interval="15secs" --containerizers="mesos" --credential="/tmp/Endpoint_SlaveEndpointTest_NoAuthorizer_1_6sE90W/credential"
--default_role="*" --disallow_sharing_agent_pid_namespace="false" --disk_watch_interval="1mins"
--docker="docker" --docker_kill_orphans="true" --docker_registry="https://registry-1.docker.io"
--docker_remove_delay="6hrs" --docker_socket="/var/run/docker.sock" --docker_stop_timeout="0ns"
--docker_store_dir="/tmp/Endpoint_SlaveEndpointTest_NoAuthorizer_1_6sE90W/store/docker" --docker_volume_checkpoint_dir="/var/run/mesos/isolators/docker/volume"
--enforce_container_disk_quota="false" --executor_registration_timeout="1mins" --executor_reregistration_timeout="2secs"
--executor_secret_key="/tmp/Endpoint_SlaveEndpointTest_NoAuthorizer_1_6sE90W/executor_secret_key"
--executor_shutdown_grace_period="5secs" --fetcher_cache_dir="/tmp/Endpoint_SlaveEndpointTest_NoAuthorizer_1_6sE90W/fetch"
--fetcher_cache_size="2GB" --frameworks_home="" --gc_delay="1weeks" --gc_disk_headroom="0.1"
--hadoop_home="" --help="false" --hostname_lookup="true" --http_command_executor="false" --http_credentials="/tmp/Endpoint_SlaveEndpointTest_NoAuthorizer_1_6sE90W/http_credentials"
--http_heartbeat_interval="30secs" --initialize_driver_logging="true" --isolation="posix/cpu,posix/mem"
--launcher="posix" --launcher_dir="/mesos/mesos-1.5.0/_build/src" --logbufsecs="0" --logging_level="INFO"
--max_completed_executors_per_framework="150" --oversubscribed_resources_interval="15secs"
--perf_duration="10secs" --perf_interval="1mins" --port="5051" --qos_correction_interval_min="0ns"
--quiet="false" --recover="reconnect" --recovery_timeout="15mins" --registration_backoff_factor="10ms"
--resources="cpus:2;gpus:0;mem:1024;disk:1024;ports:[31000-32000]" --revocable_cpu_low_priority="true"
--runtime_dir="/tmp/Endpoint_SlaveEndpointTest_NoAuthorizer_1_6sE90W" --sandbox_directory="/mnt/mesos/sandbox"
--strict="true" --switch_user="true" --systemd_enable_support="true" --systemd_runtime_directory="/run/systemd/system"
--version="false" --work_dir="/tmp/Endpoint_SlaveEndpointTest_NoAuthorizer_1_IV3iwc" --zk_session_timeout="10secs"
I0901 05:02:43.484292 30636 credentials.hpp:86] Loading credential for authentication from
'/tmp/Endpoint_SlaveEndpointTest_NoAuthorizer_1_6sE90W/credential'
I0901 05:02:43.484490 30636 slave.cpp:285] Agent using credential for: test-principal
I0901 05:02:43.484511 30636 credentials.hpp:37] Loading credentials for authentication from
'/tmp/Endpoint_SlaveEndpointTest_NoAuthorizer_1_6sE90W/http_credentials'
I0901 05:02:43.484776 30636 http.cpp:1045] Creating default 'basic' HTTP authenticator for
realm 'mesos-agent-executor'
I0901 05:02:43.484899 30636 http.cpp:1066] Creating default 'jwt' HTTP authenticator for realm
'mesos-agent-executor'
I0901 05:02:43.485092 30636 http.cpp:1045] Creating default 'basic' HTTP authenticator for
realm 'mesos-agent-readonly'
I0901 05:02:43.485180 30636 http.cpp:1066] Creating default 'jwt' HTTP authenticator for realm
'mesos-agent-readonly'
I0901 05:02:43.485348 30636 http.cpp:1045] Creating default 'basic' HTTP authenticator for
realm 'mesos-agent-readwrite'
I0901 05:02:43.485435 30636 http.cpp:1066] Creating default 'jwt' HTTP authenticator for realm
'mesos-agent-readwrite'
I0901 05:02:43.486760 30636 slave.cpp:581] Agent resources: [{"name":"cpus","scalar":{"value":2.0},"type":"SCALAR"},{"name":"mem","scalar":{"value":1024.0},"type":"SCALAR"},{"name":"disk","scalar":{"value":1024.0},"type":"SCALAR"},{"name":"ports","ranges":{"range":[{"begin":31000,"end":32000}]},"type":"RANGES"}]
I0901 05:02:43.486980 30636 slave.cpp:589] Agent attributes: [  ]
I0901 05:02:43.486994 30636 slave.cpp:598] Agent hostname: 4100df12693e
I0901 05:02:43.487121 30650 status_update_manager.cpp:177] Pausing sending status updates
I0901 05:02:43.488648 30643 state.cpp:64] Recovering state from '/tmp/Endpoint_SlaveEndpointTest_NoAuthorizer_1_IV3iwc/meta'
I0901 05:02:43.488973 30644 status_update_manager.cpp:203] Recovering status update manager
I0901 05:02:43.489151 30649 containerizer.cpp:646] Recovering containerizer
I0901 05:02:43.490366 30647 provisioner.cpp:416] Provisioner recovery complete
I0901 05:02:43.490640 30636 slave.cpp:6296] Finished recovery
I0901 05:02:43.491192 30636 slave.cpp:6478] Querying resource estimator for oversubscribable
resources
I0901 05:02:43.491451 30645 slave.cpp:6492] Received oversubscribable resources {} from the
resource estimator
I0901 05:02:43.493618 30639 process.cpp:3956] Handling HTTP event for process 'slave(817)'
with path: '/slave(817)/monitor/statistics.json'
I0901 05:02:43.495149 30644 http.cpp:1185] HTTP GET for /slave(817)/monitor/statistics.json
from 172.17.0.7:59464
I0901 05:02:43.495218 30644 http.cpp:976] Authorizing principal 'test-principal' to GET the
'/monitor/statistics.json' endpoint
I0901 05:02:43.497606 30629 slave.cpp:859] Agent terminating
[       OK ] Endpoint/SlaveEndpointTest.NoAuthorizer/1 (29 ms)
[ RUN      ] Endpoint/SlaveEndpointTest.NoAuthorizer/2
I0901 05:02:43.507858  9652 containerizer.cpp:290] Using isolation { environment_secret, posix/cpu,
posix/mem, filesystem/posix, network/cni }
W0901 05:02:43.508339  9652 backend.cpp:76] Failed to create 'aufs' backend: AufsBackend requires
root privileges
W0901 05:02:43.508456  9652 backend.cpp:76] Failed to create 'bind' backend: BindBackend requires
root privileges
I0901 05:02:43.508492  9652 provisioner.cpp:255] Using default backend 'copy'
I0901 05:02:43.509984  9652 cluster.cpp:448] Creating default 'local' authorizer
I0901 05:02:43.511639 30649 slave.cpp:252] Mesos agent started on (818)@172.17.0.7:33465
I0901 05:02:43.511658 30649 slave.cpp:253] Flags at startup: --acls="" --appc_simple_discovery_uri_prefix="http://"
--appc_store_dir="/tmp/Endpoint_SlaveEndpointTest_NoAuthorizer_2_akwpfX/store/appc" --authenticate_http_executors="true"
--authenticate_http_readonly="true" --authenticate_http_readwrite="true" --authenticatee="crammd5"
--authentication_backoff_factor="1secs" --authorizer="local" --cgroups_cpu_enable_pids_and_tids_count="false"
--cgroups_enable_cfs="false" --cgroups_hierarchy="/sys/fs/cgroup" --cgroups_limit_swap="false"
--cgroups_root="mesos" --container_disk_watch_interval="15secs" --containerizers="mesos" --credential="/tmp/Endpoint_SlaveEndpointTest_NoAuthorizer_2_akwpfX/credential"
--default_role="*" --disallow_sharing_agent_pid_namespace="false" --disk_watch_interval="1mins"
--docker="docker" --docker_kill_orphans="true" --docker_registry="https://registry-1.docker.io"
--docker_remove_delay="6hrs" --docker_socket="/var/run/docker.sock" --docker_stop_timeout="0ns"
--docker_store_dir="/tmp/Endpoint_SlaveEndpointTest_NoAuthorizer_2_akwpfX/store/docker" --docker_volume_checkpoint_dir="/var/run/mesos/isolators/docker/volume"
--enforce_container_disk_quota="false" --executor_registration_timeout="1mins" --executor_reregistration_timeout="2secs"
--executor_secret_key="/tmp/Endpoint_SlaveEndpointTest_NoAuthorizer_2_akwpfX/executor_secret_key"
--executor_shutdown_grace_period="5secs" --fetcher_cache_dir="/tmp/Endpoint_SlaveEndpointTest_NoAuthorizer_2_akwpfX/fetch"
--fetcher_cache_size="2GB" --frameworks_home="" --gc_delay="1weeks" --gc_disk_headroom="0.1"
--hadoop_home="" --help="false" --hostname_lookup="true" --http_command_executor="false" --http_credentials="/tmp/Endpoint_SlaveEndpointTest_NoAuthorizer_2_akwpfX/http_credentials"
--http_heartbeat_interval="30secs" --initialize_driver_logging="true" --isolation="posix/cpu,posix/mem"
--launcher="posix" --launcher_dir="/mesos/mesos-1.5.0/_build/src" --logbufsecs="0" --logging_level="INFO"
--max_completed_executors_per_framework="150" --oversubscribed_resources_interval="15secs"
--perf_duration="10secs" --perf_interval="1mins" --port="5051" --qos_correction_interval_min="0ns"
--quiet="false" --recover="reconnect" --recovery_timeout="15mins" --registration_backoff_factor="10ms"
--resources="cpus:2;gpus:0;mem:1024;disk:1024;ports:[31000-32000]" --revocable_cpu_low_priority="true"
--runtime_dir="/tmp/Endpoint_SlaveEndpointTest_NoAuthorizer_2_akwpfX" --sandbox_directory="/mnt/mesos/sandbox"
--strict="true" --switch_user="true" --systemd_enable_support="true" --systemd_runtime_directory="/run/systemd/system"
--version="false" --work_dir="/tmp/Endpoint_SlaveEndpointTest_NoAuthorizer_2_Hq1eGc" --zk_session_timeout="10secs"
I0901 05:02:43.512024 30649 credentials.hpp:86] Loading credential for authentication from
'/tmp/Endpoint_SlaveEndpointTest_NoAuthorizer_2_akwpfX/credential'
I0901 05:02:43.512164 30649 slave.cpp:285] Agent using credential for: test-principal
I0901 05:02:43.512186 30649 credentials.hpp:37] Loading credentials for authentication from
'/tmp/Endpoint_SlaveEndpointTest_NoAuthorizer_2_akwpfX/http_credentials'
I0901 05:02:43.512434 30649 http.cpp:1045] Creating default 'basic' HTTP authenticator for
realm 'mesos-agent-executor'
I0901 05:02:43.512552 30649 http.cpp:1066] Creating default 'jwt' HTTP authenticator for realm
'mesos-agent-executor'
I0901 05:02:43.512758 30649 http.cpp:1045] Creating default 'basic' HTTP authenticator for
realm 'mesos-agent-readonly'
I0901 05:02:43.512856 30649 http.cpp:1066] Creating default 'jwt' HTTP authenticator for realm
'mesos-agent-readonly'
I0901 05:02:43.513042 30649 http.cpp:1045] Creating default 'basic' HTTP authenticator for
realm 'mesos-agent-readwrite'
I0901 05:02:43.513152 30649 http.cpp:1066] Creating default 'jwt' HTTP authenticator for realm
'mesos-agent-readwrite'
I0901 05:02:43.514473 30649 slave.cpp:581] Agent resources: [{"name":"cpus","scalar":{"value":2.0},"type":"SCALAR"},{"name":"mem","scalar":{"value":1024.0},"type":"SCALAR"},{"name":"disk","scalar":{"value":1024.0},"type":"SCALAR"},{"name":"ports","ranges":{"range":[{"begin":31000,"end":32000}]},"type":"RANGES"}]
I0901 05:02:43.514685 30649 slave.cpp:589] Agent attributes: [  ]
I0901 05:02:43.514708 30649 slave.cpp:598] Agent hostname: 4100df12693e
I0901 05:02:43.514839 30628 status_update_manager.cpp:177] Pausing sending status updates
I0901 05:02:43.516222 30635 state.cpp:64] Recovering state from '/tmp/Endpoint_SlaveEndpointTest_NoAuthorizer_2_Hq1eGc/meta'
I0901 05:02:43.516477 30651 status_update_manager.cpp:203] Recovering status update manager
I0901 05:02:43.516644 30647 containerizer.cpp:646] Recovering containerizer
I0901 05:02:43.517736 30641 provisioner.cpp:416] Provisioner recovery complete
I0901 05:02:43.518018 30649 slave.cpp:6296] Finished recovery
I0901 05:02:43.518426 30649 slave.cpp:6478] Querying resource estimator for oversubscribable
resources
I0901 05:02:43.518661 30632 slave.cpp:6492] Received oversubscribable resources {} from the
resource estimator
I0901 05:02:43.520416 30648 process.cpp:3956] Handling HTTP event for process 'slave(818)'
with path: '/slave(818)/containers'
I0901 05:02:43.521858 30637 http.cpp:1185] HTTP GET for /slave(818)/containers from 172.17.0.7:59466
I0901 05:02:43.521919 30637 http.cpp:976] Authorizing principal 'test-principal' to GET the
'/containers' endpoint
I0901 05:02:43.524375 30630 slave.cpp:859] Agent terminating
[       OK ] Endpoint/SlaveEndpointTest.NoAuthorizer/2 (26 ms)
[----------] 9 tests from Endpoint/SlaveEndpointTest (278 ms total)

[----------] 2 tests from ContainerizerType/DefaultContainerDNSFlagTest
[ RUN      ] ContainerizerType/DefaultContainerDNSFlagTest.ValidateFlag/0
[       OK ] ContainerizerType/DefaultContainerDNSFlagTest.ValidateFlag/0 (10 ms)
[ RUN      ] ContainerizerType/DefaultContainerDNSFlagTest.ValidateFlag/1
[       OK ] ContainerizerType/DefaultContainerDNSFlagTest.ValidateFlag/1 (9 ms)
[----------] 2 tests from ContainerizerType/DefaultContainerDNSFlagTest (19 ms total)

[----------] Global test environment tear-down
[==========] 1671 tests from 185 test cases ran. (739768 ms total)
[  PASSED  ] 1666 tests.
[  FAILED  ] 5 tests, listed below:
[  FAILED  ] CommandExecutorCheckTest.CommandCheckDeliveredAndReconciled
[  FAILED  ] DefaultExecutorCheckTest.CommandCheckDeliveredAndReconciled
[  FAILED  ] DefaultExecutorCheckTest.CommandCheckStatusChange
[  FAILED  ] DefaultExecutorCheckTest.CommandCheckSeesParentsEnv
[  FAILED  ] DefaultExecutorCheckTest.CommandCheckSharesWorkDirWithTask

 5 FAILED TESTS
  YOU HAVE 20 DISABLED TESTS

I0901 05:02:43.607899 30652 process.cpp:1072] Failed to accept socket: future discarded
make[4]: *** [check-local] Error 1
make[4]: Leaving directory `/mesos/mesos-1.5.0/_build/src'
make[3]: *** [check-am] Error 2
make[3]: Leaving directory `/mesos/mesos-1.5.0/_build/src'
make[2]: *** [check] Error 2
make[2]: Leaving directory `/mesos/mesos-1.5.0/_build/src'
make[1]: *** [check-recursive] Error 1
make[1]: Leaving directory `/mesos/mesos-1.5.0/_build'
make: *** [distcheck] Error 1
+ docker rmi mesos-1504239207-22094
Untagged: mesos-1504239207-22094:latest
Deleted: sha256:2b5f481a201bab1f7f183770585a3c45c171c7d755cb1e77fa7cc098b56d818b
Deleted: sha256:a920c1727167e6aa83842a5dc4495d0a0691f1a0eb3bbcbf90b8e283ecb8e721
Deleted: sha256:31555e15e6eedf7d19504326decc3c8dc196cfc4ea22ad5c0032f4b46ff9e30e
Deleted: sha256:718f4c33deff5f9c96c88f5f55b1b989ac44a1e19f01c4e11b145cc86d87b650
Deleted: sha256:b04c843483842114d8fc8bc0a2b0f8ffbc20da25984c374cba5ba4884de672d7
Deleted: sha256:b2c714009a50b11367220499080e624cebdd1f0dc169253113e7c01c7d096726
Deleted: sha256:e8b0cc6cb044c90d75d8a90cffbc1824e5f0de2af12d3d9730519365b6444824
Deleted: sha256:7b5f090c69cbc6bff3dc7316080122cdbd9cbdc8dc4f74e0fe2aeed75298c313
Deleted: sha256:218a60f6a1844d8d78304640bdaa0a6d574701edc7120476a4a384b5b2431cea
Deleted: sha256:f4c3b4addf2e4e14b4923eb2e3c5a7cc2011623d61efcb0293cd92f9d8794464
Deleted: sha256:8fd9fd830340371dc0779d52870804ca44e142d3b7fbe39af18cbbee64150048
Deleted: sha256:e9b4df3fe144ad23a15575895ae65f82d96f252e128911462372edcc748e1ae7
Deleted: sha256:5e5c09e206528b7c2071d60100232624a52906f0ad845a3f0b1fcf87d5f571f0
Deleted: sha256:7593f3bd8cd86dc0b1f3c75b9af9cfbab38fcabdeaec88a95181d3a20b3fe376
Deleted: sha256:035cfa8d9788a10c73c30d2ceeb564356f864afffc95fa2627f87f8305b29c9e
Deleted: sha256:11bbc235808c563da1ff3d3c3c8ccce00d7a8d8ae0c8f9a18f7ba0233643d86a
Deleted: sha256:3df2b2574673f934c0653dd252058c3b260ec05c36cb4f1c20b85b47a912069c
Deleted: sha256:735d352786e8a297dbf004d3f4abe388b3ee2904aaf63555a8d9680dc8403d6a
Deleted: sha256:fae970693861bc06b61c16c01e33c63c2a71b9b29eb9ac2e1e5928aa2477cc26
Deleted: sha256:31763903e67e16aada2ded4016f6ba0cabcee01eb79f8d493b91ef3891c1aba4
Deleted: sha256:1a7b2b2cfe7ae7b93ea5ed4e0aca23ed7a52aa03fb84e10cb8d59cba706e83d6
Deleted: sha256:b5af3b140f3899ce2877b67414f4a081f6413695bc252c4e8515bca04c7190da
Deleted: sha256:147b4be741e1ca136c6762443e2912496eb1585dfb72f8c5fade3646430f0441
Deleted: sha256:3dcec5b87f63572c14b9d3bafafa14e852216bf4444ec2c69bde0c5954cd06db
Deleted: sha256:828727b6a42ab2638fe68e902d42ee85e0638914e896124b29331c56f4802d2f
Build step 'Execute shell' marked build as failure
Not sending mail to unregistered user yujie.jay@gmail.com
Not sending mail to unregistered user benjamin.hindman@gmail.com

Mime
View raw message