mesos-builds mailing list archives

Site index · List index
Message view « Date » · « Thread »
Top « Date » · « Thread »
From Apache Jenkins Server <jenk...@builds.apache.org>
Subject Build failed in Jenkins: Mesos-Buildbot » autotools,gcc,--verbose,GLOG_v=1 MESOS_VERBOSE=1,centos:7,(ubuntu)&&(!ubuntu-us1)&&(!ubuntu-eu2)&&(!qnode3)&&(!H23) #4236
Date Mon, 18 Sep 2017 19:57:42 GMT
See <https://builds.apache.org/job/Mesos-Buildbot/BUILDTOOL=autotools,COMPILER=gcc,CONFIGURATION=--verbose,ENVIRONMENT=GLOG_v=1%20MESOS_VERBOSE=1,OS=centos%3A7,label_exp=(ubuntu)&&(!ubuntu-us1)&&(!ubuntu-eu2)&&(!qnode3)&&(!H23)/4236/display/redirect?page=changes>

Changes:

[yujie.jay] Moved port mapping isolator doc to the isolators folder.

[yujie.jay] Moved shared filesystem isolator doc to the isolators folder.

[yujie.jay] Moved pid namespace isolator doc to the isolators folder.

[yujie.jay] Moved disk du isolator doc to the isolators folder.

[yujie.jay] Moved xfs disk isolator doc to the isolators folder.

[yujie.jay] Moved docker runtime isolator doc to the isolators folder.

[yujie.jay] Moved cgroups net_cls isolator doc to the isolators folder.

[yujie.jay] Moved docker volume isolator doc to the isolators folder.

[yujie.jay] Moved IPC namespace isolator doc to the isolators folder.

[yujie.jay] Moved linux capabilities isolator doc to the isolators folder.

[yujie.jay] Moved posix rlimits isolator doc to the isolators folder.

[yujie.jay] Added an index in the mesos containerizer doc about isolators.

[yujie.jay] Added gpu/nvidia isolator to the index.

[yujie.jay] Added the description for the isolators section.

[yujie.jay] Added initial doc for container volumes.

[yujie.jay] Added the missing isolators to the doc.

------------------------------------------
[...truncated 31.27 MB...]
I0918 19:57:33.577961  6792 status_update_manager.cpp:177] Pausing sending status updates
I0918 19:57:33.579620  6804 state.cpp:64] Recovering state from '/tmp/Endpoint_SlaveEndpointTest_AuthorizedRequest_2_jrGqnH/meta'
I0918 19:57:33.580256  6808 status_update_manager.cpp:203] Recovering status update manager
I0918 19:57:33.580492  6808 containerizer.cpp:648] Recovering containerizer
I0918 19:57:33.582060  6806 provisioner.cpp:416] Provisioner recovery complete
I0918 19:57:33.582556  6813 slave.cpp:6298] Finished recovery
I0918 19:57:33.583026  6813 slave.cpp:6480] Querying resource estimator for oversubscribable
resources
I0918 19:57:33.583417  6794 slave.cpp:6494] Received oversubscribable resources {} from the
resource estimator
I0918 19:57:33.586199  6799 process.cpp:3929] Handling HTTP event for process 'slave(807)'
with path: '/slave(807)/containers'
I0918 19:57:33.587697  6802 http.cpp:1185] HTTP GET for /slave(807)/containers from 172.17.0.8:46538
I0918 19:57:33.587779  6802 http.cpp:976] Authorizing principal 'test-principal' to GET the
'/containers' endpoint
I0918 19:57:33.592512  6773 slave.cpp:861] Agent terminating
[       OK ] Endpoint/SlaveEndpointTest.AuthorizedRequest/2 (35 ms)
[ RUN      ] Endpoint/SlaveEndpointTest.UnauthorizedRequest/0
I0918 19:57:33.603842  6773 containerizer.cpp:292] Using isolation { environment_secret, posix/cpu,
posix/mem, filesystem/posix, network/cni }
W0918 19:57:33.604343  6773 backend.cpp:76] Failed to create 'aufs' backend: AufsBackend requires
root privileges
W0918 19:57:33.604463  6773 backend.cpp:76] Failed to create 'bind' backend: BindBackend requires
root privileges
I0918 19:57:33.604496  6773 provisioner.cpp:255] Using default backend 'copy'
I0918 19:57:33.609814  6809 slave.cpp:252] Mesos agent started on (808)@172.17.0.8:41557
I0918 19:57:33.609851  6809 slave.cpp:253] Flags at startup: --acls="" --appc_simple_discovery_uri_prefix="http://"
--appc_store_dir="/tmp/Endpoint_SlaveEndpointTest_UnauthorizedRequest_0_wdWNxc/store/appc"
--authenticate_http_readonly="true" --authenticate_http_readwrite="true" --authenticatee="crammd5"
--authentication_backoff_factor="1secs" --authorizer="local" --cgroups_cpu_enable_pids_and_tids_count="false"
--cgroups_enable_cfs="false" --cgroups_hierarchy="/sys/fs/cgroup" --cgroups_limit_swap="false"
--cgroups_root="mesos" --container_disk_watch_interval="15secs" --containerizers="mesos" --credential="/tmp/Endpoint_SlaveEndpointTest_UnauthorizedRequest_0_wdWNxc/credential"
--default_role="*" --disallow_sharing_agent_pid_namespace="false" --disk_watch_interval="1mins"
--docker="docker" --docker_kill_orphans="true" --docker_registry="https://registry-1.docker.io"
--docker_remove_delay="6hrs" --docker_socket="/var/run/docker.sock" --docker_stop_timeout="0ns"
--docker_store_dir="/tmp/Endpoint_SlaveEndpointTest_UnauthorizedRequest_0_wdWNxc/store/docker"
--docker_volume_checkpoint_dir="/var/run/mesos/isolators/docker/volume" --enforce_container_disk_quota="false"
--executor_registration_timeout="1mins" --executor_reregistration_timeout="2secs" --executor_shutdown_grace_period="5secs"
--fetcher_cache_dir="/tmp/Endpoint_SlaveEndpointTest_UnauthorizedRequest_0_wdWNxc/fetch" --fetcher_cache_size="2GB"
--frameworks_home="" --gc_delay="1weeks" --gc_disk_headroom="0.1" --hadoop_home="" --help="false"
--hostname_lookup="true" --http_command_executor="false" --http_credentials="/tmp/Endpoint_SlaveEndpointTest_UnauthorizedRequest_0_wdWNxc/http_credentials"
--http_heartbeat_interval="30secs" --initialize_driver_logging="true" --isolation="posix/cpu,posix/mem"
--launcher="posix" --launcher_dir="/mesos/mesos-1.5.0/_build/src" --logbufsecs="0" --logging_level="INFO"
--max_completed_executors_per_framework="150" --oversubscribed_resources_interval="15secs"
--perf_duration="10secs" --perf_interval="1mins" --port="5051" --qos_correction_interval_min="0ns"
--quiet="false" --recover="reconnect" --recovery_timeout="15mins" --registration_backoff_factor="10ms"
--resources="cpus:2;gpus:0;mem:1024;disk:1024;ports:[31000-32000]" --revocable_cpu_low_priority="true"
--runtime_dir="/tmp/Endpoint_SlaveEndpointTest_UnauthorizedRequest_0_wdWNxc" --sandbox_directory="/mnt/mesos/sandbox"
--strict="true" --switch_user="true" --systemd_enable_support="true" --systemd_runtime_directory="/run/systemd/system"
--version="false" --work_dir="/tmp/Endpoint_SlaveEndpointTest_UnauthorizedRequest_0_d2ttGi"
--zk_session_timeout="10secs"
I0918 19:57:33.610376  6809 credentials.hpp:86] Loading credential for authentication from
'/tmp/Endpoint_SlaveEndpointTest_UnauthorizedRequest_0_wdWNxc/credential'
I0918 19:57:33.610643  6809 slave.cpp:285] Agent using credential for: test-principal
I0918 19:57:33.610703  6809 credentials.hpp:37] Loading credentials for authentication from
'/tmp/Endpoint_SlaveEndpointTest_UnauthorizedRequest_0_wdWNxc/http_credentials'
I0918 19:57:33.611086  6809 http.cpp:1045] Creating default 'basic' HTTP authenticator for
realm 'mesos-agent-readonly'
I0918 19:57:33.611307  6809 http.cpp:1045] Creating default 'basic' HTTP authenticator for
realm 'mesos-agent-readwrite'
I0918 19:57:33.613226  6809 slave.cpp:583] Agent resources: [{"name":"cpus","scalar":{"value":2.0},"type":"SCALAR"},{"name":"mem","scalar":{"value":1024.0},"type":"SCALAR"},{"name":"disk","scalar":{"value":1024.0},"type":"SCALAR"},{"name":"ports","ranges":{"range":[{"begin":31000,"end":32000}]},"type":"RANGES"}]
I0918 19:57:33.613597  6809 slave.cpp:591] Agent attributes: [  ]
I0918 19:57:33.613615  6809 slave.cpp:600] Agent hostname: 4119061d4863
I0918 19:57:33.613840  6805 status_update_manager.cpp:177] Pausing sending status updates
I0918 19:57:33.615908  6797 state.cpp:64] Recovering state from '/tmp/Endpoint_SlaveEndpointTest_UnauthorizedRequest_0_d2ttGi/meta'
I0918 19:57:33.616325  6797 status_update_manager.cpp:203] Recovering status update manager
I0918 19:57:33.616607  6811 containerizer.cpp:648] Recovering containerizer
I0918 19:57:33.618175  6812 provisioner.cpp:416] Provisioner recovery complete
I0918 19:57:33.618638  6814 slave.cpp:6298] Finished recovery
I0918 19:57:33.619066  6814 slave.cpp:6480] Querying resource estimator for oversubscribable
resources
I0918 19:57:33.619369  6801 slave.cpp:6494] Received oversubscribable resources {} from the
resource estimator
I0918 19:57:33.622426  6804 process.cpp:3929] Handling HTTP event for process 'slave(808)'
with path: '/slave(808)/monitor/statistics'
I0918 19:57:33.624295  6815 http.cpp:1185] HTTP GET for /slave(808)/monitor/statistics from
172.17.0.8:46546
I0918 19:57:33.624390  6815 http.cpp:976] Authorizing principal 'test-principal' to GET the
'/monitor/statistics' endpoint
I0918 19:57:33.626904  6773 slave.cpp:861] Agent terminating
[       OK ] Endpoint/SlaveEndpointTest.UnauthorizedRequest/0 (36 ms)
[ RUN      ] Endpoint/SlaveEndpointTest.UnauthorizedRequest/1
I0918 19:57:33.639925  6773 containerizer.cpp:292] Using isolation { environment_secret, posix/cpu,
posix/mem, filesystem/posix, network/cni }
W0918 19:57:33.640468  6773 backend.cpp:76] Failed to create 'aufs' backend: AufsBackend requires
root privileges
W0918 19:57:33.640596  6773 backend.cpp:76] Failed to create 'bind' backend: BindBackend requires
root privileges
I0918 19:57:33.640632  6773 provisioner.cpp:255] Using default backend 'copy'
I0918 19:57:33.644448  6806 slave.cpp:252] Mesos agent started on (809)@172.17.0.8:41557
I0918 19:57:33.644477  6806 slave.cpp:253] Flags at startup: --acls="" --appc_simple_discovery_uri_prefix="http://"
--appc_store_dir="/tmp/Endpoint_SlaveEndpointTest_UnauthorizedRequest_1_sYUthO/store/appc"
--authenticate_http_readonly="true" --authenticate_http_readwrite="true" --authenticatee="crammd5"
--authentication_backoff_factor="1secs" --authorizer="local" --cgroups_cpu_enable_pids_and_tids_count="false"
--cgroups_enable_cfs="false" --cgroups_hierarchy="/sys/fs/cgroup" --cgroups_limit_swap="false"
--cgroups_root="mesos" --container_disk_watch_interval="15secs" --containerizers="mesos" --credential="/tmp/Endpoint_SlaveEndpointTest_UnauthorizedRequest_1_sYUthO/credential"
--default_role="*" --disallow_sharing_agent_pid_namespace="false" --disk_watch_interval="1mins"
--docker="docker" --docker_kill_orphans="true" --docker_registry="https://registry-1.docker.io"
--docker_remove_delay="6hrs" --docker_socket="/var/run/docker.sock" --docker_stop_timeout="0ns"
--docker_store_dir="/tmp/Endpoint_SlaveEndpointTest_UnauthorizedRequest_1_sYUthO/store/docker"
--docker_volume_checkpoint_dir="/var/run/mesos/isolators/docker/volume" --enforce_container_disk_quota="false"
--executor_registration_timeout="1mins" --executor_reregistration_timeout="2secs" --executor_shutdown_grace_period="5secs"
--fetcher_cache_dir="/tmp/Endpoint_SlaveEndpointTest_UnauthorizedRequest_1_sYUthO/fetch" --fetcher_cache_size="2GB"
--frameworks_home="" --gc_delay="1weeks" --gc_disk_headroom="0.1" --hadoop_home="" --help="false"
--hostname_lookup="true" --http_command_executor="false" --http_credentials="/tmp/Endpoint_SlaveEndpointTest_UnauthorizedRequest_1_sYUthO/http_credentials"
--http_heartbeat_interval="30secs" --initialize_driver_logging="true" --isolation="posix/cpu,posix/mem"
--launcher="posix" --launcher_dir="/mesos/mesos-1.5.0/_build/src" --logbufsecs="0" --logging_level="INFO"
--max_completed_executors_per_framework="150" --oversubscribed_resources_interval="15secs"
--perf_duration="10secs" --perf_interval="1mins" --port="5051" --qos_correction_interval_min="0ns"
--quiet="false" --recover="reconnect" --recovery_timeout="15mins" --registration_backoff_factor="10ms"
--resources="cpus:2;gpus:0;mem:1024;disk:1024;ports:[31000-32000]" --revocable_cpu_low_priority="true"
--runtime_dir="/tmp/Endpoint_SlaveEndpointTest_UnauthorizedRequest_1_sYUthO" --sandbox_directory="/mnt/mesos/sandbox"
--strict="true" --switch_user="true" --systemd_enable_support="true" --systemd_runtime_directory="/run/systemd/system"
--version="false" --work_dir="/tmp/Endpoint_SlaveEndpointTest_UnauthorizedRequest_1_Ls4MkU"
--zk_session_timeout="10secs"
I0918 19:57:33.645123  6806 credentials.hpp:86] Loading credential for authentication from
'/tmp/Endpoint_SlaveEndpointTest_UnauthorizedRequest_1_sYUthO/credential'
I0918 19:57:33.645400  6806 slave.cpp:285] Agent using credential for: test-principal
I0918 19:57:33.645422  6806 credentials.hpp:37] Loading credentials for authentication from
'/tmp/Endpoint_SlaveEndpointTest_UnauthorizedRequest_1_sYUthO/http_credentials'
I0918 19:57:33.645776  6806 http.cpp:1045] Creating default 'basic' HTTP authenticator for
realm 'mesos-agent-readonly'
I0918 19:57:33.646031  6806 http.cpp:1045] Creating default 'basic' HTTP authenticator for
realm 'mesos-agent-readwrite'
I0918 19:57:33.648188  6806 slave.cpp:583] Agent resources: [{"name":"cpus","scalar":{"value":2.0},"type":"SCALAR"},{"name":"mem","scalar":{"value":1024.0},"type":"SCALAR"},{"name":"disk","scalar":{"value":1024.0},"type":"SCALAR"},{"name":"ports","ranges":{"range":[{"begin":31000,"end":32000}]},"type":"RANGES"}]
I0918 19:57:33.648609  6806 slave.cpp:591] Agent attributes: [  ]
I0918 19:57:33.648643  6806 slave.cpp:600] Agent hostname: 4119061d4863
I0918 19:57:33.648891  6798 status_update_manager.cpp:177] Pausing sending status updates
I0918 19:57:33.650748  6814 state.cpp:64] Recovering state from '/tmp/Endpoint_SlaveEndpointTest_UnauthorizedRequest_1_Ls4MkU/meta'
I0918 19:57:33.651206  6805 status_update_manager.cpp:203] Recovering status update manager
I0918 19:57:33.651468  6805 containerizer.cpp:648] Recovering containerizer
I0918 19:57:33.652986  6807 provisioner.cpp:416] Provisioner recovery complete
I0918 19:57:33.653409  6798 slave.cpp:6298] Finished recovery
I0918 19:57:33.653946  6798 slave.cpp:6480] Querying resource estimator for oversubscribable
resources
I0918 19:57:33.654301  6800 slave.cpp:6494] Received oversubscribable resources {} from the
resource estimator
I0918 19:57:33.657915  6812 process.cpp:3929] Handling HTTP event for process 'slave(809)'
with path: '/slave(809)/monitor/statistics.json'
I0918 19:57:33.659202  6801 http.cpp:1185] HTTP GET for /slave(809)/monitor/statistics.json
from 172.17.0.8:46548
I0918 19:57:33.659274  6801 http.cpp:976] Authorizing principal 'test-principal' to GET the
'/monitor/statistics.json' endpoint
I0918 19:57:33.662339  6807 slave.cpp:861] Agent terminating
[       OK ] Endpoint/SlaveEndpointTest.UnauthorizedRequest/1 (36 ms)
[ RUN      ] Endpoint/SlaveEndpointTest.UnauthorizedRequest/2
I0918 19:57:33.675592  6773 containerizer.cpp:292] Using isolation { environment_secret, posix/cpu,
posix/mem, filesystem/posix, network/cni }
W0918 19:57:33.676110  6773 backend.cpp:76] Failed to create 'aufs' backend: AufsBackend requires
root privileges
W0918 19:57:33.676221  6773 backend.cpp:76] Failed to create 'bind' backend: BindBackend requires
root privileges
I0918 19:57:33.676255  6773 provisioner.cpp:255] Using default backend 'copy'
I0918 19:57:33.679930  6802 slave.cpp:252] Mesos agent started on (810)@172.17.0.8:41557
I0918 19:57:33.679976  6802 slave.cpp:253] Flags at startup: --acls="" --appc_simple_discovery_uri_prefix="http://"
--appc_store_dir="/tmp/Endpoint_SlaveEndpointTest_UnauthorizedRequest_2_iCAlmq/store/appc"
--authenticate_http_readonly="true" --authenticate_http_readwrite="true" --authenticatee="crammd5"
--authentication_backoff_factor="1secs" --authorizer="local" --cgroups_cpu_enable_pids_and_tids_count="false"
--cgroups_enable_cfs="false" --cgroups_hierarchy="/sys/fs/cgroup" --cgroups_limit_swap="false"
--cgroups_root="mesos" --container_disk_watch_interval="15secs" --containerizers="mesos" --credential="/tmp/Endpoint_SlaveEndpointTest_UnauthorizedRequest_2_iCAlmq/credential"
--default_role="*" --disallow_sharing_agent_pid_namespace="false" --disk_watch_interval="1mins"
--docker="docker" --docker_kill_orphans="true" --docker_registry="https://registry-1.docker.io"
--docker_remove_delay="6hrs" --docker_socket="/var/run/docker.sock" --docker_stop_timeout="0ns"
--docker_store_dir="/tmp/Endpoint_SlaveEndpointTest_UnauthorizedRequest_2_iCAlmq/store/docker"
--docker_volume_checkpoint_dir="/var/run/mesos/isolators/docker/volume" --enforce_container_disk_quota="false"
--executor_registration_timeout="1mins" --executor_reregistration_timeout="2secs" --executor_shutdown_grace_period="5secs"
--fetcher_cache_dir="/tmp/Endpoint_SlaveEndpointTest_UnauthorizedRequest_2_iCAlmq/fetch" --fetcher_cache_size="2GB"
--frameworks_home="" --gc_delay="1weeks" --gc_disk_headroom="0.1" --hadoop_home="" --help="false"
--hostname_lookup="true" --http_command_executor="false" --http_credentials="/tmp/Endpoint_SlaveEndpointTest_UnauthorizedRequest_2_iCAlmq/http_credentials"
--http_heartbeat_interval="30secs" --initialize_driver_logging="true" --isolation="posix/cpu,posix/mem"
--launcher="posix" --launcher_dir="/mesos/mesos-1.5.0/_build/src" --logbufsecs="0" --logging_level="INFO"
--max_completed_executors_per_framework="150" --oversubscribed_resources_interval="15secs"
--perf_duration="10secs" --perf_interval="1mins" --port="5051" --qos_correction_interval_min="0ns"
--quiet="false" --recover="reconnect" --recovery_timeout="15mins" --registration_backoff_factor="10ms"
--resources="cpus:2;gpus:0;mem:1024;disk:1024;ports:[31000-32000]" --revocable_cpu_low_priority="true"
--runtime_dir="/tmp/Endpoint_SlaveEndpointTest_UnauthorizedRequest_2_iCAlmq" --sandbox_directory="/mnt/mesos/sandbox"
--strict="true" --switch_user="true" --systemd_enable_support="true" --systemd_runtime_directory="/run/systemd/system"
--version="false" --work_dir="/tmp/Endpoint_SlaveEndpointTest_UnauthorizedRequest_2_5EZkkw"
--zk_session_timeout="10secs"
I0918 19:57:33.680647  6802 credentials.hpp:86] Loading credential for authentication from
'/tmp/Endpoint_SlaveEndpointTest_UnauthorizedRequest_2_iCAlmq/credential'
I0918 19:57:33.680902  6802 slave.cpp:285] Agent using credential for: test-principal
I0918 19:57:33.680940  6802 credentials.hpp:37] Loading credentials for authentication from
'/tmp/Endpoint_SlaveEndpointTest_UnauthorizedRequest_2_iCAlmq/http_credentials'
I0918 19:57:33.681324  6802 http.cpp:1045] Creating default 'basic' HTTP authenticator for
realm 'mesos-agent-readonly'
I0918 19:57:33.681588  6802 http.cpp:1045] Creating default 'basic' HTTP authenticator for
realm 'mesos-agent-readwrite'
I0918 19:57:33.683967  6802 slave.cpp:583] Agent resources: [{"name":"cpus","scalar":{"value":2.0},"type":"SCALAR"},{"name":"mem","scalar":{"value":1024.0},"type":"SCALAR"},{"name":"disk","scalar":{"value":1024.0},"type":"SCALAR"},{"name":"ports","ranges":{"range":[{"begin":31000,"end":32000}]},"type":"RANGES"}]
I0918 19:57:33.684393  6802 slave.cpp:591] Agent attributes: [  ]
I0918 19:57:33.684417  6802 slave.cpp:600] Agent hostname: 4119061d4863
I0918 19:57:33.684643  6813 status_update_manager.cpp:177] Pausing sending status updates
I0918 19:57:33.686835  6804 state.cpp:64] Recovering state from '/tmp/Endpoint_SlaveEndpointTest_UnauthorizedRequest_2_5EZkkw/meta'
I0918 19:57:33.687129  6812 status_update_manager.cpp:203] Recovering status update manager
I0918 19:57:33.687377  6806 containerizer.cpp:648] Recovering containerizer
I0918 19:57:33.688804  6814 provisioner.cpp:416] Provisioner recovery complete
I0918 19:57:33.689184  6814 slave.cpp:6298] Finished recovery
I0918 19:57:33.689609  6814 slave.cpp:6480] Querying resource estimator for oversubscribable
resources
I0918 19:57:33.689828  6801 slave.cpp:6494] Received oversubscribable resources {} from the
resource estimator
I0918 19:57:33.693313  6796 process.cpp:3929] Handling HTTP event for process 'slave(810)'
with path: '/slave(810)/containers'
I0918 19:57:33.695004  6797 http.cpp:1185] HTTP GET for /slave(810)/containers from 172.17.0.8:46554
I0918 19:57:33.695091  6797 http.cpp:976] Authorizing principal 'test-principal' to GET the
'/containers' endpoint
I0918 19:57:33.697883  6773 slave.cpp:861] Agent terminating
[       OK ] Endpoint/SlaveEndpointTest.UnauthorizedRequest/2 (36 ms)
[ RUN      ] Endpoint/SlaveEndpointTest.NoAuthorizer/0
I0918 19:57:33.714623  6773 containerizer.cpp:292] Using isolation { environment_secret, posix/cpu,
posix/mem, filesystem/posix, network/cni }
W0918 19:57:33.715415  6773 backend.cpp:76] Failed to create 'aufs' backend: AufsBackend requires
root privileges
W0918 19:57:33.715589  6773 backend.cpp:76] Failed to create 'bind' backend: BindBackend requires
root privileges
I0918 19:57:33.715649  6773 provisioner.cpp:255] Using default backend 'copy'
I0918 19:57:33.718086  6773 cluster.cpp:448] Creating default 'local' authorizer
I0918 19:57:33.720746  6803 slave.cpp:252] Mesos agent started on (811)@172.17.0.8:41557
I0918 19:57:33.720782  6803 slave.cpp:253] Flags at startup: --acls="" --appc_simple_discovery_uri_prefix="http://"
--appc_store_dir="/tmp/Endpoint_SlaveEndpointTest_NoAuthorizer_0_yN08M2/store/appc" --authenticate_http_readonly="true"
--authenticate_http_readwrite="true" --authenticatee="crammd5" --authentication_backoff_factor="1secs"
--authorizer="local" --cgroups_cpu_enable_pids_and_tids_count="false" --cgroups_enable_cfs="false"
--cgroups_hierarchy="/sys/fs/cgroup" --cgroups_limit_swap="false" --cgroups_root="mesos" --container_disk_watch_interval="15secs"
--containerizers="mesos" --credential="/tmp/Endpoint_SlaveEndpointTest_NoAuthorizer_0_yN08M2/credential"
--default_role="*" --disallow_sharing_agent_pid_namespace="false" --disk_watch_interval="1mins"
--docker="docker" --docker_kill_orphans="true" --docker_registry="https://registry-1.docker.io"
--docker_remove_delay="6hrs" --docker_socket="/var/run/docker.sock" --docker_stop_timeout="0ns"
--docker_store_dir="/tmp/Endpoint_SlaveEndpointTest_NoAuthorizer_0_yN08M2/store/docker" --docker_volume_checkpoint_dir="/var/run/mesos/isolators/docker/volume"
--enforce_container_disk_quota="false" --executor_registration_timeout="1mins" --executor_reregistration_timeout="2secs"
--executor_shutdown_grace_period="5secs" --fetcher_cache_dir="/tmp/Endpoint_SlaveEndpointTest_NoAuthorizer_0_yN08M2/fetch"
--fetcher_cache_size="2GB" --frameworks_home="" --gc_delay="1weeks" --gc_disk_headroom="0.1"
--hadoop_home="" --help="false" --hostname_lookup="true" --http_command_executor="false" --http_credentials="/tmp/Endpoint_SlaveEndpointTest_NoAuthorizer_0_yN08M2/http_credentials"
--http_heartbeat_interval="30secs" --initialize_driver_logging="true" --isolation="posix/cpu,posix/mem"
--launcher="posix" --launcher_dir="/mesos/mesos-1.5.0/_build/src" --logbufsecs="0" --logging_level="INFO"
--max_completed_executors_per_framework="150" --oversubscribed_resources_interval="15secs"
--perf_duration="10secs" --perf_interval="1mins" --port="5051" --qos_correction_interval_min="0ns"
--quiet="false" --recover="reconnect" --recovery_timeout="15mins" --registration_backoff_factor="10ms"
--resources="cpus:2;gpus:0;mem:1024;disk:1024;ports:[31000-32000]" --revocable_cpu_low_priority="true"
--runtime_dir="/tmp/Endpoint_SlaveEndpointTest_NoAuthorizer_0_yN08M2" --sandbox_directory="/mnt/mesos/sandbox"
--strict="true" --switch_user="true" --systemd_enable_support="true" --systemd_runtime_directory="/run/systemd/system"
--version="false" --work_dir="/tmp/Endpoint_SlaveEndpointTest_NoAuthorizer_0_LvUxF8" --zk_session_timeout="10secs"
I0918 19:57:33.721436  6803 credentials.hpp:86] Loading credential for authentication from
'/tmp/Endpoint_SlaveEndpointTest_NoAuthorizer_0_yN08M2/credential'
I0918 19:57:33.721659  6803 slave.cpp:285] Agent using credential for: test-principal
I0918 19:57:33.721684  6803 credentials.hpp:37] Loading credentials for authentication from
'/tmp/Endpoint_SlaveEndpointTest_NoAuthorizer_0_yN08M2/http_credentials'
I0918 19:57:33.722020  6803 http.cpp:1045] Creating default 'basic' HTTP authenticator for
realm 'mesos-agent-readonly'
I0918 19:57:33.722239  6803 http.cpp:1045] Creating default 'basic' HTTP authenticator for
realm 'mesos-agent-readwrite'
I0918 19:57:33.723891  6803 slave.cpp:583] Agent resources: [{"name":"cpus","scalar":{"value":2.0},"type":"SCALAR"},{"name":"mem","scalar":{"value":1024.0},"type":"SCALAR"},{"name":"disk","scalar":{"value":1024.0},"type":"SCALAR"},{"name":"ports","ranges":{"range":[{"begin":31000,"end":32000}]},"type":"RANGES"}]
I0918 19:57:33.724162  6803 slave.cpp:591] Agent attributes: [  ]
I0918 19:57:33.724176  6803 slave.cpp:600] Agent hostname: 4119061d4863
I0918 19:57:33.724377  6793 status_update_manager.cpp:177] Pausing sending status updates
I0918 19:57:33.726379  6814 state.cpp:64] Recovering state from '/tmp/Endpoint_SlaveEndpointTest_NoAuthorizer_0_LvUxF8/meta'
I0918 19:57:33.726773  6808 status_update_manager.cpp:203] Recovering status update manager
I0918 19:57:33.727020  6810 containerizer.cpp:648] Recovering containerizer
I0918 19:57:33.728618  6792 provisioner.cpp:416] Provisioner recovery complete
I0918 19:57:33.729120  6811 slave.cpp:6298] Finished recovery
I0918 19:57:33.729763  6811 slave.cpp:6480] Querying resource estimator for oversubscribable
resources
I0918 19:57:33.730067  6797 slave.cpp:6494] Received oversubscribable resources {} from the
resource estimator
I0918 19:57:33.732908  6815 process.cpp:3929] Handling HTTP event for process 'slave(811)'
with path: '/slave(811)/monitor/statistics'
I0918 19:57:33.734835  6805 http.cpp:1185] HTTP GET for /slave(811)/monitor/statistics from
172.17.0.8:46562
I0918 19:57:33.734936  6805 http.cpp:976] Authorizing principal 'test-principal' to GET the
'/monitor/statistics' endpoint
I0918 19:57:33.738991  6773 slave.cpp:861] Agent terminating
[       OK ] Endpoint/SlaveEndpointTest.NoAuthorizer/0 (41 ms)
[ RUN      ] Endpoint/SlaveEndpointTest.NoAuthorizer/1
I0918 19:57:33.757899  6773 containerizer.cpp:292] Using isolation { environment_secret, posix/cpu,
posix/mem, filesystem/posix, network/cni }
W0918 19:57:33.758765  6773 backend.cpp:76] Failed to create 'aufs' backend: AufsBackend requires
root privileges
W0918 19:57:33.758958  6773 backend.cpp:76] Failed to create 'bind' backend: BindBackend requires
root privileges
I0918 19:57:33.759023  6773 provisioner.cpp:255] Using default backend 'copy'
I0918 19:57:33.761698  6773 cluster.cpp:448] Creating default 'local' authorizer
I0918 19:57:33.764524  6801 slave.cpp:252] Mesos agent started on (812)@172.17.0.8:41557
I0918 19:57:33.764552  6801 slave.cpp:253] Flags at startup: --acls="" --appc_simple_discovery_uri_prefix="http://"
--appc_store_dir="/tmp/Endpoint_SlaveEndpointTest_NoAuthorizer_1_1OrHCF/store/appc" --authenticate_http_readonly="true"
--authenticate_http_readwrite="true" --authenticatee="crammd5" --authentication_backoff_factor="1secs"
--authorizer="local" --cgroups_cpu_enable_pids_and_tids_count="false" --cgroups_enable_cfs="false"
--cgroups_hierarchy="/sys/fs/cgroup" --cgroups_limit_swap="false" --cgroups_root="mesos" --container_disk_watch_interval="15secs"
--containerizers="mesos" --credential="/tmp/Endpoint_SlaveEndpointTest_NoAuthorizer_1_1OrHCF/credential"
--default_role="*" --disallow_sharing_agent_pid_namespace="false" --disk_watch_interval="1mins"
--docker="docker" --docker_kill_orphans="true" --docker_registry="https://registry-1.docker.io"
--docker_remove_delay="6hrs" --docker_socket="/var/run/docker.sock" --docker_stop_timeout="0ns"
--docker_store_dir="/tmp/Endpoint_SlaveEndpointTest_NoAuthorizer_1_1OrHCF/store/docker" --docker_volume_checkpoint_dir="/var/run/mesos/isolators/docker/volume"
--enforce_container_disk_quota="false" --executor_registration_timeout="1mins" --executor_reregistration_timeout="2secs"
--executor_shutdown_grace_period="5secs" --fetcher_cache_dir="/tmp/Endpoint_SlaveEndpointTest_NoAuthorizer_1_1OrHCF/fetch"
--fetcher_cache_size="2GB" --frameworks_home="" --gc_delay="1weeks" --gc_disk_headroom="0.1"
--hadoop_home="" --help="false" --hostname_lookup="true" --http_command_executor="false" --http_credentials="/tmp/Endpoint_SlaveEndpointTest_NoAuthorizer_1_1OrHCF/http_credentials"
--http_heartbeat_interval="30secs" --initialize_driver_logging="true" --isolation="posix/cpu,posix/mem"
--launcher="posix" --launcher_dir="/mesos/mesos-1.5.0/_build/src" --logbufsecs="0" --logging_level="INFO"
--max_completed_executors_per_framework="150" --oversubscribed_resources_interval="15secs"
--perf_duration="10secs" --perf_interval="1mins" --port="5051" --qos_correction_interval_min="0ns"
--quiet="false" --recover="reconnect" --recovery_timeout="15mins" --registration_backoff_factor="10ms"
--resources="cpus:2;gpus:0;mem:1024;disk:1024;ports:[31000-32000]" --revocable_cpu_low_priority="true"
--runtime_dir="/tmp/Endpoint_SlaveEndpointTest_NoAuthorizer_1_1OrHCF" --sandbox_directory="/mnt/mesos/sandbox"
--strict="true" --switch_user="true" --systemd_enable_support="true" --systemd_runtime_directory="/run/systemd/system"
--version="false" --work_dir="/tmp/Endpoint_SlaveEndpointTest_NoAuthorizer_1_fQVNoL" --zk_session_timeout="10secs"
I0918 19:57:33.765096  6801 credentials.hpp:86] Loading credential for authentication from
'/tmp/Endpoint_SlaveEndpointTest_NoAuthorizer_1_1OrHCF/credential'
I0918 19:57:33.765305  6801 slave.cpp:285] Agent using credential for: test-principal
I0918 19:57:33.765332  6801 credentials.hpp:37] Loading credentials for authentication from
'/tmp/Endpoint_SlaveEndpointTest_NoAuthorizer_1_1OrHCF/http_credentials'
I0918 19:57:33.765635  6801 http.cpp:1045] Creating default 'basic' HTTP authenticator for
realm 'mesos-agent-readonly'
I0918 19:57:33.765839  6801 http.cpp:1045] Creating default 'basic' HTTP authenticator for
realm 'mesos-agent-readwrite'
I0918 19:57:33.767395  6801 slave.cpp:583] Agent resources: [{"name":"cpus","scalar":{"value":2.0},"type":"SCALAR"},{"name":"mem","scalar":{"value":1024.0},"type":"SCALAR"},{"name":"disk","scalar":{"value":1024.0},"type":"SCALAR"},{"name":"ports","ranges":{"range":[{"begin":31000,"end":32000}]},"type":"RANGES"}]
I0918 19:57:33.767659  6801 slave.cpp:591] Agent attributes: [  ]
I0918 19:57:33.767676  6801 slave.cpp:600] Agent hostname: 4119061d4863
I0918 19:57:33.767891  6811 status_update_manager.cpp:177] Pausing sending status updates
I0918 19:57:33.769580  6792 state.cpp:64] Recovering state from '/tmp/Endpoint_SlaveEndpointTest_NoAuthorizer_1_fQVNoL/meta'
I0918 19:57:33.769973  6800 status_update_manager.cpp:203] Recovering status update manager
I0918 19:57:33.770292  6805 containerizer.cpp:648] Recovering containerizer
I0918 19:57:33.771842  6794 provisioner.cpp:416] Provisioner recovery complete
I0918 19:57:33.772265  6811 slave.cpp:6298] Finished recovery
I0918 19:57:33.772812  6811 slave.cpp:6480] Querying resource estimator for oversubscribable
resources
I0918 19:57:33.773198  6796 slave.cpp:6494] Received oversubscribable resources {} from the
resource estimator
I0918 19:57:33.776126  6812 process.cpp:3929] Handling HTTP event for process 'slave(812)'
with path: '/slave(812)/monitor/statistics.json'
I0918 19:57:33.778115  6798 http.cpp:1185] HTTP GET for /slave(812)/monitor/statistics.json
from 172.17.0.8:46566
I0918 19:57:33.778213  6798 http.cpp:976] Authorizing principal 'test-principal' to GET the
'/monitor/statistics.json' endpoint
I0918 19:57:33.783071  6773 slave.cpp:861] Agent terminating
[       OK ] Endpoint/SlaveEndpointTest.NoAuthorizer/1 (42 ms)
[ RUN      ] Endpoint/SlaveEndpointTest.NoAuthorizer/2
I0918 19:57:33.797075  6773 containerizer.cpp:292] Using isolation { environment_secret, posix/cpu,
posix/mem, filesystem/posix, network/cni }
W0918 19:57:33.797611  6773 backend.cpp:76] Failed to create 'aufs' backend: AufsBackend requires
root privileges
W0918 19:57:33.797778  6773 backend.cpp:76] Failed to create 'bind' backend: BindBackend requires
root privileges
I0918 19:57:33.797816  6773 provisioner.cpp:255] Using default backend 'copy'
I0918 19:57:33.799707  6773 cluster.cpp:448] Creating default 'local' authorizer
I0918 19:57:33.801972  6814 slave.cpp:252] Mesos agent started on (813)@172.17.0.8:41557
I0918 19:57:33.802001  6814 slave.cpp:253] Flags at startup: --acls="" --appc_simple_discovery_uri_prefix="http://"
--appc_store_dir="/tmp/Endpoint_SlaveEndpointTest_NoAuthorizer_2_bNtbRi/store/appc" --authenticate_http_readonly="true"
--authenticate_http_readwrite="true" --authenticatee="crammd5" --authentication_backoff_factor="1secs"
--authorizer="local" --cgroups_cpu_enable_pids_and_tids_count="false" --cgroups_enable_cfs="false"
--cgroups_hierarchy="/sys/fs/cgroup" --cgroups_limit_swap="false" --cgroups_root="mesos" --container_disk_watch_interval="15secs"
--containerizers="mesos" --credential="/tmp/Endpoint_SlaveEndpointTest_NoAuthorizer_2_bNtbRi/credential"
--default_role="*" --disallow_sharing_agent_pid_namespace="false" --disk_watch_interval="1mins"
--docker="docker" --docker_kill_orphans="true" --docker_registry="https://registry-1.docker.io"
--docker_remove_delay="6hrs" --docker_socket="/var/run/docker.sock" --docker_stop_timeout="0ns"
--docker_store_dir="/tmp/Endpoint_SlaveEndpointTest_NoAuthorizer_2_bNtbRi/store/docker" --docker_volume_checkpoint_dir="/var/run/mesos/isolators/docker/volume"
--enforce_container_disk_quota="false" --executor_registration_timeout="1mins" --executor_reregistration_timeout="2secs"
--executor_shutdown_grace_period="5secs" --fetcher_cache_dir="/tmp/Endpoint_SlaveEndpointTest_NoAuthorizer_2_bNtbRi/fetch"
--fetcher_cache_size="2GB" --frameworks_home="" --gc_delay="1weeks" --gc_disk_headroom="0.1"
--hadoop_home="" --help="false" --hostname_lookup="true" --http_command_executor="false" --http_credentials="/tmp/Endpoint_SlaveEndpointTest_NoAuthorizer_2_bNtbRi/http_credentials"
--http_heartbeat_interval="30secs" --initialize_driver_logging="true" --isolation="posix/cpu,posix/mem"
--launcher="posix" --launcher_dir="/mesos/mesos-1.5.0/_build/src" --logbufsecs="0" --logging_level="INFO"
--max_completed_executors_per_framework="150" --oversubscribed_resources_interval="15secs"
--perf_duration="10secs" --perf_interval="1mins" --port="5051" --qos_correction_interval_min="0ns"
--quiet="false" --recover="reconnect" --recovery_timeout="15mins" --registration_backoff_factor="10ms"
--resources="cpus:2;gpus:0;mem:1024;disk:1024;ports:[31000-32000]" --revocable_cpu_low_priority="true"
--runtime_dir="/tmp/Endpoint_SlaveEndpointTest_NoAuthorizer_2_bNtbRi" --sandbox_directory="/mnt/mesos/sandbox"
--strict="true" --switch_user="true" --systemd_enable_support="true" --systemd_runtime_directory="/run/systemd/system"
--version="false" --work_dir="/tmp/Endpoint_SlaveEndpointTest_NoAuthorizer_2_oXnbxo" --zk_session_timeout="10secs"
I0918 19:57:33.802426  6814 credentials.hpp:86] Loading credential for authentication from
'/tmp/Endpoint_SlaveEndpointTest_NoAuthorizer_2_bNtbRi/credential'
I0918 19:57:33.802621  6814 slave.cpp:285] Agent using credential for: test-principal
I0918 19:57:33.802654  6814 credentials.hpp:37] Loading credentials for authentication from
'/tmp/Endpoint_SlaveEndpointTest_NoAuthorizer_2_bNtbRi/http_credentials'
I0918 19:57:33.802911  6814 http.cpp:1045] Creating default 'basic' HTTP authenticator for
realm 'mesos-agent-readonly'
I0918 19:57:33.803102  6814 http.cpp:1045] Creating default 'basic' HTTP authenticator for
realm 'mesos-agent-readwrite'
I0918 19:57:33.804527  6814 slave.cpp:583] Agent resources: [{"name":"cpus","scalar":{"value":2.0},"type":"SCALAR"},{"name":"mem","scalar":{"value":1024.0},"type":"SCALAR"},{"name":"disk","scalar":{"value":1024.0},"type":"SCALAR"},{"name":"ports","ranges":{"range":[{"begin":31000,"end":32000}]},"type":"RANGES"}]
I0918 19:57:33.804780  6814 slave.cpp:591] Agent attributes: [  ]
I0918 19:57:33.804793  6814 slave.cpp:600] Agent hostname: 4119061d4863
I0918 19:57:33.804952  6800 status_update_manager.cpp:177] Pausing sending status updates
I0918 19:57:33.806874  6804 state.cpp:64] Recovering state from '/tmp/Endpoint_SlaveEndpointTest_NoAuthorizer_2_oXnbxo/meta'
I0918 19:57:33.807253  6810 status_update_manager.cpp:203] Recovering status update manager
I0918 19:57:33.807577  6807 containerizer.cpp:648] Recovering containerizer
I0918 19:57:33.809401  6794 provisioner.cpp:416] Provisioner recovery complete
I0918 19:57:33.809861  6798 slave.cpp:6298] Finished recovery
I0918 19:57:33.810463  6798 slave.cpp:6480] Querying resource estimator for oversubscribable
resources
I0918 19:57:33.810870  6798 slave.cpp:6494] Received oversubscribable resources {} from the
resource estimator
I0918 19:57:33.813750  6805 process.cpp:3929] Handling HTTP event for process 'slave(813)'
with path: '/slave(813)/containers'
I0918 19:57:33.815282  6796 http.cpp:1185] HTTP GET for /slave(813)/containers from 172.17.0.8:46570
I0918 19:57:33.815369  6796 http.cpp:976] Authorizing principal 'test-principal' to GET the
'/containers' endpoint
I0918 19:57:33.819828  6773 slave.cpp:861] Agent terminating
[       OK ] Endpoint/SlaveEndpointTest.NoAuthorizer/2 (35 ms)
[----------] 9 tests from Endpoint/SlaveEndpointTest (347 ms total)

[----------] 2 tests from ContainerizerType/DefaultContainerDNSFlagTest
[ RUN      ] ContainerizerType/DefaultContainerDNSFlagTest.ValidateFlag/0
[       OK ] ContainerizerType/DefaultContainerDNSFlagTest.ValidateFlag/0 (12 ms)
[ RUN      ] ContainerizerType/DefaultContainerDNSFlagTest.ValidateFlag/1
[       OK ] ContainerizerType/DefaultContainerDNSFlagTest.ValidateFlag/1 (10 ms)
[----------] 2 tests from ContainerizerType/DefaultContainerDNSFlagTest (22 ms total)

[----------] Global test environment tear-down
[==========] 1664 tests from 183 test cases ran. (668554 ms total)
[  PASSED  ] 1659 tests.
[  FAILED  ] 5 tests, listed below:
[  FAILED  ] CommandExecutorCheckTest.CommandCheckDeliveredAndReconciled
[  FAILED  ] DefaultExecutorCheckTest.CommandCheckDeliveredAndReconciled
[  FAILED  ] DefaultExecutorCheckTest.CommandCheckStatusChange
[  FAILED  ] DefaultExecutorCheckTest.CommandCheckSeesParentsEnv
[  FAILED  ] DefaultExecutorCheckTest.CommandCheckSharesWorkDirWithTask

 5 FAILED TESTS
  YOU HAVE 20 DISABLED TESTS

I0918 19:57:33.913839  6816 process.cpp:1068] Failed to accept socket: future discarded
make[4]: *** [check-local] Error 1
make[4]: Leaving directory `/mesos/mesos-1.5.0/_build/src'
make[3]: *** [check-am] Error 2
make[3]: Leaving directory `/mesos/mesos-1.5.0/_build/src'
make[2]: *** [check] Error 2
make[2]: Leaving directory `/mesos/mesos-1.5.0/_build/src'
make[1]: *** [check-recursive] Error 1
make[1]: Leaving directory `/mesos/mesos-1.5.0/_build'
make: *** [distcheck] Error 1
+ docker rmi mesos-1505761852-6810
Untagged: mesos-1505761852-6810:latest
Deleted: sha256:92f0aa24c07ef3b201871935ec1ab58deec433fcb55901e3fbb799de90180dac
Deleted: sha256:82fec9d989817a0e6dbaaa5b286d971ef775ac3af59dea8df467560edbe82818
Deleted: sha256:f462a3c27279ac0542b07207acb97264cf901e3930a205191e0cf97d77f239e4
Deleted: sha256:13366cc2db1a89726c979fad966f9246057dd336cccddaac4d68ac4e8b4fb051
Deleted: sha256:a3c59d1b854f5b43f7318cf466c1a073068b8693aaec8a96f2728b8dafcb8676
Deleted: sha256:842916614b064521af8f77fdacc12e82a66eaa601d6d2384be7842ef238e4e9f
Deleted: sha256:5eb4d34fb62d54738424623022d7e4a1dd3572c95ad844df41452ee9162306eb
Deleted: sha256:3dfa1f45471ac7a3f87d8f9a92504d1e6c4c4b62f64c7a307d061b1eb45d07d3
Deleted: sha256:5ea52414a391aa9765a19bd319f5a16680f260a80e3b7663ed67d7ea44286574
Deleted: sha256:b5d923c677905f1ebad35735496a158234148c7b2745075603ced1020c33bb1b
Deleted: sha256:b553b84e92dc3c98194d855ed876ad36617e930a68994b6d58a421667838026c
Deleted: sha256:3633ca548a48ac7b353ab430963ec536eeae9a8de16d49d6b404a8b76fd97081
Deleted: sha256:1be6f97ea94d302071765fc33bba6aeac8181fb3a849438079ab792b6909334c
Deleted: sha256:86cc89bdd36e1e11ec4b51317c7d6d741359e38bce8ad633a4149bb2088756e9
Deleted: sha256:96311816ecffacfa5b251b700e58e01b1fe4cfc11acc7d742f83afaf99ebdfbb
Deleted: sha256:f4fc37e0acb39a25e5e925d823880ab5e340f23e500716babf5c0e5a7707230a
Deleted: sha256:4c1ab5022c00c5f25c8e5b672e0e8fddf4c91cd3fa7bcdb014fc1497bb3268da
Deleted: sha256:0d9d303d2e4857279617cd90c2588dbbeb6d5f897b226498ecdbfdab2a8f7e84
Deleted: sha256:998a11692b4038aeeb910f40f4b6f6eff1fb5710d5f3fecf01e7ec0dbae9f27e
Deleted: sha256:e553e87c906d64ea2cdc34a6d75f1d0456e4a9a31af56699f7c1a0040104595b
Deleted: sha256:a1ed11f29f7ee052895e54a727d2d00da1675e2653952962aeafdcd9714c328c
Deleted: sha256:bd7109d2de90915306861294fab342258697e7de4a4a70e9578d67733d9a4fa2
Deleted: sha256:c401bb7abad16697e4d1c6a9e2351e4b1635c090fdd0938c6ab03221a62a107e
Deleted: sha256:684536ee4452252944cf89404f9dd2a10e098979c7b1fbdafbacf73b258b1511
Deleted: sha256:b4926069f2e5b77209da5a93d1e80186a10c4cb4f3582b638b0502e63af9d49b
Deleted: sha256:b0163b76158aafcdbead0960accb42ebef91e5f73299bd9f4b0b63efea453b81
Deleted: sha256:b0fc3963aa32c923a5d15714b4c8d951528af5103f1d0e90d9a4e3a9b701ff83
Deleted: sha256:27f47a6d28dc3376e7ef387fb59d8df4555fbdaed4bfe14bd7aa76f317640642
Deleted: sha256:80bc4a3a2c0013ead8700119abc0dfc912e334e4630e06b84f3f2bc22f63c95f
Build step 'Execute shell' marked build as failure
Not sending mail to unregistered user yujie.jay@gmail.com

Mime
View raw message