mesos-builds mailing list archives

Site index · List index
Message view « Date » · « Thread »
Top « Date » · « Thread »
From Apache Jenkins Server <jenk...@builds.apache.org>
Subject Build failed in Jenkins: Mesos-Buildbot » cmake,clang,--verbose --enable-libevent --enable-ssl,GLOG_v=1 MESOS_VERBOSE=1,ubuntu:14.04,(ubuntu)&&(!ubuntu-us1)&&(!ubuntu-eu2)&&(!qnode3)&&(!H23) #4222
Date Thu, 14 Sep 2017 01:53:03 GMT
See <https://builds.apache.org/job/Mesos-Buildbot/BUILDTOOL=cmake,COMPILER=clang,CONFIGURATION=--verbose%20--enable-libevent%20--enable-ssl,ENVIRONMENT=GLOG_v=1%20MESOS_VERBOSE=1,OS=ubuntu%3A14.04,label_exp=(ubuntu)&&(!ubuntu-us1)&&(!ubuntu-eu2)&&(!qnode3)&&(!H23)/4222/display/redirect>

------------------------------------------
[...truncated 26.06 MB...]
I0914 01:52:48.451558 29180 slave.cpp:6107] Finished recovery
I0914 01:52:48.452047 29180 slave.cpp:6289] Querying resource estimator for oversubscribable
resources
I0914 01:52:48.452196 29184 slave.cpp:6303] Received oversubscribable resources {} from the
resource estimator
I0914 01:52:48.453718 29184 process.cpp:3741] Handling HTTP event for process 'slave(743)'
with path: '/slave(743)/containers'
I0914 01:52:48.455226 29181 http.cpp:1115] HTTP GET for /slave(743)/containers from 172.17.0.2:35876
I0914 01:52:48.455284 29181 http.cpp:936] Authorizing principal 'test-principal' to GET the
'/containers' endpoint
I0914 01:52:48.457487 25282 slave.cpp:796] Agent terminating
[       OK ] Endpoint/SlaveEndpointTest.AuthorizedRequest/2 (18 ms)
[ RUN      ] Endpoint/SlaveEndpointTest.UnauthorizedRequest/0
I0914 01:52:48.464283 25282 containerizer.cpp:221] Using isolation: posix/cpu,posix/mem,filesystem/posix,network/cni
W0914 01:52:48.464689 25282 backend.cpp:76] Failed to create 'overlay' backend: OverlayBackend
requires root privileges
W0914 01:52:48.464747 25282 backend.cpp:76] Failed to create 'bind' backend: BindBackend requires
root privileges
I0914 01:52:48.464769 25282 provisioner.cpp:249] Using default backend 'copy'
I0914 01:52:48.466192 29183 slave.cpp:231] Mesos agent started on (744)@172.17.0.2:42407
I0914 01:52:48.466234 29183 slave.cpp:232] Flags at startup: --acls="" --appc_simple_discovery_uri_prefix="http://"
--appc_store_dir="/tmp/mesos/store/appc" --authenticate_http_executors="true" --authenticate_http_readonly="true"
--authenticate_http_readwrite="true" --authenticatee="crammd5" --authentication_backoff_factor="1secs"
--authorizer="local" --cgroups_cpu_enable_pids_and_tids_count="false" --cgroups_enable_cfs="false"
--cgroups_hierarchy="/sys/fs/cgroup" --cgroups_limit_swap="false" --cgroups_root="mesos" --container_disk_watch_interval="15secs"
--containerizers="mesos" --credential="/tmp/Endpoint_SlaveEndpointTest_UnauthorizedRequest_0_52Ce1t/credential"
--default_role="*" --disk_watch_interval="1mins" --docker="docker" --docker_kill_orphans="true"
--docker_registry="https://registry-1.docker.io" --docker_remove_delay="6hrs" --docker_socket="/var/run/docker.sock"
--docker_stop_timeout="0ns" --docker_store_dir="/tmp/mesos/store/docker" --docker_volume_checkpoint_dir="/var/run/mesos/isolators/docker/volume"
--enforce_container_disk_quota="false" --executor_registration_timeout="1mins" --executor_reregistration_timeout="2secs"
--executor_secret_key="/tmp/Endpoint_SlaveEndpointTest_UnauthorizedRequest_0_52Ce1t/executor_secret_key"
--executor_shutdown_grace_period="5secs" --fetcher_cache_dir="/tmp/Endpoint_SlaveEndpointTest_UnauthorizedRequest_0_52Ce1t/fetch"
--fetcher_cache_size="2GB" --frameworks_home="" --gc_delay="1weeks" --gc_disk_headroom="0.1"
--hadoop_home="" --help="false" --hostname_lookup="true" --http_command_executor="false" --http_credentials="/tmp/Endpoint_SlaveEndpointTest_UnauthorizedRequest_0_52Ce1t/http_credentials"
--http_heartbeat_interval="30secs" --initialize_driver_logging="true" --isolation="posix/cpu,posix/mem"
--launcher="posix" --launcher_dir="/mesos/build/src" --logbufsecs="0" --logging_level="INFO"
--max_completed_executors_per_framework="150" --oversubscribed_resources_interval="15secs"
--perf_duration="10secs" --perf_interval="1mins" --port="5051" --qos_correction_interval_min="0ns"
--quiet="false" --recover="reconnect" --recovery_timeout="15mins" --registration_backoff_factor="10ms"
--resources="cpus:2;gpus:0;mem:1024;disk:1024;ports:[31000-32000]" --revocable_cpu_low_priority="true"
--runtime_dir="/tmp/Endpoint_SlaveEndpointTest_UnauthorizedRequest_0_52Ce1t" --sandbox_directory="/mnt/mesos/sandbox"
--strict="true" --switch_user="true" --systemd_enable_support="true" --systemd_runtime_directory="/run/systemd/system"
--version="false" --work_dir="/tmp/Endpoint_SlaveEndpointTest_UnauthorizedRequest_0_JA3QNZ"
I0914 01:52:48.466632 29183 credentials.hpp:86] Loading credential for authentication from
'/tmp/Endpoint_SlaveEndpointTest_UnauthorizedRequest_0_52Ce1t/credential'
I0914 01:52:48.466760 29183 slave.cpp:264] Agent using credential for: test-principal
I0914 01:52:48.466775 29183 credentials.hpp:37] Loading credentials for authentication from
'/tmp/Endpoint_SlaveEndpointTest_UnauthorizedRequest_0_52Ce1t/http_credentials'
I0914 01:52:48.466939 29183 http.cpp:975] Creating default 'basic' HTTP authenticator for
realm 'mesos-agent-executor'
I0914 01:52:48.467001 29183 http.cpp:996] Creating default 'jwt' HTTP authenticator for realm
'mesos-agent-executor'
I0914 01:52:48.467082 29183 http.cpp:975] Creating default 'basic' HTTP authenticator for
realm 'mesos-agent-readonly'
I0914 01:52:48.467119 29183 http.cpp:996] Creating default 'jwt' HTTP authenticator for realm
'mesos-agent-readonly'
I0914 01:52:48.467178 29183 http.cpp:975] Creating default 'basic' HTTP authenticator for
realm 'mesos-agent-readwrite'
I0914 01:52:48.467213 29183 http.cpp:996] Creating default 'jwt' HTTP authenticator for realm
'mesos-agent-readwrite'
I0914 01:52:48.467943 29183 slave.cpp:531] Agent resources: cpus(*):2; mem(*):1024; disk(*):1024;
ports(*):[31000-32000]
I0914 01:52:48.468052 29183 slave.cpp:539] Agent attributes: [  ]
I0914 01:52:48.468065 29183 slave.cpp:544] Agent hostname: 686c704f8e65
I0914 01:52:48.468164 29186 status_update_manager.cpp:177] Pausing sending status updates
I0914 01:52:48.468605 29183 state.cpp:62] Recovering state from '/tmp/Endpoint_SlaveEndpointTest_UnauthorizedRequest_0_JA3QNZ/meta'
I0914 01:52:48.468811 29181 status_update_manager.cpp:203] Recovering status update manager
I0914 01:52:48.468981 29185 containerizer.cpp:608] Recovering containerizer
I0914 01:52:48.469674 29185 provisioner.cpp:410] Provisioner recovery complete
I0914 01:52:48.469864 29185 slave.cpp:6107] Finished recovery
I0914 01:52:48.470903 29185 slave.cpp:6289] Querying resource estimator for oversubscribable
resources
I0914 01:52:48.471148 29185 slave.cpp:6303] Received oversubscribable resources {} from the
resource estimator
I0914 01:52:48.473177 29183 process.cpp:3741] Handling HTTP event for process 'slave(744)'
with path: '/slave(744)/monitor/statistics'
I0914 01:52:48.473917 29184 http.cpp:1115] HTTP GET for /slave(744)/monitor/statistics from
172.17.0.2:35878
I0914 01:52:48.473978 29184 http.cpp:936] Authorizing principal 'test-principal' to GET the
'/monitor/statistics' endpoint
I0914 01:52:48.475378 29184 slave.cpp:796] Agent terminating
[       OK ] Endpoint/SlaveEndpointTest.UnauthorizedRequest/0 (17 ms)
[ RUN      ] Endpoint/SlaveEndpointTest.UnauthorizedRequest/1
I0914 01:52:48.482372 25282 containerizer.cpp:221] Using isolation: posix/cpu,posix/mem,filesystem/posix,network/cni
W0914 01:52:48.482770 25282 backend.cpp:76] Failed to create 'overlay' backend: OverlayBackend
requires root privileges
W0914 01:52:48.482831 25282 backend.cpp:76] Failed to create 'bind' backend: BindBackend requires
root privileges
I0914 01:52:48.482852 25282 provisioner.cpp:249] Using default backend 'copy'
I0914 01:52:48.484195 29181 slave.cpp:231] Mesos agent started on (745)@172.17.0.2:42407
I0914 01:52:48.484236 29181 slave.cpp:232] Flags at startup: --acls="" --appc_simple_discovery_uri_prefix="http://"
--appc_store_dir="/tmp/mesos/store/appc" --authenticate_http_executors="true" --authenticate_http_readonly="true"
--authenticate_http_readwrite="true" --authenticatee="crammd5" --authentication_backoff_factor="1secs"
--authorizer="local" --cgroups_cpu_enable_pids_and_tids_count="false" --cgroups_enable_cfs="false"
--cgroups_hierarchy="/sys/fs/cgroup" --cgroups_limit_swap="false" --cgroups_root="mesos" --container_disk_watch_interval="15secs"
--containerizers="mesos" --credential="/tmp/Endpoint_SlaveEndpointTest_UnauthorizedRequest_1_dv9A2q/credential"
--default_role="*" --disk_watch_interval="1mins" --docker="docker" --docker_kill_orphans="true"
--docker_registry="https://registry-1.docker.io" --docker_remove_delay="6hrs" --docker_socket="/var/run/docker.sock"
--docker_stop_timeout="0ns" --docker_store_dir="/tmp/mesos/store/docker" --docker_volume_checkpoint_dir="/var/run/mesos/isolators/docker/volume"
--enforce_container_disk_quota="false" --executor_registration_timeout="1mins" --executor_reregistration_timeout="2secs"
--executor_secret_key="/tmp/Endpoint_SlaveEndpointTest_UnauthorizedRequest_1_dv9A2q/executor_secret_key"
--executor_shutdown_grace_period="5secs" --fetcher_cache_dir="/tmp/Endpoint_SlaveEndpointTest_UnauthorizedRequest_1_dv9A2q/fetch"
--fetcher_cache_size="2GB" --frameworks_home="" --gc_delay="1weeks" --gc_disk_headroom="0.1"
--hadoop_home="" --help="false" --hostname_lookup="true" --http_command_executor="false" --http_credentials="/tmp/Endpoint_SlaveEndpointTest_UnauthorizedRequest_1_dv9A2q/http_credentials"
--http_heartbeat_interval="30secs" --initialize_driver_logging="true" --isolation="posix/cpu,posix/mem"
--launcher="posix" --launcher_dir="/mesos/build/src" --logbufsecs="0" --logging_level="INFO"
--max_completed_executors_per_framework="150" --oversubscribed_resources_interval="15secs"
--perf_duration="10secs" --perf_interval="1mins" --port="5051" --qos_correction_interval_min="0ns"
--quiet="false" --recover="reconnect" --recovery_timeout="15mins" --registration_backoff_factor="10ms"
--resources="cpus:2;gpus:0;mem:1024;disk:1024;ports:[31000-32000]" --revocable_cpu_low_priority="true"
--runtime_dir="/tmp/Endpoint_SlaveEndpointTest_UnauthorizedRequest_1_dv9A2q" --sandbox_directory="/mnt/mesos/sandbox"
--strict="true" --switch_user="true" --systemd_enable_support="true" --systemd_runtime_directory="/run/systemd/system"
--version="false" --work_dir="/tmp/Endpoint_SlaveEndpointTest_UnauthorizedRequest_1_3uNiMW"
I0914 01:52:48.484549 29181 credentials.hpp:86] Loading credential for authentication from
'/tmp/Endpoint_SlaveEndpointTest_UnauthorizedRequest_1_dv9A2q/credential'
I0914 01:52:48.484678 29181 slave.cpp:264] Agent using credential for: test-principal
I0914 01:52:48.484694 29181 credentials.hpp:37] Loading credentials for authentication from
'/tmp/Endpoint_SlaveEndpointTest_UnauthorizedRequest_1_dv9A2q/http_credentials'
I0914 01:52:48.484851 29181 http.cpp:975] Creating default 'basic' HTTP authenticator for
realm 'mesos-agent-executor'
I0914 01:52:48.484907 29181 http.cpp:996] Creating default 'jwt' HTTP authenticator for realm
'mesos-agent-executor'
I0914 01:52:48.484972 29181 http.cpp:975] Creating default 'basic' HTTP authenticator for
realm 'mesos-agent-readonly'
I0914 01:52:48.485002 29181 http.cpp:996] Creating default 'jwt' HTTP authenticator for realm
'mesos-agent-readonly'
I0914 01:52:48.485049 29181 http.cpp:975] Creating default 'basic' HTTP authenticator for
realm 'mesos-agent-readwrite'
I0914 01:52:48.485080 29181 http.cpp:996] Creating default 'jwt' HTTP authenticator for realm
'mesos-agent-readwrite'
I0914 01:52:48.485697 29181 slave.cpp:531] Agent resources: cpus(*):2; mem(*):1024; disk(*):1024;
ports(*):[31000-32000]
I0914 01:52:48.485749 29181 slave.cpp:539] Agent attributes: [  ]
I0914 01:52:48.485764 29181 slave.cpp:544] Agent hostname: 686c704f8e65
I0914 01:52:48.485880 29184 status_update_manager.cpp:177] Pausing sending status updates
I0914 01:52:48.486300 29183 state.cpp:62] Recovering state from '/tmp/Endpoint_SlaveEndpointTest_UnauthorizedRequest_1_3uNiMW/meta'
I0914 01:52:48.486462 29181 status_update_manager.cpp:203] Recovering status update manager
I0914 01:52:48.486552 29181 containerizer.cpp:608] Recovering containerizer
I0914 01:52:48.487422 29185 provisioner.cpp:410] Provisioner recovery complete
I0914 01:52:48.487649 29185 slave.cpp:6107] Finished recovery
I0914 01:52:48.488109 29185 slave.cpp:6289] Querying resource estimator for oversubscribable
resources
I0914 01:52:48.488337 29185 slave.cpp:6303] Received oversubscribable resources {} from the
resource estimator
I0914 01:52:48.489621 29186 process.cpp:3741] Handling HTTP event for process 'slave(745)'
with path: '/slave(745)/monitor/statistics.json'
I0914 01:52:48.490327 29180 http.cpp:1115] HTTP GET for /slave(745)/monitor/statistics.json
from 172.17.0.2:35880
I0914 01:52:48.490391 29180 http.cpp:936] Authorizing principal 'test-principal' to GET the
'/monitor/statistics.json' endpoint
I0914 01:52:48.491883 25282 slave.cpp:796] Agent terminating
[       OK ] Endpoint/SlaveEndpointTest.UnauthorizedRequest/1 (16 ms)
[ RUN      ] Endpoint/SlaveEndpointTest.UnauthorizedRequest/2
I0914 01:52:48.498800 25282 containerizer.cpp:221] Using isolation: posix/cpu,posix/mem,filesystem/posix,network/cni
W0914 01:52:48.499198 25282 backend.cpp:76] Failed to create 'overlay' backend: OverlayBackend
requires root privileges
W0914 01:52:48.499258 25282 backend.cpp:76] Failed to create 'bind' backend: BindBackend requires
root privileges
I0914 01:52:48.499279 25282 provisioner.cpp:249] Using default backend 'copy'
I0914 01:52:48.500813 29179 slave.cpp:231] Mesos agent started on (746)@172.17.0.2:42407
I0914 01:52:48.500896 29179 slave.cpp:232] Flags at startup: --acls="" --appc_simple_discovery_uri_prefix="http://"
--appc_store_dir="/tmp/mesos/store/appc" --authenticate_http_executors="true" --authenticate_http_readonly="true"
--authenticate_http_readwrite="true" --authenticatee="crammd5" --authentication_backoff_factor="1secs"
--authorizer="local" --cgroups_cpu_enable_pids_and_tids_count="false" --cgroups_enable_cfs="false"
--cgroups_hierarchy="/sys/fs/cgroup" --cgroups_limit_swap="false" --cgroups_root="mesos" --container_disk_watch_interval="15secs"
--containerizers="mesos" --credential="/tmp/Endpoint_SlaveEndpointTest_UnauthorizedRequest_2_R3uHeo/credential"
--default_role="*" --disk_watch_interval="1mins" --docker="docker" --docker_kill_orphans="true"
--docker_registry="https://registry-1.docker.io" --docker_remove_delay="6hrs" --docker_socket="/var/run/docker.sock"
--docker_stop_timeout="0ns" --docker_store_dir="/tmp/mesos/store/docker" --docker_volume_checkpoint_dir="/var/run/mesos/isolators/docker/volume"
--enforce_container_disk_quota="false" --executor_registration_timeout="1mins" --executor_reregistration_timeout="2secs"
--executor_secret_key="/tmp/Endpoint_SlaveEndpointTest_UnauthorizedRequest_2_R3uHeo/executor_secret_key"
--executor_shutdown_grace_period="5secs" --fetcher_cache_dir="/tmp/Endpoint_SlaveEndpointTest_UnauthorizedRequest_2_R3uHeo/fetch"
--fetcher_cache_size="2GB" --frameworks_home="" --gc_delay="1weeks" --gc_disk_headroom="0.1"
--hadoop_home="" --help="false" --hostname_lookup="true" --http_command_executor="false" --http_credentials="/tmp/Endpoint_SlaveEndpointTest_UnauthorizedRequest_2_R3uHeo/http_credentials"
--http_heartbeat_interval="30secs" --initialize_driver_logging="true" --isolation="posix/cpu,posix/mem"
--launcher="posix" --launcher_dir="/mesos/build/src" --logbufsecs="0" --logging_level="INFO"
--max_completed_executors_per_framework="150" --oversubscribed_resources_interval="15secs"
--perf_duration="10secs" --perf_interval="1mins" --port="5051" --qos_correction_interval_min="0ns"
--quiet="false" --recover="reconnect" --recovery_timeout="15mins" --registration_backoff_factor="10ms"
--resources="cpus:2;gpus:0;mem:1024;disk:1024;ports:[31000-32000]" --revocable_cpu_low_priority="true"
--runtime_dir="/tmp/Endpoint_SlaveEndpointTest_UnauthorizedRequest_2_R3uHeo" --sandbox_directory="/mnt/mesos/sandbox"
--strict="true" --switch_user="true" --systemd_enable_support="true" --systemd_runtime_directory="/run/systemd/system"
--version="false" --work_dir="/tmp/Endpoint_SlaveEndpointTest_UnauthorizedRequest_2_PZ4KVT"
I0914 01:52:48.501714 29179 credentials.hpp:86] Loading credential for authentication from
'/tmp/Endpoint_SlaveEndpointTest_UnauthorizedRequest_2_R3uHeo/credential'
I0914 01:52:48.502059 29179 slave.cpp:264] Agent using credential for: test-principal
I0914 01:52:48.502194 29179 credentials.hpp:37] Loading credentials for authentication from
'/tmp/Endpoint_SlaveEndpointTest_UnauthorizedRequest_2_R3uHeo/http_credentials'
I0914 01:52:48.502588 29179 http.cpp:975] Creating default 'basic' HTTP authenticator for
realm 'mesos-agent-executor'
I0914 01:52:48.502698 29179 http.cpp:996] Creating default 'jwt' HTTP authenticator for realm
'mesos-agent-executor'
I0914 01:52:48.502883 29179 http.cpp:975] Creating default 'basic' HTTP authenticator for
realm 'mesos-agent-readonly'
I0914 01:52:48.502955 29179 http.cpp:996] Creating default 'jwt' HTTP authenticator for realm
'mesos-agent-readonly'
I0914 01:52:48.503095 29179 http.cpp:975] Creating default 'basic' HTTP authenticator for
realm 'mesos-agent-readwrite'
I0914 01:52:48.503165 29179 http.cpp:996] Creating default 'jwt' HTTP authenticator for realm
'mesos-agent-readwrite'
I0914 01:52:48.503950 29179 slave.cpp:531] Agent resources: cpus(*):2; mem(*):1024; disk(*):1024;
ports(*):[31000-32000]
I0914 01:52:48.504129 29179 slave.cpp:539] Agent attributes: [  ]
I0914 01:52:48.504169 29179 slave.cpp:544] Agent hostname: 686c704f8e65
I0914 01:52:48.504462 29182 status_update_manager.cpp:177] Pausing sending status updates
I0914 01:52:48.505082 29184 state.cpp:62] Recovering state from '/tmp/Endpoint_SlaveEndpointTest_UnauthorizedRequest_2_PZ4KVT/meta'
I0914 01:52:48.505244 29179 status_update_manager.cpp:203] Recovering status update manager
I0914 01:52:48.505364 29179 containerizer.cpp:608] Recovering containerizer
I0914 01:52:48.506376 29180 provisioner.cpp:410] Provisioner recovery complete
I0914 01:52:48.506584 29180 slave.cpp:6107] Finished recovery
I0914 01:52:48.507108 29180 slave.cpp:6289] Querying resource estimator for oversubscribable
resources
I0914 01:52:48.507274 29179 slave.cpp:6303] Received oversubscribable resources {} from the
resource estimator
I0914 01:52:48.508455 29186 process.cpp:3741] Handling HTTP event for process 'slave(746)'
with path: '/slave(746)/containers'
I0914 01:52:48.509172 29179 http.cpp:1115] HTTP GET for /slave(746)/containers from 172.17.0.2:35882
I0914 01:52:48.509305 29179 http.cpp:936] Authorizing principal 'test-principal' to GET the
'/containers' endpoint
I0914 01:52:48.511116 25282 slave.cpp:796] Agent terminating
[       OK ] Endpoint/SlaveEndpointTest.UnauthorizedRequest/2 (19 ms)
[ RUN      ] Endpoint/SlaveEndpointTest.NoAuthorizer/0
I0914 01:52:48.518388 25282 containerizer.cpp:221] Using isolation: posix/cpu,posix/mem,filesystem/posix,network/cni
W0914 01:52:48.518796 25282 backend.cpp:76] Failed to create 'overlay' backend: OverlayBackend
requires root privileges
W0914 01:52:48.518857 25282 backend.cpp:76] Failed to create 'bind' backend: BindBackend requires
root privileges
I0914 01:52:48.518878 25282 provisioner.cpp:249] Using default backend 'copy'
I0914 01:52:48.519847 25282 cluster.cpp:448] Creating default 'local' authorizer
I0914 01:52:48.520568 29180 slave.cpp:231] Mesos agent started on (747)@172.17.0.2:42407
I0914 01:52:48.520620 29180 slave.cpp:232] Flags at startup: --acls="" --appc_simple_discovery_uri_prefix="http://"
--appc_store_dir="/tmp/mesos/store/appc" --authenticate_http_executors="true" --authenticate_http_readonly="true"
--authenticate_http_readwrite="true" --authenticatee="crammd5" --authentication_backoff_factor="1secs"
--authorizer="local" --cgroups_cpu_enable_pids_and_tids_count="false" --cgroups_enable_cfs="false"
--cgroups_hierarchy="/sys/fs/cgroup" --cgroups_limit_swap="false" --cgroups_root="mesos" --container_disk_watch_interval="15secs"
--containerizers="mesos" --credential="/tmp/Endpoint_SlaveEndpointTest_NoAuthorizer_0_LaSjDl/credential"
--default_role="*" --disk_watch_interval="1mins" --docker="docker" --docker_kill_orphans="true"
--docker_registry="https://registry-1.docker.io" --docker_remove_delay="6hrs" --docker_socket="/var/run/docker.sock"
--docker_stop_timeout="0ns" --docker_store_dir="/tmp/mesos/store/docker" --docker_volume_checkpoint_dir="/var/run/mesos/isolators/docker/volume"
--enforce_container_disk_quota="false" --executor_registration_timeout="1mins" --executor_reregistration_timeout="2secs"
--executor_secret_key="/tmp/Endpoint_SlaveEndpointTest_NoAuthorizer_0_LaSjDl/executor_secret_key"
--executor_shutdown_grace_period="5secs" --fetcher_cache_dir="/tmp/Endpoint_SlaveEndpointTest_NoAuthorizer_0_LaSjDl/fetch"
--fetcher_cache_size="2GB" --frameworks_home="" --gc_delay="1weeks" --gc_disk_headroom="0.1"
--hadoop_home="" --help="false" --hostname_lookup="true" --http_command_executor="false" --http_credentials="/tmp/Endpoint_SlaveEndpointTest_NoAuthorizer_0_LaSjDl/http_credentials"
--http_heartbeat_interval="30secs" --initialize_driver_logging="true" --isolation="posix/cpu,posix/mem"
--launcher="posix" --launcher_dir="/mesos/build/src" --logbufsecs="0" --logging_level="INFO"
--max_completed_executors_per_framework="150" --oversubscribed_resources_interval="15secs"
--perf_duration="10secs" --perf_interval="1mins" --port="5051" --qos_correction_interval_min="0ns"
--quiet="false" --recover="reconnect" --recovery_timeout="15mins" --registration_backoff_factor="10ms"
--resources="cpus:2;gpus:0;mem:1024;disk:1024;ports:[31000-32000]" --revocable_cpu_low_priority="true"
--runtime_dir="/tmp/Endpoint_SlaveEndpointTest_NoAuthorizer_0_LaSjDl" --sandbox_directory="/mnt/mesos/sandbox"
--strict="true" --switch_user="true" --systemd_enable_support="true" --systemd_runtime_directory="/run/systemd/system"
--version="false" --work_dir="/tmp/Endpoint_SlaveEndpointTest_NoAuthorizer_0_zPhehR"
I0914 01:52:48.520983 29180 credentials.hpp:86] Loading credential for authentication from
'/tmp/Endpoint_SlaveEndpointTest_NoAuthorizer_0_LaSjDl/credential'
I0914 01:52:48.521126 29180 slave.cpp:264] Agent using credential for: test-principal
I0914 01:52:48.521142 29180 credentials.hpp:37] Loading credentials for authentication from
'/tmp/Endpoint_SlaveEndpointTest_NoAuthorizer_0_LaSjDl/http_credentials'
I0914 01:52:48.521317 29180 http.cpp:975] Creating default 'basic' HTTP authenticator for
realm 'mesos-agent-executor'
I0914 01:52:48.521386 29180 http.cpp:996] Creating default 'jwt' HTTP authenticator for realm
'mesos-agent-executor'
I0914 01:52:48.521473 29180 http.cpp:975] Creating default 'basic' HTTP authenticator for
realm 'mesos-agent-readonly'
I0914 01:52:48.521512 29180 http.cpp:996] Creating default 'jwt' HTTP authenticator for realm
'mesos-agent-readonly'
I0914 01:52:48.521584 29180 http.cpp:975] Creating default 'basic' HTTP authenticator for
realm 'mesos-agent-readwrite'
I0914 01:52:48.521622 29180 http.cpp:996] Creating default 'jwt' HTTP authenticator for realm
'mesos-agent-readwrite'
I0914 01:52:48.522459 29180 slave.cpp:531] Agent resources: cpus(*):2; mem(*):1024; disk(*):1024;
ports(*):[31000-32000]
I0914 01:52:48.522522 29180 slave.cpp:539] Agent attributes: [  ]
I0914 01:52:48.522533 29180 slave.cpp:544] Agent hostname: 686c704f8e65
I0914 01:52:48.522706 29181 status_update_manager.cpp:177] Pausing sending status updates
I0914 01:52:48.523113 29180 state.cpp:62] Recovering state from '/tmp/Endpoint_SlaveEndpointTest_NoAuthorizer_0_zPhehR/meta'
I0914 01:52:48.523262 29181 status_update_manager.cpp:203] Recovering status update manager
I0914 01:52:48.523383 29180 containerizer.cpp:608] Recovering containerizer
I0914 01:52:48.524183 29182 provisioner.cpp:410] Provisioner recovery complete
I0914 01:52:48.524430 29186 slave.cpp:6107] Finished recovery
I0914 01:52:48.525064 29186 slave.cpp:6289] Querying resource estimator for oversubscribable
resources
I0914 01:52:48.525187 29186 slave.cpp:6303] Received oversubscribable resources {} from the
resource estimator
I0914 01:52:48.526240 29182 process.cpp:3741] Handling HTTP event for process 'slave(747)'
with path: '/slave(747)/monitor/statistics'
I0914 01:52:48.527019 29183 http.cpp:1115] HTTP GET for /slave(747)/monitor/statistics from
172.17.0.2:35884
I0914 01:52:48.527083 29183 http.cpp:936] Authorizing principal 'test-principal' to GET the
'/monitor/statistics' endpoint
I0914 01:52:48.529163 25282 slave.cpp:796] Agent terminating
[       OK ] Endpoint/SlaveEndpointTest.NoAuthorizer/0 (17 ms)
[ RUN      ] Endpoint/SlaveEndpointTest.NoAuthorizer/1
I0914 01:52:48.535892 25282 containerizer.cpp:221] Using isolation: posix/cpu,posix/mem,filesystem/posix,network/cni
W0914 01:52:48.536321 25282 backend.cpp:76] Failed to create 'overlay' backend: OverlayBackend
requires root privileges
W0914 01:52:48.536399 25282 backend.cpp:76] Failed to create 'bind' backend: BindBackend requires
root privileges
I0914 01:52:48.536420 25282 provisioner.cpp:249] Using default backend 'copy'
I0914 01:52:48.537292 25282 cluster.cpp:448] Creating default 'local' authorizer
I0914 01:52:48.538131 29179 slave.cpp:231] Mesos agent started on (748)@172.17.0.2:42407
I0914 01:52:48.538420 29179 slave.cpp:232] Flags at startup: --acls="" --appc_simple_discovery_uri_prefix="http://"
--appc_store_dir="/tmp/mesos/store/appc" --authenticate_http_executors="true" --authenticate_http_readonly="true"
--authenticate_http_readwrite="true" --authenticatee="crammd5" --authentication_backoff_factor="1secs"
--authorizer="local" --cgroups_cpu_enable_pids_and_tids_count="false" --cgroups_enable_cfs="false"
--cgroups_hierarchy="/sys/fs/cgroup" --cgroups_limit_swap="false" --cgroups_root="mesos" --container_disk_watch_interval="15secs"
--containerizers="mesos" --credential="/tmp/Endpoint_SlaveEndpointTest_NoAuthorizer_1_3FHrdj/credential"
--default_role="*" --disk_watch_interval="1mins" --docker="docker" --docker_kill_orphans="true"
--docker_registry="https://registry-1.docker.io" --docker_remove_delay="6hrs" --docker_socket="/var/run/docker.sock"
--docker_stop_timeout="0ns" --docker_store_dir="/tmp/mesos/store/docker" --docker_volume_checkpoint_dir="/var/run/mesos/isolators/docker/volume"
--enforce_container_disk_quota="false" --executor_registration_timeout="1mins" --executor_reregistration_timeout="2secs"
--executor_secret_key="/tmp/Endpoint_SlaveEndpointTest_NoAuthorizer_1_3FHrdj/executor_secret_key"
--executor_shutdown_grace_period="5secs" --fetcher_cache_dir="/tmp/Endpoint_SlaveEndpointTest_NoAuthorizer_1_3FHrdj/fetch"
--fetcher_cache_size="2GB" --frameworks_home="" --gc_delay="1weeks" --gc_disk_headroom="0.1"
--hadoop_home="" --help="false" --hostname_lookup="true" --http_command_executor="false" --http_credentials="/tmp/Endpoint_SlaveEndpointTest_NoAuthorizer_1_3FHrdj/http_credentials"
--http_heartbeat_interval="30secs" --initialize_driver_logging="true" --isolation="posix/cpu,posix/mem"
--launcher="posix" --launcher_dir="/mesos/build/src" --logbufsecs="0" --logging_level="INFO"
--max_completed_executors_per_framework="150" --oversubscribed_resources_interval="15secs"
--perf_duration="10secs" --perf_interval="1mins" --port="5051" --qos_correction_interval_min="0ns"
--quiet="false" --recover="reconnect" --recovery_timeout="15mins" --registration_backoff_factor="10ms"
--resources="cpus:2;gpus:0;mem:1024;disk:1024;ports:[31000-32000]" --revocable_cpu_low_priority="true"
--runtime_dir="/tmp/Endpoint_SlaveEndpointTest_NoAuthorizer_1_3FHrdj" --sandbox_directory="/mnt/mesos/sandbox"
--strict="true" --switch_user="true" --systemd_enable_support="true" --systemd_runtime_directory="/run/systemd/system"
--version="false" --work_dir="/tmp/Endpoint_SlaveEndpointTest_NoAuthorizer_1_7MruOO"
I0914 01:52:48.538812 29179 credentials.hpp:86] Loading credential for authentication from
'/tmp/Endpoint_SlaveEndpointTest_NoAuthorizer_1_3FHrdj/credential'
I0914 01:52:48.539057 29179 slave.cpp:264] Agent using credential for: test-principal
I0914 01:52:48.539324 29179 credentials.hpp:37] Loading credentials for authentication from
'/tmp/Endpoint_SlaveEndpointTest_NoAuthorizer_1_3FHrdj/http_credentials'
I0914 01:52:48.539801 29179 http.cpp:975] Creating default 'basic' HTTP authenticator for
realm 'mesos-agent-executor'
I0914 01:52:48.539908 29179 http.cpp:996] Creating default 'jwt' HTTP authenticator for realm
'mesos-agent-executor'
I0914 01:52:48.540122 29179 http.cpp:975] Creating default 'basic' HTTP authenticator for
realm 'mesos-agent-readonly'
I0914 01:52:48.540192 29179 http.cpp:996] Creating default 'jwt' HTTP authenticator for realm
'mesos-agent-readonly'
I0914 01:52:48.540276 29179 http.cpp:975] Creating default 'basic' HTTP authenticator for
realm 'mesos-agent-readwrite'
I0914 01:52:48.540504 29179 http.cpp:996] Creating default 'jwt' HTTP authenticator for realm
'mesos-agent-readwrite'
I0914 01:52:48.541499 29179 slave.cpp:531] Agent resources: cpus(*):2; mem(*):1024; disk(*):1024;
ports(*):[31000-32000]
I0914 01:52:48.541600 29179 slave.cpp:539] Agent attributes: [  ]
I0914 01:52:48.541923 29179 slave.cpp:544] Agent hostname: 686c704f8e65
I0914 01:52:48.542204 29182 status_update_manager.cpp:177] Pausing sending status updates
I0914 01:52:48.542984 29180 state.cpp:62] Recovering state from '/tmp/Endpoint_SlaveEndpointTest_NoAuthorizer_1_7MruOO/meta'
I0914 01:52:48.543189 29181 status_update_manager.cpp:203] Recovering status update manager
I0914 01:52:48.543309 29181 containerizer.cpp:608] Recovering containerizer
I0914 01:52:48.544030 29184 provisioner.cpp:410] Provisioner recovery complete
I0914 01:52:48.544230 29183 slave.cpp:6107] Finished recovery
I0914 01:52:48.544716 29183 slave.cpp:6289] Querying resource estimator for oversubscribable
resources
I0914 01:52:48.544853 29185 slave.cpp:6303] Received oversubscribable resources {} from the
resource estimator
I0914 01:52:48.545902 29185 process.cpp:3741] Handling HTTP event for process 'slave(748)'
with path: '/slave(748)/monitor/statistics.json'
I0914 01:52:48.546829 29184 http.cpp:1115] HTTP GET for /slave(748)/monitor/statistics.json
from 172.17.0.2:35886
I0914 01:52:48.546890 29184 http.cpp:936] Authorizing principal 'test-principal' to GET the
'/monitor/statistics.json' endpoint
I0914 01:52:48.548640 29181 slave.cpp:796] Agent terminating
[       OK ] Endpoint/SlaveEndpointTest.NoAuthorizer/1 (20 ms)
[ RUN      ] Endpoint/SlaveEndpointTest.NoAuthorizer/2
I0914 01:52:48.556438 25282 containerizer.cpp:221] Using isolation: posix/cpu,posix/mem,filesystem/posix,network/cni
W0914 01:52:48.556831 25282 backend.cpp:76] Failed to create 'overlay' backend: OverlayBackend
requires root privileges
W0914 01:52:48.556887 25282 backend.cpp:76] Failed to create 'bind' backend: BindBackend requires
root privileges
I0914 01:52:48.556908 25282 provisioner.cpp:249] Using default backend 'copy'
I0914 01:52:48.557847 25282 cluster.cpp:448] Creating default 'local' authorizer
I0914 01:52:48.558559 29181 slave.cpp:231] Mesos agent started on (749)@172.17.0.2:42407
I0914 01:52:48.558599 29181 slave.cpp:232] Flags at startup: --acls="" --appc_simple_discovery_uri_prefix="http://"
--appc_store_dir="/tmp/mesos/store/appc" --authenticate_http_executors="true" --authenticate_http_readonly="true"
--authenticate_http_readwrite="true" --authenticatee="crammd5" --authentication_backoff_factor="1secs"
--authorizer="local" --cgroups_cpu_enable_pids_and_tids_count="false" --cgroups_enable_cfs="false"
--cgroups_hierarchy="/sys/fs/cgroup" --cgroups_limit_swap="false" --cgroups_root="mesos" --container_disk_watch_interval="15secs"
--containerizers="mesos" --credential="/tmp/Endpoint_SlaveEndpointTest_NoAuthorizer_2_dJYD0g/credential"
--default_role="*" --disk_watch_interval="1mins" --docker="docker" --docker_kill_orphans="true"
--docker_registry="https://registry-1.docker.io" --docker_remove_delay="6hrs" --docker_socket="/var/run/docker.sock"
--docker_stop_timeout="0ns" --docker_store_dir="/tmp/mesos/store/docker" --docker_volume_checkpoint_dir="/var/run/mesos/isolators/docker/volume"
--enforce_container_disk_quota="false" --executor_registration_timeout="1mins" --executor_reregistration_timeout="2secs"
--executor_secret_key="/tmp/Endpoint_SlaveEndpointTest_NoAuthorizer_2_dJYD0g/executor_secret_key"
--executor_shutdown_grace_period="5secs" --fetcher_cache_dir="/tmp/Endpoint_SlaveEndpointTest_NoAuthorizer_2_dJYD0g/fetch"
--fetcher_cache_size="2GB" --frameworks_home="" --gc_delay="1weeks" --gc_disk_headroom="0.1"
--hadoop_home="" --help="false" --hostname_lookup="true" --http_command_executor="false" --http_credentials="/tmp/Endpoint_SlaveEndpointTest_NoAuthorizer_2_dJYD0g/http_credentials"
--http_heartbeat_interval="30secs" --initialize_driver_logging="true" --isolation="posix/cpu,posix/mem"
--launcher="posix" --launcher_dir="/mesos/build/src" --logbufsecs="0" --logging_level="INFO"
--max_completed_executors_per_framework="150" --oversubscribed_resources_interval="15secs"
--perf_duration="10secs" --perf_interval="1mins" --port="5051" --qos_correction_interval_min="0ns"
--quiet="false" --recover="reconnect" --recovery_timeout="15mins" --registration_backoff_factor="10ms"
--resources="cpus:2;gpus:0;mem:1024;disk:1024;ports:[31000-32000]" --revocable_cpu_low_priority="true"
--runtime_dir="/tmp/Endpoint_SlaveEndpointTest_NoAuthorizer_2_dJYD0g" --sandbox_directory="/mnt/mesos/sandbox"
--strict="true" --switch_user="true" --systemd_enable_support="true" --systemd_runtime_directory="/run/systemd/system"
--version="false" --work_dir="/tmp/Endpoint_SlaveEndpointTest_NoAuthorizer_2_tEpoyM"
I0914 01:52:48.558938 29181 credentials.hpp:86] Loading credential for authentication from
'/tmp/Endpoint_SlaveEndpointTest_NoAuthorizer_2_dJYD0g/credential'
I0914 01:52:48.559080 29181 slave.cpp:264] Agent using credential for: test-principal
I0914 01:52:48.559096 29181 credentials.hpp:37] Loading credentials for authentication from
'/tmp/Endpoint_SlaveEndpointTest_NoAuthorizer_2_dJYD0g/http_credentials'
I0914 01:52:48.559264 29181 http.cpp:975] Creating default 'basic' HTTP authenticator for
realm 'mesos-agent-executor'
I0914 01:52:48.559317 29181 http.cpp:996] Creating default 'jwt' HTTP authenticator for realm
'mesos-agent-executor'
I0914 01:52:48.559381 29181 http.cpp:975] Creating default 'basic' HTTP authenticator for
realm 'mesos-agent-readonly'
I0914 01:52:48.559412 29181 http.cpp:996] Creating default 'jwt' HTTP authenticator for realm
'mesos-agent-readonly'
I0914 01:52:48.559631 29181 http.cpp:975] Creating default 'basic' HTTP authenticator for
realm 'mesos-agent-readwrite'
I0914 01:52:48.559669 29181 http.cpp:996] Creating default 'jwt' HTTP authenticator for realm
'mesos-agent-readwrite'
I0914 01:52:48.560328 29181 slave.cpp:531] Agent resources: cpus(*):2; mem(*):1024; disk(*):1024;
ports(*):[31000-32000]
I0914 01:52:48.560384 29181 slave.cpp:539] Agent attributes: [  ]
I0914 01:52:48.560395 29181 slave.cpp:544] Agent hostname: 686c704f8e65
I0914 01:52:48.560495 29180 status_update_manager.cpp:177] Pausing sending status updates
I0914 01:52:48.560956 29185 state.cpp:62] Recovering state from '/tmp/Endpoint_SlaveEndpointTest_NoAuthorizer_2_tEpoyM/meta'
I0914 01:52:48.561134 29184 status_update_manager.cpp:203] Recovering status update manager
I0914 01:52:48.561225 29180 containerizer.cpp:608] Recovering containerizer
I0914 01:52:48.562072 29186 provisioner.cpp:410] Provisioner recovery complete
I0914 01:52:48.562304 29181 slave.cpp:6107] Finished recovery
I0914 01:52:48.562736 29181 slave.cpp:6289] Querying resource estimator for oversubscribable
resources
I0914 01:52:48.562863 29182 slave.cpp:6303] Received oversubscribable resources {} from the
resource estimator
I0914 01:52:48.563985 29183 process.cpp:3741] Handling HTTP event for process 'slave(749)'
with path: '/slave(749)/containers'
I0914 01:52:48.564729 29185 http.cpp:1115] HTTP GET for /slave(749)/containers from 172.17.0.2:35888
I0914 01:52:48.564812 29185 http.cpp:936] Authorizing principal 'test-principal' to GET the
'/containers' endpoint
I0914 01:52:48.567106 25282 slave.cpp:796] Agent terminating
[       OK ] Endpoint/SlaveEndpointTest.NoAuthorizer/2 (17 ms)
[----------] 9 tests from Endpoint/SlaveEndpointTest (164 ms total)

[----------] Global test environment tear-down
[==========] 1528 tests from 169 test cases ran. (309373 ms total)
[  PASSED  ] 1527 tests.
[  FAILED  ] 1 test, listed below:
[  FAILED  ] RegisterSlaveValidationTest.DropInvalidRegistration

 1 FAILED TEST
  YOU HAVE 22 DISABLED TESTS

E0914 01:52:48.692510 29187 process.cpp:956] Failed to accept socket: future discarded
make[3]: *** [CMakeFiles/check] Error 1
make[3]: Leaving directory `/mesos/build'
make[2]: Leaving directory `/mesos/build'
make[2]: *** [CMakeFiles/check.dir/all] Error 2
make[1]: *** [CMakeFiles/check.dir/rule] Error 2
make[1]: Leaving directory `/mesos/build'
make: *** [check] Error 2
+ docker rmi mesos-1505349619-1057
Untagged: mesos-1505349619-1057:latest
Deleted: sha256:c2bae48e9ed9f791e0c826a457a84c1940bbaefa8d99088dc061cdc545cc501a
Deleted: sha256:a3a33d22631ee117b82c77d30da9ae22ee988b7873bc5faadd6fe9a0e1b21605
Deleted: sha256:ae56d75508d0bdbbca7fdb84442313cebe9747f3855a8f1a8562d5e26af840bd
Deleted: sha256:991eb04b79262896532bed200e6c452abddbe035a16603f3556f8c37bfd7c820
Deleted: sha256:61c5b3abf98ad5b2a7245abba997fbfd51c903caea59d6320dc8bde111efdba2
Deleted: sha256:eabf28dbbed8d490315debe285711ea0d853062098d71e68618945ba9a9cec56
Deleted: sha256:7d112656245af8599f48b6e57cd0498a1f891e36a1f55b2c710e784559e6a37a
Deleted: sha256:ce96f830adf2c82e22fc4bc6cc4124e93d03fe6f492034224e410df1a17c3758
Deleted: sha256:a3f30d5620000054075c2031b003b8b84a5b51f1ddb1d4b5b1faa3d03325ab91
Deleted: sha256:924b7e9b7de906e7d33b99eba8f66ef645f10fe98e7c40116ac7b8633f3fc020
Deleted: sha256:425137b785ca821ceb802f1b6cf51f2df8462a3f3edaf03f495f62de02f4f2c8
Deleted: sha256:bed85cd078a847da8009d2be3feb0d3e1f11862044d8acdad336c9a0e50758f7
Deleted: sha256:ac52e95090ecbe8c9f3b61716d84d628001ba2d57de29d7a586aa44f03de9f03
Deleted: sha256:fd821d45f2870c6d8c84ae5dbf925c98bf8859a790b194a8bfe4536110570d2a
Deleted: sha256:1ceb954e6bf9cca26b753724b368002cacb66791803480b3225755cce5dbfc08
Deleted: sha256:81faf4dd8cd3fc903296d2cea418bf74ccd250edd389c7ffa58ebd3ff60f3522
Deleted: sha256:0986660286c0275497b009c0c363559c054b0528db98ede9aeb1329f43e624bd
Deleted: sha256:d46c23fd2068bfafb474c4ece6f7f8e0076c3234fa4801fba89e380a032a9d4f
Deleted: sha256:8b02fc7d2348c282c2db8f41b1e738c06fb754f64edf22242f6b00eae1ee07d1
Deleted: sha256:8ea9f6913bdfe0d6d16e1431b81bde863bb842a87f26d69dbd8ac09d0c204a34
Deleted: sha256:8065df41a4858e01e8cdd3ccc9dd993be479cf2ee5511a4e793004a2cd51673c
Deleted: sha256:6f09d618349c30e1c836153af6b24650655604ce7ae1dc2702f787cdecd65ad1
Deleted: sha256:73598cb3ebde6d2805b876676a25783d66694ec813e4070d5c23b57ae153ba4b
Deleted: sha256:17b713cdb1076fe186ee723ad0977847ffec418516d28ef85bb32826e25d7b84
Build step 'Execute shell' marked build as failure

Mime
View raw message