mesos-builds mailing list archives

Site index · List index
Message view « Date » · « Thread »
Top « Date » · « Thread »
From Apache Jenkins Server <jenk...@builds.apache.org>
Subject Build failed in Jenkins: Mesos-Buildbot » autotools,clang,--verbose --enable-libevent --enable-ssl,GLOG_v=1 MESOS_VERBOSE=1,ubuntu:14.04,(ubuntu)&&(!ubuntu-us1)&&(!ubuntu-eu2) #4191
Date Sun, 03 Sep 2017 00:47:55 GMT
See <https://builds.apache.org/job/Mesos-Buildbot/BUILDTOOL=autotools,COMPILER=clang,CONFIGURATION=--verbose%20--enable-libevent%20--enable-ssl,ENVIRONMENT=GLOG_v=1%20MESOS_VERBOSE=1,OS=ubuntu%3A14.04,label_exp=(ubuntu)&&(!ubuntu-us1)&&(!ubuntu-eu2)/4191/display/redirect>

------------------------------------------
[...truncated 22.85 MB...]
I0903 00:47:47.622179  5903 slave.cpp:565] Agent resources: [{"name":"cpus","scalar":{"value":2.0},"type":"SCALAR"},{"name":"mem","scalar":{"value":1024.0},"type":"SCALAR"},{"name":"disk","scalar":{"value":1024.0},"type":"SCALAR"},{"name":"ports","ranges":{"range":[{"begin":31000,"end":32000}]},"type":"RANGES"}]
I0903 00:47:47.622467  5903 slave.cpp:573] Agent attributes: [  ]
I0903 00:47:47.622495  5903 slave.cpp:582] Agent hostname: 45a683e5be10
I0903 00:47:47.622659  5906 status_update_manager.cpp:177] Pausing sending status updates
I0903 00:47:47.624413  5901 state.cpp:64] Recovering state from '/tmp/SlaveTest_ContainersEndpointNoExecutor_4YyMPM/meta'
I0903 00:47:47.624475  5903 process.cpp:3933] Handling HTTP event for process 'slave(531)'
with path: '/slave(531)/containers'
I0903 00:47:47.625108  5910 status_update_manager.cpp:203] Recovering status update manager
I0903 00:47:47.625553  5914 containerizer.cpp:609] Recovering containerizer
I0903 00:47:47.626713  5907 http.cpp:1166] HTTP GET for /slave(531)/containers from 172.17.0.5:60430
I0903 00:47:47.626816  5907 http.cpp:957] Authorizing principal 'test-principal' to GET the
'/containers' endpoint
I0903 00:47:47.627264  5911 provisioner.cpp:416] Provisioner recovery complete
I0903 00:47:47.628566  5912 slave.cpp:6295] Finished recovery
I0903 00:47:47.629137  5912 slave.cpp:6477] Querying resource estimator for oversubscribable
resources
I0903 00:47:47.629426  5908 status_update_manager.cpp:177] Pausing sending status updates
I0903 00:47:47.629457  5911 slave.cpp:971] New master detected at master@172.17.0.5:60478
I0903 00:47:47.629727  5911 slave.cpp:1006] Detecting new master
I0903 00:47:47.629892  5911 slave.cpp:6491] Received oversubscribable resources {} from the
resource estimator
I0903 00:47:47.631067  5903 slave.cpp:843] Agent terminating
I0903 00:47:47.637127  5882 master.cpp:1160] Master terminating
[       OK ] SlaveTest.ContainersEndpointNoExecutor (46 ms)
[ RUN      ] SlaveTest.ContainersEndpoint
I0903 00:47:47.645169  5882 cluster.cpp:162] Creating default 'local' authorizer
I0903 00:47:47.647524  5914 master.cpp:442] Master 1c0e6dc9-2fff-4a24-9528-7811b50187de (45a683e5be10)
started on 172.17.0.5:60478
I0903 00:47:47.647567  5914 master.cpp:444] Flags at startup: --acls="" --agent_ping_timeout="15secs"
--agent_reregister_timeout="10mins" --allocation_interval="1secs" --allocator="HierarchicalDRF"
--authenticate_agents="true" --authenticate_frameworks="true" --authenticate_http_frameworks="true"
--authenticate_http_readonly="true" --authenticate_http_readwrite="true" --authenticators="crammd5"
--authorizers="local" --credentials="/tmp/Arnwr6/credentials" --filter_gpu_resources="true"
--framework_sorter="drf" --help="false" --hostname_lookup="true" --http_authenticators="basic"
--http_framework_authenticators="basic" --initialize_driver_logging="true" --log_auto_initialize="true"
--logbufsecs="0" --logging_level="INFO" --max_agent_ping_timeouts="5" --max_completed_frameworks="50"
--max_completed_tasks_per_framework="1000" --max_unreachable_tasks_per_framework="1000" --port="5050"
--quiet="false" --recovery_agent_removal_limit="100%" --registry="in_memory" --registry_fetch_timeout="1mins"
--registry_gc_interval="15mins" --registry_max_agent_age="2weeks" --registry_max_agent_count="102400"
--registry_store_timeout="100secs" --registry_strict="false" --root_submissions="true" --user_sorter="drf"
--version="false" --webui_dir="/mesos/mesos-1.4.0/_inst/share/mesos/webui" --work_dir="/tmp/Arnwr6/master"
--zk_session_timeout="10secs"
I0903 00:47:47.647872  5914 master.cpp:494] Master only allowing authenticated frameworks
to register
I0903 00:47:47.647891  5914 master.cpp:508] Master only allowing authenticated agents to register
I0903 00:47:47.647905  5914 master.cpp:521] Master only allowing authenticated HTTP frameworks
to register
I0903 00:47:47.647922  5914 credentials.hpp:37] Loading credentials for authentication from
'/tmp/Arnwr6/credentials'
I0903 00:47:47.648253  5914 master.cpp:566] Using default 'crammd5' authenticator
I0903 00:47:47.648396  5914 http.cpp:1026] Creating default 'basic' HTTP authenticator for
realm 'mesos-master-readonly'
I0903 00:47:47.648568  5914 http.cpp:1026] Creating default 'basic' HTTP authenticator for
realm 'mesos-master-readwrite'
I0903 00:47:47.648710  5914 http.cpp:1026] Creating default 'basic' HTTP authenticator for
realm 'mesos-master-scheduler'
I0903 00:47:47.648844  5914 master.cpp:646] Authorization enabled
I0903 00:47:47.649024  5910 whitelist_watcher.cpp:77] No whitelist given
I0903 00:47:47.649034  5915 hierarchical.cpp:171] Initialized hierarchical allocator process
I0903 00:47:47.651321  5907 master.cpp:2163] Elected as the leading master!
I0903 00:47:47.651351  5907 master.cpp:1702] Recovering from registrar
I0903 00:47:47.651492  5913 registrar.cpp:347] Recovering registrar
I0903 00:47:47.651955  5913 registrar.cpp:391] Successfully fetched the registry (0B) in 429824ns
I0903 00:47:47.652057  5913 registrar.cpp:495] Applied 1 operations in 32549ns; attempting
to update the registry
I0903 00:47:47.652568  5913 registrar.cpp:552] Successfully updated the registry in 456192ns
I0903 00:47:47.652667  5913 registrar.cpp:424] Successfully recovered registrar
I0903 00:47:47.652972  5911 master.cpp:1801] Recovered 0 agents from the registry (129B);
allowing 10mins for agents to re-register
I0903 00:47:47.653002  5912 hierarchical.cpp:209] Skipping recovery of hierarchical allocator:
nothing to recover
I0903 00:47:47.657490  5882 process.cpp:3228] Attempting to spawn already spawned process
files@172.17.0.5:60478
I0903 00:47:47.657852  5882 cluster.cpp:448] Creating default 'local' authorizer
I0903 00:47:47.659978  5913 slave.cpp:250] Mesos agent started on (532)@172.17.0.5:60478
I0903 00:47:47.660089  5913 slave.cpp:251] Flags at startup: --acls="" --appc_simple_discovery_uri_prefix="http://"
--appc_store_dir="/tmp/SlaveTest_ContainersEndpoint_4cRgFj/store/appc" --authenticate_http_executors="true"
--authenticate_http_readonly="true" --authenticate_http_readwrite="true" --authenticatee="crammd5"
--authentication_backoff_factor="1secs" --authorizer="local" --cgroups_cpu_enable_pids_and_tids_count="false"
--cgroups_enable_cfs="false" --cgroups_hierarchy="/sys/fs/cgroup" --cgroups_limit_swap="false"
--cgroups_root="mesos" --container_disk_watch_interval="15secs" --containerizers="mesos" --credential="/tmp/SlaveTest_ContainersEndpoint_4cRgFj/credential"
--default_role="*" --disallow_sharing_agent_pid_namespace="false" --disk_watch_interval="1mins"
--docker="docker" --docker_kill_orphans="true" --docker_registry="https://registry-1.docker.io"
--docker_remove_delay="6hrs" --docker_socket="/var/run/docker.sock" --docker_stop_timeout="0ns"
--docker_store_dir="/tmp/SlaveTest_ContainersEndpoint_4cRgFj/store/docker" --docker_volume_checkpoint_dir="/var/run/mesos/isolators/docker/volume"
--enforce_container_disk_quota="false" --executor_registration_timeout="1mins" --executor_reregistration_timeout="2secs"
--executor_secret_key="/tmp/SlaveTest_ContainersEndpoint_4cRgFj/executor_secret_key" --executor_shutdown_grace_period="5secs"
--fetcher_cache_dir="/tmp/SlaveTest_ContainersEndpoint_4cRgFj/fetch" --fetcher_cache_size="2GB"
--frameworks_home="" --gc_delay="1weeks" --gc_disk_headroom="0.1" --hadoop_home="" --help="false"
--hostname_lookup="true" --http_command_executor="false" --http_credentials="/tmp/SlaveTest_ContainersEndpoint_4cRgFj/http_credentials"
--http_heartbeat_interval="30secs" --initialize_driver_logging="true" --isolation="posix/cpu,posix/mem"
--launcher="posix" --launcher_dir="/mesos/mesos-1.4.0/_build/src" --logbufsecs="0" --logging_level="INFO"
--max_completed_executors_per_framework="150" --oversubscribed_resources_interval="15secs"
--perf_duration="10secs" --perf_interval="1mins" --port="5051" --qos_correction_interval_min="0ns"
--quiet="false" --recover="reconnect" --recovery_timeout="15mins" --registration_backoff_factor="10ms"
--resources="cpus:2;gpus:0;mem:1024;disk:1024;ports:[31000-32000]" --revocable_cpu_low_priority="true"
--runtime_dir="/tmp/SlaveTest_ContainersEndpoint_4cRgFj" --sandbox_directory="/mnt/mesos/sandbox"
--strict="true" --switch_user="true" --systemd_enable_support="true" --systemd_runtime_directory="/run/systemd/system"
--version="false" --work_dir="/tmp/SlaveTest_ContainersEndpoint_SWbo3c"
I0903 00:47:47.660495  5882 process.cpp:3228] Attempting to spawn already spawned process
version@172.17.0.5:60478
I0903 00:47:47.660536  5913 credentials.hpp:86] Loading credential for authentication from
'/tmp/SlaveTest_ContainersEndpoint_4cRgFj/credential'
I0903 00:47:47.660740  5913 slave.cpp:283] Agent using credential for: test-principal
I0903 00:47:47.660773  5913 credentials.hpp:37] Loading credentials for authentication from
'/tmp/SlaveTest_ContainersEndpoint_4cRgFj/http_credentials'
I0903 00:47:47.661115  5913 http.cpp:1026] Creating default 'basic' HTTP authenticator for
realm 'mesos-agent-executor'
I0903 00:47:47.661264  5913 http.cpp:1047] Creating default 'jwt' HTTP authenticator for realm
'mesos-agent-executor'
I0903 00:47:47.661523  5913 http.cpp:1026] Creating default 'basic' HTTP authenticator for
realm 'mesos-agent-readonly'
I0903 00:47:47.661605  5882 sched.cpp:232] Version: 1.4.0
I0903 00:47:47.661660  5913 http.cpp:1047] Creating default 'jwt' HTTP authenticator for realm
'mesos-agent-readonly'
I0903 00:47:47.662015  5913 http.cpp:1026] Creating default 'basic' HTTP authenticator for
realm 'mesos-agent-readwrite'
I0903 00:47:47.662160  5913 http.cpp:1047] Creating default 'jwt' HTTP authenticator for realm
'mesos-agent-readwrite'
I0903 00:47:47.662204  5910 sched.cpp:336] New master detected at master@172.17.0.5:60478
I0903 00:47:47.662350  5910 sched.cpp:407] Authenticating with master master@172.17.0.5:60478
I0903 00:47:47.662384  5910 sched.cpp:414] Using default CRAM-MD5 authenticatee
I0903 00:47:47.662667  5901 authenticatee.cpp:121] Creating new client SASL connection
I0903 00:47:47.662964  5914 master.cpp:7832] Authenticating scheduler-3074df0d-830a-4add-abd0-40b0b5ccf541@172.17.0.5:60478
I0903 00:47:47.663102  5902 authenticator.cpp:414] Starting authentication session for crammd5-authenticatee(1067)@172.17.0.5:60478
I0903 00:47:47.663378  5909 authenticator.cpp:98] Creating new server SASL connection
I0903 00:47:47.663620  5904 authenticatee.cpp:213] Received SASL authentication mechanisms:
CRAM-MD5
I0903 00:47:47.663655  5904 authenticatee.cpp:239] Attempting to authenticate with mechanism
'CRAM-MD5'
I0903 00:47:47.663765  5911 authenticator.cpp:204] Received SASL authentication start
I0903 00:47:47.663849  5911 authenticator.cpp:326] Authentication requires more steps
I0903 00:47:47.663980  5911 authenticatee.cpp:259] Received SASL authentication step
I0903 00:47:47.664116  5907 authenticator.cpp:232] Received SASL authentication step
I0903 00:47:47.664155  5907 auxprop.cpp:109] Request to lookup properties for user: 'test-principal'
realm: '45a683e5be10' server FQDN: '45a683e5be10' SASL_AUXPROP_VERIFY_AGAINST_HASH: false
SASL_AUXPROP_OVERRIDE: false SASL_AUXPROP_AUTHZID: false 
I0903 00:47:47.663944  5913 slave.cpp:565] Agent resources: [{"name":"cpus","scalar":{"value":2.0},"type":"SCALAR"},{"name":"mem","scalar":{"value":1024.0},"type":"SCALAR"},{"name":"disk","scalar":{"value":1024.0},"type":"SCALAR"},{"name":"ports","ranges":{"range":[{"begin":31000,"end":32000}]},"type":"RANGES"}]
I0903 00:47:47.664175  5907 auxprop.cpp:181] Looking up auxiliary property '*userPassword'
I0903 00:47:47.664192  5913 slave.cpp:573] Agent attributes: [  ]
I0903 00:47:47.664222  5913 slave.cpp:582] Agent hostname: 45a683e5be10
I0903 00:47:47.664223  5907 auxprop.cpp:181] Looking up auxiliary property '*cmusaslsecretCRAM-MD5'
I0903 00:47:47.664299  5907 auxprop.cpp:109] Request to lookup properties for user: 'test-principal'
realm: '45a683e5be10' server FQDN: '45a683e5be10' SASL_AUXPROP_VERIFY_AGAINST_HASH: false
SASL_AUXPROP_OVERRIDE: false SASL_AUXPROP_AUTHZID: true 
I0903 00:47:47.664389  5908 status_update_manager.cpp:177] Pausing sending status updates
I0903 00:47:47.664434  5907 auxprop.cpp:131] Skipping auxiliary property '*userPassword' since
SASL_AUXPROP_AUTHZID == true
I0903 00:47:47.664455  5907 auxprop.cpp:131] Skipping auxiliary property '*cmusaslsecretCRAM-MD5'
since SASL_AUXPROP_AUTHZID == true
I0903 00:47:47.664479  5907 authenticator.cpp:318] Authentication success
I0903 00:47:47.664594  5906 authenticatee.cpp:299] Authentication success
I0903 00:47:47.664633  5905 master.cpp:7862] Successfully authenticated principal 'test-principal'
at scheduler-3074df0d-830a-4add-abd0-40b0b5ccf541@172.17.0.5:60478
I0903 00:47:47.664666  5903 authenticator.cpp:432] Authentication session cleanup for crammd5-authenticatee(1067)@172.17.0.5:60478
I0903 00:47:47.664839  5906 sched.cpp:513] Successfully authenticated with master master@172.17.0.5:60478
I0903 00:47:47.664860  5906 sched.cpp:836] Sending SUBSCRIBE call to master@172.17.0.5:60478
I0903 00:47:47.664976  5906 sched.cpp:869] Will retry registration in 1.972508955secs if necessary
I0903 00:47:47.665149  5902 master.cpp:2894] Received SUBSCRIBE call for framework 'default'
at scheduler-3074df0d-830a-4add-abd0-40b0b5ccf541@172.17.0.5:60478
I0903 00:47:47.665174  5902 master.cpp:2228] Authorizing framework principal 'test-principal'
to receive offers for roles '{ * }'
I0903 00:47:47.665603  5911 master.cpp:2974] Subscribing framework default with checkpointing
disabled and capabilities [ RESERVATION_REFINEMENT ]
I0903 00:47:47.665892  5915 state.cpp:64] Recovering state from '/tmp/SlaveTest_ContainersEndpoint_SWbo3c/meta'
I0903 00:47:47.666174  5910 sched.cpp:759] Framework registered with 1c0e6dc9-2fff-4a24-9528-7811b50187de-0000
I0903 00:47:47.666188  5901 status_update_manager.cpp:203] Recovering status update manager
I0903 00:47:47.666236  5910 sched.cpp:773] Scheduler::registered took 36805ns
I0903 00:47:47.666369  5907 hierarchical.cpp:303] Added framework 1c0e6dc9-2fff-4a24-9528-7811b50187de-0000
I0903 00:47:47.666535  5907 hierarchical.cpp:1925] No allocations performed
I0903 00:47:47.666573  5903 slave.cpp:6295] Finished recovery
I0903 00:47:47.666579  5907 hierarchical.cpp:2015] No inverse offers to send out!
I0903 00:47:47.666630  5907 hierarchical.cpp:1468] Performed allocation for 0 agents in 153336ns
I0903 00:47:47.666976  5903 slave.cpp:6477] Querying resource estimator for oversubscribable
resources
I0903 00:47:47.667191  5912 status_update_manager.cpp:177] Pausing sending status updates
I0903 00:47:47.667187  5908 slave.cpp:971] New master detected at master@172.17.0.5:60478
I0903 00:47:47.667292  5908 slave.cpp:1006] Detecting new master
I0903 00:47:47.667456  5908 slave.cpp:6491] Received oversubscribable resources {} from the
resource estimator
I0903 00:47:47.675496  5905 slave.cpp:1033] Authenticating with master master@172.17.0.5:60478
I0903 00:47:47.675578  5905 slave.cpp:1044] Using default CRAM-MD5 authenticatee
I0903 00:47:47.675832  5906 authenticatee.cpp:121] Creating new client SASL connection
I0903 00:47:47.676244  5906 master.cpp:7832] Authenticating slave(532)@172.17.0.5:60478
I0903 00:47:47.676359  5909 authenticator.cpp:414] Starting authentication session for crammd5-authenticatee(1068)@172.17.0.5:60478
I0903 00:47:47.676637  5915 authenticator.cpp:98] Creating new server SASL connection
I0903 00:47:47.676872  5914 authenticatee.cpp:213] Received SASL authentication mechanisms:
CRAM-MD5
I0903 00:47:47.676913  5914 authenticatee.cpp:239] Attempting to authenticate with mechanism
'CRAM-MD5'
I0903 00:47:47.677043  5914 authenticator.cpp:204] Received SASL authentication start
I0903 00:47:47.677114  5914 authenticator.cpp:326] Authentication requires more steps
I0903 00:47:47.677230  5914 authenticatee.cpp:259] Received SASL authentication step
I0903 00:47:47.677383  5904 authenticator.cpp:232] Received SASL authentication step
I0903 00:47:47.677422  5904 auxprop.cpp:109] Request to lookup properties for user: 'test-principal'
realm: '45a683e5be10' server FQDN: '45a683e5be10' SASL_AUXPROP_VERIFY_AGAINST_HASH: false
SASL_AUXPROP_OVERRIDE: false SASL_AUXPROP_AUTHZID: false 
I0903 00:47:47.677438  5904 auxprop.cpp:181] Looking up auxiliary property '*userPassword'
I0903 00:47:47.677486  5904 auxprop.cpp:181] Looking up auxiliary property '*cmusaslsecretCRAM-MD5'
I0903 00:47:47.677521  5904 auxprop.cpp:109] Request to lookup properties for user: 'test-principal'
realm: '45a683e5be10' server FQDN: '45a683e5be10' SASL_AUXPROP_VERIFY_AGAINST_HASH: false
SASL_AUXPROP_OVERRIDE: false SASL_AUXPROP_AUTHZID: true 
I0903 00:47:47.677538  5904 auxprop.cpp:131] Skipping auxiliary property '*userPassword' since
SASL_AUXPROP_AUTHZID == true
I0903 00:47:47.677548  5904 auxprop.cpp:131] Skipping auxiliary property '*cmusaslsecretCRAM-MD5'
since SASL_AUXPROP_AUTHZID == true
I0903 00:47:47.677567  5904 authenticator.cpp:318] Authentication success
I0903 00:47:47.677669  5907 authenticatee.cpp:299] Authentication success
I0903 00:47:47.677778  5903 master.cpp:7862] Successfully authenticated principal 'test-principal'
at slave(532)@172.17.0.5:60478
I0903 00:47:47.677812  5913 authenticator.cpp:432] Authentication session cleanup for crammd5-authenticatee(1068)@172.17.0.5:60478
I0903 00:47:47.678166  5911 slave.cpp:1128] Successfully authenticated with master master@172.17.0.5:60478
I0903 00:47:47.678411  5911 slave.cpp:1607] Will retry registration in 17.671642ms if necessary
I0903 00:47:47.678638  5901 master.cpp:5714] Received register agent message from slave(532)@172.17.0.5:60478
(45a683e5be10)
I0903 00:47:47.678688  5901 master.cpp:3803] Authorizing agent with principal 'test-principal'
I0903 00:47:47.679121  5909 master.cpp:5774] Authorized registration of agent at slave(532)@172.17.0.5:60478
(45a683e5be10)
I0903 00:47:47.679256  5909 master.cpp:5867] Registering agent at slave(532)@172.17.0.5:60478
(45a683e5be10) with id 1c0e6dc9-2fff-4a24-9528-7811b50187de-S0
I0903 00:47:47.679664  5915 registrar.cpp:495] Applied 1 operations in 77728ns; attempting
to update the registry
I0903 00:47:47.680371  5915 registrar.cpp:552] Successfully updated the registry in 633088ns
I0903 00:47:47.680616  5908 master.cpp:5914] Admitted agent 1c0e6dc9-2fff-4a24-9528-7811b50187de-S0
at slave(532)@172.17.0.5:60478 (45a683e5be10)
I0903 00:47:47.681258  5913 slave.cpp:4970] Received ping from slave-observer(506)@172.17.0.5:60478
I0903 00:47:47.681462  5913 slave.cpp:1174] Registered with master master@172.17.0.5:60478;
given agent ID 1c0e6dc9-2fff-4a24-9528-7811b50187de-S0
I0903 00:47:47.681603  5911 status_update_manager.cpp:184] Resuming sending status updates
I0903 00:47:47.681303  5908 master.cpp:5945] Registered agent 1c0e6dc9-2fff-4a24-9528-7811b50187de-S0
at slave(532)@172.17.0.5:60478 (45a683e5be10) with [{"name":"cpus","scalar":{"value":2.0},"type":"SCALAR"},{"name":"mem","scalar":{"value":1024.0},"type":"SCALAR"},{"name":"disk","scalar":{"value":1024.0},"type":"SCALAR"},{"name":"ports","ranges":{"range":[{"begin":31000,"end":32000}]},"type":"RANGES"}]
I0903 00:47:47.681859  5900 hierarchical.cpp:593] Added agent 1c0e6dc9-2fff-4a24-9528-7811b50187de-S0
(45a683e5be10) with cpus:2; mem:1024; disk:1024; ports:[31000-32000] (allocated: {})
I0903 00:47:47.681910  5913 slave.cpp:1194] Checkpointing SlaveInfo to '/tmp/SlaveTest_ContainersEndpoint_SWbo3c/meta/slaves/1c0e6dc9-2fff-4a24-9528-7811b50187de-S0/slave.info'
I0903 00:47:47.682402  5913 slave.cpp:1243] Forwarding total oversubscribed resources {}
I0903 00:47:47.682596  5901 master.cpp:6683] Received update of agent 1c0e6dc9-2fff-4a24-9528-7811b50187de-S0
at slave(532)@172.17.0.5:60478 (45a683e5be10) with total oversubscribed resources {}
I0903 00:47:47.683205  5900 hierarchical.cpp:2015] No inverse offers to send out!
I0903 00:47:47.683269  5900 hierarchical.cpp:1468] Performed allocation for 1 agents in 1.239736ms
I0903 00:47:47.683490  5900 hierarchical.cpp:660] Agent 1c0e6dc9-2fff-4a24-9528-7811b50187de-S0
(45a683e5be10) updated with total resources cpus:2; mem:1024; disk:1024; ports:[31000-32000]
I0903 00:47:47.683708  5906 master.cpp:7662] Sending 1 offers to framework 1c0e6dc9-2fff-4a24-9528-7811b50187de-0000
(default) at scheduler-3074df0d-830a-4add-abd0-40b0b5ccf541@172.17.0.5:60478
I0903 00:47:47.684296  5909 sched.cpp:933] Scheduler::resourceOffers took 130161ns
I0903 00:47:47.686743  5911 master.cpp:9159] Removing offer 1c0e6dc9-2fff-4a24-9528-7811b50187de-O0
I0903 00:47:47.686965  5911 master.cpp:4153] Processing ACCEPT call for offers: [ 1c0e6dc9-2fff-4a24-9528-7811b50187de-O0
] on agent 1c0e6dc9-2fff-4a24-9528-7811b50187de-S0 at slave(532)@172.17.0.5:60478 (45a683e5be10)
for framework 1c0e6dc9-2fff-4a24-9528-7811b50187de-0000 (default) at scheduler-3074df0d-830a-4add-abd0-40b0b5ccf541@172.17.0.5:60478
I0903 00:47:47.687103  5911 master.cpp:3530] Authorizing framework principal 'test-principal'
to launch task 1
I0903 00:47:47.687373  5911 master.cpp:3530] Authorizing framework principal 'test-principal'
to launch task 2
W0903 00:47:47.689236  5911 validation.cpp:1294] Executor 'executor-1' for task '1' uses less
CPUs (None) than the minimum required (0.01). Please update your executor, as this will be
mandatory in future releases.
W0903 00:47:47.689282  5911 validation.cpp:1306] Executor 'executor-1' for task '1' uses less
memory (None) than the minimum required (32MB). Please update your executor, as this will
be mandatory in future releases.
I0903 00:47:47.689721  5911 master.cpp:9719] Adding task 1 with resources [{"allocation_info":{"role":"*"},"name":"cpus","scalar":{"value":1.0},"type":"SCALAR"},{"allocation_info":{"role":"*"},"name":"mem","scalar":{"value":512.0},"type":"SCALAR"}]
on agent 1c0e6dc9-2fff-4a24-9528-7811b50187de-S0 at slave(532)@172.17.0.5:60478 (45a683e5be10)
I0903 00:47:47.690105  5911 master.cpp:4816] Launching task 1 of framework 1c0e6dc9-2fff-4a24-9528-7811b50187de-0000
(default) at scheduler-3074df0d-830a-4add-abd0-40b0b5ccf541@172.17.0.5:60478 with resources
[{"allocation_info":{"role":"*"},"name":"cpus","scalar":{"value":1.0},"type":"SCALAR"},{"allocation_info":{"role":"*"},"name":"mem","scalar":{"value":512.0},"type":"SCALAR"}]
on agent 1c0e6dc9-2fff-4a24-9528-7811b50187de-S0 at slave(532)@172.17.0.5:60478 (45a683e5be10)
I0903 00:47:47.690687  5914 slave.cpp:1736] Got assigned task '1' for framework 1c0e6dc9-2fff-4a24-9528-7811b50187de-0000
W0903 00:47:47.691329  5911 validation.cpp:1294] Executor 'executor-2' for task '2' uses less
CPUs (None) than the minimum required (0.01). Please update your executor, as this will be
mandatory in future releases.
I0903 00:47:47.691354  5914 slave.cpp:2003] Authorizing task '1' for framework 1c0e6dc9-2fff-4a24-9528-7811b50187de-0000
W0903 00:47:47.691372  5911 validation.cpp:1306] Executor 'executor-2' for task '2' uses less
memory (None) than the minimum required (32MB). Please update your executor, as this will
be mandatory in future releases.
I0903 00:47:47.691424  5914 slave.cpp:6794] Authorizing framework principal 'test-principal'
to launch task 1
I0903 00:47:47.691807  5911 master.cpp:9719] Adding task 2 with resources [{"allocation_info":{"role":"*"},"name":"cpus","scalar":{"value":1.0},"type":"SCALAR"},{"allocation_info":{"role":"*"},"name":"mem","scalar":{"value":512.0},"type":"SCALAR"}]
on agent 1c0e6dc9-2fff-4a24-9528-7811b50187de-S0 at slave(532)@172.17.0.5:60478 (45a683e5be10)
I0903 00:47:47.692306  5907 slave.cpp:2171] Launching task '1' for framework 1c0e6dc9-2fff-4a24-9528-7811b50187de-0000
I0903 00:47:47.692211  5911 master.cpp:4816] Launching task 2 of framework 1c0e6dc9-2fff-4a24-9528-7811b50187de-0000
(default) at scheduler-3074df0d-830a-4add-abd0-40b0b5ccf541@172.17.0.5:60478 with resources
[{"allocation_info":{"role":"*"},"name":"cpus","scalar":{"value":1.0},"type":"SCALAR"},{"allocation_info":{"role":"*"},"name":"mem","scalar":{"value":512.0},"type":"SCALAR"}]
on agent 1c0e6dc9-2fff-4a24-9528-7811b50187de-S0 at slave(532)@172.17.0.5:60478 (45a683e5be10)
I0903 00:47:47.692863  5907 paths.cpp:578] Trying to chown '/tmp/SlaveTest_ContainersEndpoint_SWbo3c/slaves/1c0e6dc9-2fff-4a24-9528-7811b50187de-S0/frameworks/1c0e6dc9-2fff-4a24-9528-7811b50187de-0000/executors/executor-1/runs/32e059db-f59e-49ab-88bb-76588a2dafb7'
to user 'mesos'
I0903 00:47:47.693151  5907 slave.cpp:7256] Launching executor 'executor-1' of framework 1c0e6dc9-2fff-4a24-9528-7811b50187de-0000
with resources [] in work directory '/tmp/SlaveTest_ContainersEndpoint_SWbo3c/slaves/1c0e6dc9-2fff-4a24-9528-7811b50187de-S0/frameworks/1c0e6dc9-2fff-4a24-9528-7811b50187de-0000/executors/executor-1/runs/32e059db-f59e-49ab-88bb-76588a2dafb7'
I0903 00:47:47.693879  5907 slave.cpp:2400] Queued task '1' for executor 'executor-1' of framework
1c0e6dc9-2fff-4a24-9528-7811b50187de-0000
I0903 00:47:47.694182  5907 slave.cpp:1736] Got assigned task '2' for framework 1c0e6dc9-2fff-4a24-9528-7811b50187de-0000
I0903 00:47:47.694402  5905 hierarchical.cpp:887] Updated allocation of framework 1c0e6dc9-2fff-4a24-9528-7811b50187de-0000
on agent 1c0e6dc9-2fff-4a24-9528-7811b50187de-S0 from cpus(allocated: *):2; mem(allocated:
*):1024; disk(allocated: *):1024; ports(allocated: *):[31000-32000] to cpus(allocated: *):2;
mem(allocated: *):1024; disk(allocated: *):1024; ports(allocated: *):[31000-32000]
I0903 00:47:47.694687  5907 slave.cpp:924] Successfully attached file '/tmp/SlaveTest_ContainersEndpoint_SWbo3c/slaves/1c0e6dc9-2fff-4a24-9528-7811b50187de-S0/frameworks/1c0e6dc9-2fff-4a24-9528-7811b50187de-0000/executors/executor-1/runs/32e059db-f59e-49ab-88bb-76588a2dafb7'
I0903 00:47:47.694742  5907 slave.cpp:924] Successfully attached file '/tmp/SlaveTest_ContainersEndpoint_SWbo3c/slaves/1c0e6dc9-2fff-4a24-9528-7811b50187de-S0/frameworks/1c0e6dc9-2fff-4a24-9528-7811b50187de-0000/executors/executor-1/runs/32e059db-f59e-49ab-88bb-76588a2dafb7'
I0903 00:47:47.695008  5907 slave.cpp:2858] Launching container 32e059db-f59e-49ab-88bb-76588a2dafb7
for executor 'executor-1' of framework 1c0e6dc9-2fff-4a24-9528-7811b50187de-0000
I0903 00:47:47.695302  5905 hierarchical.cpp:1152] Recovered ports(allocated: *):[31000-32000];
disk(allocated: *):1024 (total: cpus:2; mem:1024; disk:1024; ports:[31000-32000], allocated:
cpus(allocated: *):2; mem(allocated: *):1024) on agent 1c0e6dc9-2fff-4a24-9528-7811b50187de-S0
from framework 1c0e6dc9-2fff-4a24-9528-7811b50187de-0000
I0903 00:47:47.695377  5905 hierarchical.cpp:1189] Framework 1c0e6dc9-2fff-4a24-9528-7811b50187de-0000
filtered agent 1c0e6dc9-2fff-4a24-9528-7811b50187de-S0 for 5secs
I0903 00:47:47.695403  5907 slave.cpp:2003] Authorizing task '2' for framework 1c0e6dc9-2fff-4a24-9528-7811b50187de-0000
I0903 00:47:47.695525  5907 slave.cpp:6794] Authorizing framework principal 'test-principal'
to launch task 2
I0903 00:47:47.696187  5907 slave.cpp:2171] Launching task '2' for framework 1c0e6dc9-2fff-4a24-9528-7811b50187de-0000
I0903 00:47:47.696660  5907 paths.cpp:578] Trying to chown '/tmp/SlaveTest_ContainersEndpoint_SWbo3c/slaves/1c0e6dc9-2fff-4a24-9528-7811b50187de-S0/frameworks/1c0e6dc9-2fff-4a24-9528-7811b50187de-0000/executors/executor-2/runs/0ca96a87-1a97-4407-8ef7-7c9e956723e8'
to user 'mesos'
I0903 00:47:47.696928  5907 slave.cpp:7256] Launching executor 'executor-2' of framework 1c0e6dc9-2fff-4a24-9528-7811b50187de-0000
with resources [] in work directory '/tmp/SlaveTest_ContainersEndpoint_SWbo3c/slaves/1c0e6dc9-2fff-4a24-9528-7811b50187de-S0/frameworks/1c0e6dc9-2fff-4a24-9528-7811b50187de-0000/executors/executor-2/runs/0ca96a87-1a97-4407-8ef7-7c9e956723e8'
I0903 00:47:47.697847  5907 slave.cpp:2400] Queued task '2' for executor 'executor-2' of framework
1c0e6dc9-2fff-4a24-9528-7811b50187de-0000
I0903 00:47:47.697962  5907 slave.cpp:924] Successfully attached file '/tmp/SlaveTest_ContainersEndpoint_SWbo3c/slaves/1c0e6dc9-2fff-4a24-9528-7811b50187de-S0/frameworks/1c0e6dc9-2fff-4a24-9528-7811b50187de-0000/executors/executor-2/runs/0ca96a87-1a97-4407-8ef7-7c9e956723e8'
I0903 00:47:47.698032  5907 slave.cpp:924] Successfully attached file '/tmp/SlaveTest_ContainersEndpoint_SWbo3c/slaves/1c0e6dc9-2fff-4a24-9528-7811b50187de-S0/frameworks/1c0e6dc9-2fff-4a24-9528-7811b50187de-0000/executors/executor-2/runs/0ca96a87-1a97-4407-8ef7-7c9e956723e8'
*** Aborted at 1504399667 (unix time) try "date -d @1504399667" if you are using GNU date
***
PC: @     0x2ab0541a382d (unknown)
I0903 00:47:47.698768  5908 process.cpp:3228] Attempting to spawn already spawned process
version@172.17.0.5:60478
I0903 00:47:47.698941  5908 exec.cpp:162] Version: 1.4.0
*** SIGSEGV (@0xf0) received by PID 5882 (TID 0x2ab05dcfc700) from PID 240; stack trace: ***
I0903 00:47:47.699265  5915 exec.cpp:212] Executor started at: executor(136)@172.17.0.5:60478
with pid 5882
    @     0x2ab089fd8af7 (unknown)
    @     0x2ab089fdd449 (unknown)
    @     0x2ab053f5a330 (unknown)
    @     0x2ab0541a382d (unknown)
    @     0x2ab04867c298 os::getenv()
    @     0x2ab04fee21fb mesos::internal::slave::executorEnvironment()
    @     0x2ab04fede539 mesos::internal::slave::Slave::launchExecutor()
    @     0x2ab04ff9e128 _ZZN7process8dispatchIN5mesos8internal5slave5SlaveERK6OptionINS_6FutureINS1_6SecretEEEERKNS1_11FrameworkIDERKNS1_10ExecutorIDERKS5_INS1_8TaskInfoEESB_SE_SH_SL_EEvRKNS_3PIDIT_EEMSN_FvT0_T1_T2_T3_EOT4_OT5_OT6_OT7_ENKUlRS9_RSC_RSF_RSJ_PNS_11ProcessBaseEE_clES15_S16_S17_S18_S1A_
    @     0x2ab04ff9df9b _ZNSt5_BindIFZN7process8dispatchIN5mesos8internal5slave5SlaveERK6OptionINS0_6FutureINS2_6SecretEEEERKNS2_11FrameworkIDERKNS2_10ExecutorIDERKS6_INS2_8TaskInfoEESC_SF_SI_SM_EEvRKNS0_3PIDIT_EEMSO_FvT0_T1_T2_T3_EOT4_OT5_OT6_OT7_EUlRSA_RSD_RSG_RSK_PNS0_11ProcessBaseEE_SA_SD_SG_SK_St12_PlaceholderILi1EEEE6__callIvJOS1B_EJLm0ELm1ELm2ELm3ELm4EEEESO_OSt5tupleIJDpT0_EESt12_Index_tupleIJXspT1_EEE
    @     0x2ab04ff9de96 _ZNSt5_BindIFZN7process8dispatchIN5mesos8internal5slave5SlaveERK6OptionINS0_6FutureINS2_6SecretEEEERKNS2_11FrameworkIDERKNS2_10ExecutorIDERKS6_INS2_8TaskInfoEESC_SF_SI_SM_EEvRKNS0_3PIDIT_EEMSO_FvT0_T1_T2_T3_EOT4_OT5_OT6_OT7_EUlRSA_RSD_RSG_RSK_PNS0_11ProcessBaseEE_SA_SD_SG_SK_St12_PlaceholderILi1EEEEclIJS1B_EvEESS_DpOT_
    @     0x2ab04ff9d94f _ZNSt17_Function_handlerIFvPN7process11ProcessBaseEESt5_BindIFZNS0_8dispatchIN5mesos8internal5slave5SlaveERK6OptionINS0_6FutureINS6_6SecretEEEERKNS6_11FrameworkIDERKNS6_10ExecutorIDERKSA_INS6_8TaskInfoEESG_SJ_SM_SQ_EEvRKNS0_3PIDIT_EEMSS_FvT0_T1_T2_T3_EOT4_OT5_OT6_OT7_EUlRSE_RSH_RSK_RSO_S2_E_SE_SH_SK_SO_St12_PlaceholderILi1EEEEE9_M_invokeERKSt9_Any_dataS2_
    @     0x2ab0512783f4 std::function<>::operator()()
    @     0x2ab05125c2e4 process::ProcessBase::visit()
    @     0x2ab0512e76ee process::DispatchEvent::visit()
    @     0x2ab0486618a1 process::ProcessBase::serve()
    @     0x2ab051259c73 process::ProcessManager::resume()
    @     0x2ab051269821 process::ProcessManager::init_threads()::$_9::operator()()
    @     0x2ab051269765 _ZNSt12_Bind_simpleIFZN7process14ProcessManager12init_threadsEvE3$_9vEE9_M_invokeIJEEEvSt12_Index_tupleIJXspT_EEE
    @     0x2ab051269735 std::_Bind_simple<>::operator()()
    @     0x2ab05126970c std::thread::_Impl<>::_M_run()
    @     0x2ab0537dba60 (unknown)
    @     0x2ab053f52184 start_thread
    @     0x2ab054265ffd (unknown)
make[4]: *** [check-local] Segmentation fault
make[4]: Leaving directory `/mesos/mesos-1.4.0/_build/src'
make[3]: *** [check-am] Error 2
make[3]: Leaving directory `/mesos/mesos-1.4.0/_build/src'
make[2]: *** [check] Error 2
make[2]: Leaving directory `/mesos/mesos-1.4.0/_build/src'
make[1]: *** [check-recursive] Error 1
make[1]: Leaving directory `/mesos/mesos-1.4.0/_build'
make: *** [distcheck] Error 1
+ docker rmi mesos-1504396425-14714
Untagged: mesos-1504396425-14714:latest
Deleted: sha256:947659d4932d9cb2ed4bf8328d71e5d6ad3cc877e511ca305cf8e707fb60bfcb
Deleted: sha256:f0fb1877254a74262534790bb1cb78fea472c513c6b8f7f46c19f4e024d461b2
Deleted: sha256:2dd1616ddee1de227c8a57e32f0bc077c32d087db2a16be104a348fc8b526111
Deleted: sha256:93b3d6a1563b9f08821e00f7e7262994cd3b184756d1c93f0ba06b4b643c71b9
Deleted: sha256:984800da0b52fd9c0181c4d8bc286e1133c0b0b662e958f820ce0254cf852471
Deleted: sha256:7538d87b9bb53e0201f90f591e54f364278f170e3461f9c32e0e9e56da7bd829
Deleted: sha256:3800c12a00ea1da18217c80d62e85cc9b1586c73138ede8a21ac93c195f93675
Deleted: sha256:0fe07f297a5501dda56386a81651f4b6a72749c6f7598de9be8143c76a06d6ad
Deleted: sha256:4e4e0be1c7f8bb96ded53adf14a96d184d9a503bea9cdf429ef4d2c7851540fd
Deleted: sha256:f74645b9d4ca41e08669812a65dc2aaf2e060f9be0c630144cfff1773391a5ea
Deleted: sha256:04438a9494716ff3fa4d5a4d7f0b3e83457753fe1d4d3ae80f8d5166a4584ba4
Deleted: sha256:bf56d6a4c97bb12e8086b5a6e5c41d0d383c0508cee35a98a53499df032136d9
Deleted: sha256:e4f0d49f97726d97bbc4409b4a0a46c56e518c1bd00ea0833dd376fb8834d258
Deleted: sha256:ab6ca7155d2c4eafc3249689c850c8256ad8a9edf954b6998d50c2054e4cd5df
Deleted: sha256:5ba9312c4a3471185434de4cb9d3d8f68c96f0481bb50584c0f93ada6b3e0b21
Deleted: sha256:86caf4c05f8f1f3653e85d8b6d0a0fdba1487d6ed2bac1a80c6b0622e4f442b8
Deleted: sha256:7ba6b747043e573f08ee6ecc2b0d5009bba38d6961006df69f15a20064a0135a
Deleted: sha256:35954be6086b5e7ae64e064c997c7dd522442ffb2c7fd92da2ce2dccf7f5b695
Deleted: sha256:3d5b58df5c0d301657508afe647891156c70def096ab86784dbc84f2a54a8c37
Deleted: sha256:4b3457ad829a28d819e65dd719a1eb86f3c4a9cf7c54183eec0c046ec8d742d9
Deleted: sha256:7f9da92a8c8aeb78acbcc0d0b9ea7c5b22b950efe9fd3be3e60486bdde388e36
Deleted: sha256:ea1834953af0614509db3793e35808975ca565de452f1baaf0d79654c4800151
Deleted: sha256:647d7416f7f37d3e99ff36d7c51eb793ae70a0b19aa70af6c3c5c708dfc03154
Deleted: sha256:a67c317ecbb421ba6e6d8b4cdfeb8cadf6cadced12e791d6f39292e6010d10a4
Build step 'Execute shell' marked build as failure

Mime
View raw message