mesos-builds mailing list archives

Site index · List index
Message view « Date » · « Thread »
Top « Date » · « Thread »
From Apache Jenkins Server <jenk...@builds.apache.org>
Subject Build failed in Jenkins: Mesos-Buildbot » autotools,gcc,--verbose,GLOG_v=1 MESOS_VERBOSE=1,centos:7,(ubuntu)&&(!ubuntu-us1)&&(!ubuntu-eu2)&&(!qnode3)&&(!H23) #4247
Date Thu, 21 Sep 2017 01:07:39 GMT
See <https://builds.apache.org/job/Mesos-Buildbot/BUILDTOOL=autotools,COMPILER=gcc,CONFIGURATION=--verbose,ENVIRONMENT=GLOG_v=1%20MESOS_VERBOSE=1,OS=centos%3A7,label_exp=(ubuntu)&&(!ubuntu-us1)&&(!ubuntu-eu2)&&(!qnode3)&&(!H23)/4247/display/redirect?page=changes>

Changes:

[gregorywmann] Initialized tests with Google Mock initialization.

------------------------------------------
[...truncated 31.62 MB...]
I0921 01:07:31.104418  6814 state.cpp:64] Recovering state from '/tmp/Endpoint_SlaveEndpointTest_AuthorizedRequest_2_FGt47m/meta'
I0921 01:07:31.104748  6825 status_update_manager.cpp:203] Recovering status update manager
I0921 01:07:31.105022  6819 containerizer.cpp:648] Recovering containerizer
I0921 01:07:31.106668  6823 provisioner.cpp:416] Provisioner recovery complete
I0921 01:07:31.107005  6812 slave.cpp:6320] Finished recovery
I0921 01:07:31.107550  6812 slave.cpp:6502] Querying resource estimator for oversubscribable
resources
I0921 01:07:31.107828  6806 slave.cpp:6516] Received oversubscribable resources {} from the
resource estimator
I0921 01:07:31.110919  6824 process.cpp:3929] Handling HTTP event for process 'slave(808)'
with path: '/slave(808)/containers'
I0921 01:07:31.112675  6807 http.cpp:1185] HTTP GET for /slave(808)/containers from 172.17.0.8:49670
I0921 01:07:31.112766  6807 http.cpp:976] Authorizing principal 'test-principal' to GET the
'/containers' endpoint
I0921 01:07:31.117730  6786 slave.cpp:867] Agent terminating
[       OK ] Endpoint/SlaveEndpointTest.AuthorizedRequest/2 (38 ms)
[ RUN      ] Endpoint/SlaveEndpointTest.UnauthorizedRequest/0
I0921 01:07:31.131639  6786 containerizer.cpp:292] Using isolation { environment_secret, posix/cpu,
posix/mem, filesystem/posix, network/cni }
W0921 01:07:31.132199  6786 backend.cpp:76] Failed to create 'aufs' backend: AufsBackend requires
root privileges
W0921 01:07:31.132323  6786 backend.cpp:76] Failed to create 'bind' backend: BindBackend requires
root privileges
I0921 01:07:31.132371  6786 provisioner.cpp:255] Using default backend 'copy'
I0921 01:07:31.136032  6808 slave.cpp:252] Mesos agent started on (809)@172.17.0.8:37732
I0921 01:07:31.136059  6808 slave.cpp:253] Flags at startup: --acls="" --appc_simple_discovery_uri_prefix="http://"
--appc_store_dir="/tmp/Endpoint_SlaveEndpointTest_UnauthorizedRequest_0_TqhQD8/store/appc"
--authenticate_http_readonly="true" --authenticate_http_readwrite="true" --authenticatee="crammd5"
--authentication_backoff_factor="1secs" --authorizer="local" --cgroups_cpu_enable_pids_and_tids_count="false"
--cgroups_enable_cfs="false" --cgroups_hierarchy="/sys/fs/cgroup" --cgroups_limit_swap="false"
--cgroups_root="mesos" --container_disk_watch_interval="15secs" --containerizers="mesos" --credential="/tmp/Endpoint_SlaveEndpointTest_UnauthorizedRequest_0_TqhQD8/credential"
--default_role="*" --disallow_sharing_agent_pid_namespace="false" --disk_watch_interval="1mins"
--docker="docker" --docker_kill_orphans="true" --docker_registry="https://registry-1.docker.io"
--docker_remove_delay="6hrs" --docker_socket="/var/run/docker.sock" --docker_stop_timeout="0ns"
--docker_store_dir="/tmp/Endpoint_SlaveEndpointTest_UnauthorizedRequest_0_TqhQD8/store/docker"
--docker_volume_checkpoint_dir="/var/run/mesos/isolators/docker/volume" --enforce_container_disk_quota="false"
--executor_registration_timeout="1mins" --executor_reregistration_timeout="2secs" --executor_shutdown_grace_period="5secs"
--fetcher_cache_dir="/tmp/Endpoint_SlaveEndpointTest_UnauthorizedRequest_0_TqhQD8/fetch" --fetcher_cache_size="2GB"
--frameworks_home="" --gc_delay="1weeks" --gc_disk_headroom="0.1" --hadoop_home="" --help="false"
--hostname_lookup="true" --http_command_executor="false" --http_credentials="/tmp/Endpoint_SlaveEndpointTest_UnauthorizedRequest_0_TqhQD8/http_credentials"
--http_heartbeat_interval="30secs" --initialize_driver_logging="true" --isolation="posix/cpu,posix/mem"
--launcher="posix" --launcher_dir="/mesos/mesos-1.5.0/_build/src" --logbufsecs="0" --logging_level="INFO"
--max_completed_executors_per_framework="150" --oversubscribed_resources_interval="15secs"
--perf_duration="10secs" --perf_interval="1mins" --port="5051" --qos_correction_interval_min="0ns"
--quiet="false" --recover="reconnect" --recovery_timeout="15mins" --registration_backoff_factor="10ms"
--resources="cpus:2;gpus:0;mem:1024;disk:1024;ports:[31000-32000]" --revocable_cpu_low_priority="true"
--runtime_dir="/tmp/Endpoint_SlaveEndpointTest_UnauthorizedRequest_0_TqhQD8" --sandbox_directory="/mnt/mesos/sandbox"
--strict="true" --switch_user="true" --systemd_enable_support="true" --systemd_runtime_directory="/run/systemd/system"
--version="false" --work_dir="/tmp/Endpoint_SlaveEndpointTest_UnauthorizedRequest_0_nKiP6Y"
--zk_session_timeout="10secs"
I0921 01:07:31.136485  6808 credentials.hpp:86] Loading credential for authentication from
'/tmp/Endpoint_SlaveEndpointTest_UnauthorizedRequest_0_TqhQD8/credential'
I0921 01:07:31.136680  6808 slave.cpp:285] Agent using credential for: test-principal
I0921 01:07:31.136703  6808 credentials.hpp:37] Loading credentials for authentication from
'/tmp/Endpoint_SlaveEndpointTest_UnauthorizedRequest_0_TqhQD8/http_credentials'
I0921 01:07:31.136925  6808 http.cpp:1045] Creating default 'basic' HTTP authenticator for
realm 'mesos-agent-readonly'
I0921 01:07:31.137107  6808 http.cpp:1045] Creating default 'basic' HTTP authenticator for
realm 'mesos-agent-readwrite'
I0921 01:07:31.138491  6808 slave.cpp:583] Agent resources: [{"name":"cpus","scalar":{"value":2.0},"type":"SCALAR"},{"name":"mem","scalar":{"value":1024.0},"type":"SCALAR"},{"name":"disk","scalar":{"value":1024.0},"type":"SCALAR"},{"name":"ports","ranges":{"range":[{"begin":31000,"end":32000}]},"type":"RANGES"}]
I0921 01:07:31.138728  6808 slave.cpp:591] Agent attributes: [  ]
I0921 01:07:31.138743  6808 slave.cpp:600] Agent hostname: 8402baff7bf9
I0921 01:07:31.138901  6818 status_update_manager.cpp:177] Pausing sending status updates
I0921 01:07:31.140478  6821 state.cpp:64] Recovering state from '/tmp/Endpoint_SlaveEndpointTest_UnauthorizedRequest_0_nKiP6Y/meta'
I0921 01:07:31.141170  6811 status_update_manager.cpp:203] Recovering status update manager
I0921 01:07:31.141414  6823 containerizer.cpp:648] Recovering containerizer
I0921 01:07:31.143378  6817 provisioner.cpp:416] Provisioner recovery complete
I0921 01:07:31.143939  6810 slave.cpp:6320] Finished recovery
I0921 01:07:31.144780  6810 slave.cpp:6502] Querying resource estimator for oversubscribable
resources
I0921 01:07:31.145277  6811 slave.cpp:6516] Received oversubscribable resources {} from the
resource estimator
I0921 01:07:31.148404  6828 process.cpp:3929] Handling HTTP event for process 'slave(809)'
with path: '/slave(809)/monitor/statistics'
I0921 01:07:31.149973  6826 http.cpp:1185] HTTP GET for /slave(809)/monitor/statistics from
172.17.0.8:49672
I0921 01:07:31.150048  6826 http.cpp:976] Authorizing principal 'test-principal' to GET the
'/monitor/statistics' endpoint
I0921 01:07:31.153278  6816 slave.cpp:867] Agent terminating
[       OK ] Endpoint/SlaveEndpointTest.UnauthorizedRequest/0 (35 ms)
[ RUN      ] Endpoint/SlaveEndpointTest.UnauthorizedRequest/1
I0921 01:07:31.168409  6786 containerizer.cpp:292] Using isolation { environment_secret, posix/cpu,
posix/mem, filesystem/posix, network/cni }
W0921 01:07:31.169003  6786 backend.cpp:76] Failed to create 'aufs' backend: AufsBackend requires
root privileges
W0921 01:07:31.169163  6786 backend.cpp:76] Failed to create 'bind' backend: BindBackend requires
root privileges
I0921 01:07:31.169215  6786 provisioner.cpp:255] Using default backend 'copy'
I0921 01:07:31.173657  6818 slave.cpp:252] Mesos agent started on (810)@172.17.0.8:37732
I0921 01:07:31.173692  6818 slave.cpp:253] Flags at startup: --acls="" --appc_simple_discovery_uri_prefix="http://"
--appc_store_dir="/tmp/Endpoint_SlaveEndpointTest_UnauthorizedRequest_1_QLR33K/store/appc"
--authenticate_http_readonly="true" --authenticate_http_readwrite="true" --authenticatee="crammd5"
--authentication_backoff_factor="1secs" --authorizer="local" --cgroups_cpu_enable_pids_and_tids_count="false"
--cgroups_enable_cfs="false" --cgroups_hierarchy="/sys/fs/cgroup" --cgroups_limit_swap="false"
--cgroups_root="mesos" --container_disk_watch_interval="15secs" --containerizers="mesos" --credential="/tmp/Endpoint_SlaveEndpointTest_UnauthorizedRequest_1_QLR33K/credential"
--default_role="*" --disallow_sharing_agent_pid_namespace="false" --disk_watch_interval="1mins"
--docker="docker" --docker_kill_orphans="true" --docker_registry="https://registry-1.docker.io"
--docker_remove_delay="6hrs" --docker_socket="/var/run/docker.sock" --docker_stop_timeout="0ns"
--docker_store_dir="/tmp/Endpoint_SlaveEndpointTest_UnauthorizedRequest_1_QLR33K/store/docker"
--docker_volume_checkpoint_dir="/var/run/mesos/isolators/docker/volume" --enforce_container_disk_quota="false"
--executor_registration_timeout="1mins" --executor_reregistration_timeout="2secs" --executor_shutdown_grace_period="5secs"
--fetcher_cache_dir="/tmp/Endpoint_SlaveEndpointTest_UnauthorizedRequest_1_QLR33K/fetch" --fetcher_cache_size="2GB"
--frameworks_home="" --gc_delay="1weeks" --gc_disk_headroom="0.1" --hadoop_home="" --help="false"
--hostname_lookup="true" --http_command_executor="false" --http_credentials="/tmp/Endpoint_SlaveEndpointTest_UnauthorizedRequest_1_QLR33K/http_credentials"
--http_heartbeat_interval="30secs" --initialize_driver_logging="true" --isolation="posix/cpu,posix/mem"
--launcher="posix" --launcher_dir="/mesos/mesos-1.5.0/_build/src" --logbufsecs="0" --logging_level="INFO"
--max_completed_executors_per_framework="150" --oversubscribed_resources_interval="15secs"
--perf_duration="10secs" --perf_interval="1mins" --port="5051" --qos_correction_interval_min="0ns"
--quiet="false" --recover="reconnect" --recovery_timeout="15mins" --registration_backoff_factor="10ms"
--resources="cpus:2;gpus:0;mem:1024;disk:1024;ports:[31000-32000]" --revocable_cpu_low_priority="true"
--runtime_dir="/tmp/Endpoint_SlaveEndpointTest_UnauthorizedRequest_1_QLR33K" --sandbox_directory="/mnt/mesos/sandbox"
--strict="true" --switch_user="true" --systemd_enable_support="true" --systemd_runtime_directory="/run/systemd/system"
--version="false" --work_dir="/tmp/Endpoint_SlaveEndpointTest_UnauthorizedRequest_1_0EpDrB"
--zk_session_timeout="10secs"
I0921 01:07:31.174058  6818 credentials.hpp:86] Loading credential for authentication from
'/tmp/Endpoint_SlaveEndpointTest_UnauthorizedRequest_1_QLR33K/credential'
I0921 01:07:31.174221  6818 slave.cpp:285] Agent using credential for: test-principal
I0921 01:07:31.174242  6818 credentials.hpp:37] Loading credentials for authentication from
'/tmp/Endpoint_SlaveEndpointTest_UnauthorizedRequest_1_QLR33K/http_credentials'
I0921 01:07:31.174482  6818 http.cpp:1045] Creating default 'basic' HTTP authenticator for
realm 'mesos-agent-readonly'
I0921 01:07:31.174640  6818 http.cpp:1045] Creating default 'basic' HTTP authenticator for
realm 'mesos-agent-readwrite'
I0921 01:07:31.176070  6818 slave.cpp:583] Agent resources: [{"name":"cpus","scalar":{"value":2.0},"type":"SCALAR"},{"name":"mem","scalar":{"value":1024.0},"type":"SCALAR"},{"name":"disk","scalar":{"value":1024.0},"type":"SCALAR"},{"name":"ports","ranges":{"range":[{"begin":31000,"end":32000}]},"type":"RANGES"}]
I0921 01:07:31.176303  6818 slave.cpp:591] Agent attributes: [  ]
I0921 01:07:31.176316  6818 slave.cpp:600] Agent hostname: 8402baff7bf9
I0921 01:07:31.176482  6806 status_update_manager.cpp:177] Pausing sending status updates
I0921 01:07:31.178169  6819 state.cpp:64] Recovering state from '/tmp/Endpoint_SlaveEndpointTest_UnauthorizedRequest_1_0EpDrB/meta'
I0921 01:07:31.178642  6819 status_update_manager.cpp:203] Recovering status update manager
I0921 01:07:31.178930  6822 containerizer.cpp:648] Recovering containerizer
I0921 01:07:31.180727  6824 provisioner.cpp:416] Provisioner recovery complete
I0921 01:07:31.181242  6823 slave.cpp:6320] Finished recovery
I0921 01:07:31.181711  6823 slave.cpp:6502] Querying resource estimator for oversubscribable
resources
I0921 01:07:31.181970  6810 slave.cpp:6516] Received oversubscribable resources {} from the
resource estimator
I0921 01:07:31.184665  6808 process.cpp:3929] Handling HTTP event for process 'slave(810)'
with path: '/slave(810)/monitor/statistics.json'
I0921 01:07:31.186214  6814 http.cpp:1185] HTTP GET for /slave(810)/monitor/statistics.json
from 172.17.0.8:49674
I0921 01:07:31.186314  6814 http.cpp:976] Authorizing principal 'test-principal' to GET the
'/monitor/statistics.json' endpoint
I0921 01:07:31.189188  6786 slave.cpp:867] Agent terminating
[       OK ] Endpoint/SlaveEndpointTest.UnauthorizedRequest/1 (35 ms)
[ RUN      ] Endpoint/SlaveEndpointTest.UnauthorizedRequest/2
I0921 01:07:31.206296  6786 containerizer.cpp:292] Using isolation { environment_secret, posix/cpu,
posix/mem, filesystem/posix, network/cni }
W0921 01:07:31.207103  6786 backend.cpp:76] Failed to create 'aufs' backend: AufsBackend requires
root privileges
W0921 01:07:31.207288  6786 backend.cpp:76] Failed to create 'bind' backend: BindBackend requires
root privileges
I0921 01:07:31.207350  6786 provisioner.cpp:255] Using default backend 'copy'
I0921 01:07:31.212637  6809 slave.cpp:252] Mesos agent started on (811)@172.17.0.8:37732
I0921 01:07:31.212671  6809 slave.cpp:253] Flags at startup: --acls="" --appc_simple_discovery_uri_prefix="http://"
--appc_store_dir="/tmp/Endpoint_SlaveEndpointTest_UnauthorizedRequest_2_oP73Pn/store/appc"
--authenticate_http_readonly="true" --authenticate_http_readwrite="true" --authenticatee="crammd5"
--authentication_backoff_factor="1secs" --authorizer="local" --cgroups_cpu_enable_pids_and_tids_count="false"
--cgroups_enable_cfs="false" --cgroups_hierarchy="/sys/fs/cgroup" --cgroups_limit_swap="false"
--cgroups_root="mesos" --container_disk_watch_interval="15secs" --containerizers="mesos" --credential="/tmp/Endpoint_SlaveEndpointTest_UnauthorizedRequest_2_oP73Pn/credential"
--default_role="*" --disallow_sharing_agent_pid_namespace="false" --disk_watch_interval="1mins"
--docker="docker" --docker_kill_orphans="true" --docker_registry="https://registry-1.docker.io"
--docker_remove_delay="6hrs" --docker_socket="/var/run/docker.sock" --docker_stop_timeout="0ns"
--docker_store_dir="/tmp/Endpoint_SlaveEndpointTest_UnauthorizedRequest_2_oP73Pn/store/docker"
--docker_volume_checkpoint_dir="/var/run/mesos/isolators/docker/volume" --enforce_container_disk_quota="false"
--executor_registration_timeout="1mins" --executor_reregistration_timeout="2secs" --executor_shutdown_grace_period="5secs"
--fetcher_cache_dir="/tmp/Endpoint_SlaveEndpointTest_UnauthorizedRequest_2_oP73Pn/fetch" --fetcher_cache_size="2GB"
--frameworks_home="" --gc_delay="1weeks" --gc_disk_headroom="0.1" --hadoop_home="" --help="false"
--hostname_lookup="true" --http_command_executor="false" --http_credentials="/tmp/Endpoint_SlaveEndpointTest_UnauthorizedRequest_2_oP73Pn/http_credentials"
--http_heartbeat_interval="30secs" --initialize_driver_logging="true" --isolation="posix/cpu,posix/mem"
--launcher="posix" --launcher_dir="/mesos/mesos-1.5.0/_build/src" --logbufsecs="0" --logging_level="INFO"
--max_completed_executors_per_framework="150" --oversubscribed_resources_interval="15secs"
--perf_duration="10secs" --perf_interval="1mins" --port="5051" --qos_correction_interval_min="0ns"
--quiet="false" --recover="reconnect" --recovery_timeout="15mins" --registration_backoff_factor="10ms"
--resources="cpus:2;gpus:0;mem:1024;disk:1024;ports:[31000-32000]" --revocable_cpu_low_priority="true"
--runtime_dir="/tmp/Endpoint_SlaveEndpointTest_UnauthorizedRequest_2_oP73Pn" --sandbox_directory="/mnt/mesos/sandbox"
--strict="true" --switch_user="true" --systemd_enable_support="true" --systemd_runtime_directory="/run/systemd/system"
--version="false" --work_dir="/tmp/Endpoint_SlaveEndpointTest_UnauthorizedRequest_2_clqb8d"
--zk_session_timeout="10secs"
I0921 01:07:31.213304  6809 credentials.hpp:86] Loading credential for authentication from
'/tmp/Endpoint_SlaveEndpointTest_UnauthorizedRequest_2_oP73Pn/credential'
I0921 01:07:31.213536  6809 slave.cpp:285] Agent using credential for: test-principal
I0921 01:07:31.213568  6809 credentials.hpp:37] Loading credentials for authentication from
'/tmp/Endpoint_SlaveEndpointTest_UnauthorizedRequest_2_oP73Pn/http_credentials'
I0921 01:07:31.213966  6809 http.cpp:1045] Creating default 'basic' HTTP authenticator for
realm 'mesos-agent-readonly'
I0921 01:07:31.214238  6809 http.cpp:1045] Creating default 'basic' HTTP authenticator for
realm 'mesos-agent-readwrite'
I0921 01:07:31.216446  6809 slave.cpp:583] Agent resources: [{"name":"cpus","scalar":{"value":2.0},"type":"SCALAR"},{"name":"mem","scalar":{"value":1024.0},"type":"SCALAR"},{"name":"disk","scalar":{"value":1024.0},"type":"SCALAR"},{"name":"ports","ranges":{"range":[{"begin":31000,"end":32000}]},"type":"RANGES"}]
I0921 01:07:31.216817  6809 slave.cpp:591] Agent attributes: [  ]
I0921 01:07:31.216841  6809 slave.cpp:600] Agent hostname: 8402baff7bf9
I0921 01:07:31.217140  6821 status_update_manager.cpp:177] Pausing sending status updates
I0921 01:07:31.219000  6814 state.cpp:64] Recovering state from '/tmp/Endpoint_SlaveEndpointTest_UnauthorizedRequest_2_clqb8d/meta'
I0921 01:07:31.219370  6818 status_update_manager.cpp:203] Recovering status update manager
I0921 01:07:31.219619  6818 containerizer.cpp:648] Recovering containerizer
I0921 01:07:31.221362  6817 provisioner.cpp:416] Provisioner recovery complete
I0921 01:07:31.221907  6807 slave.cpp:6320] Finished recovery
I0921 01:07:31.222414  6807 slave.cpp:6502] Querying resource estimator for oversubscribable
resources
I0921 01:07:31.222787  6824 slave.cpp:6516] Received oversubscribable resources {} from the
resource estimator
I0921 01:07:31.225239  6818 process.cpp:3929] Handling HTTP event for process 'slave(811)'
with path: '/slave(811)/containers'
I0921 01:07:31.226436  6812 http.cpp:1185] HTTP GET for /slave(811)/containers from 172.17.0.8:49676
I0921 01:07:31.226526  6812 http.cpp:976] Authorizing principal 'test-principal' to GET the
'/containers' endpoint
I0921 01:07:31.229425  6808 slave.cpp:867] Agent terminating
[       OK ] Endpoint/SlaveEndpointTest.UnauthorizedRequest/2 (38 ms)
[ RUN      ] Endpoint/SlaveEndpointTest.NoAuthorizer/0
I0921 01:07:31.242436  6786 containerizer.cpp:292] Using isolation { environment_secret, posix/cpu,
posix/mem, filesystem/posix, network/cni }
W0921 01:07:31.242959  6786 backend.cpp:76] Failed to create 'aufs' backend: AufsBackend requires
root privileges
W0921 01:07:31.243073  6786 backend.cpp:76] Failed to create 'bind' backend: BindBackend requires
root privileges
I0921 01:07:31.243108  6786 provisioner.cpp:255] Using default backend 'copy'
I0921 01:07:31.244892  6786 cluster.cpp:448] Creating default 'local' authorizer
I0921 01:07:31.247107  6823 slave.cpp:252] Mesos agent started on (812)@172.17.0.8:37732
I0921 01:07:31.247139  6823 slave.cpp:253] Flags at startup: --acls="" --appc_simple_discovery_uri_prefix="http://"
--appc_store_dir="/tmp/Endpoint_SlaveEndpointTest_NoAuthorizer_0_4AO9Y0/store/appc" --authenticate_http_readonly="true"
--authenticate_http_readwrite="true" --authenticatee="crammd5" --authentication_backoff_factor="1secs"
--authorizer="local" --cgroups_cpu_enable_pids_and_tids_count="false" --cgroups_enable_cfs="false"
--cgroups_hierarchy="/sys/fs/cgroup" --cgroups_limit_swap="false" --cgroups_root="mesos" --container_disk_watch_interval="15secs"
--containerizers="mesos" --credential="/tmp/Endpoint_SlaveEndpointTest_NoAuthorizer_0_4AO9Y0/credential"
--default_role="*" --disallow_sharing_agent_pid_namespace="false" --disk_watch_interval="1mins"
--docker="docker" --docker_kill_orphans="true" --docker_registry="https://registry-1.docker.io"
--docker_remove_delay="6hrs" --docker_socket="/var/run/docker.sock" --docker_stop_timeout="0ns"
--docker_store_dir="/tmp/Endpoint_SlaveEndpointTest_NoAuthorizer_0_4AO9Y0/store/docker" --docker_volume_checkpoint_dir="/var/run/mesos/isolators/docker/volume"
--enforce_container_disk_quota="false" --executor_registration_timeout="1mins" --executor_reregistration_timeout="2secs"
--executor_shutdown_grace_period="5secs" --fetcher_cache_dir="/tmp/Endpoint_SlaveEndpointTest_NoAuthorizer_0_4AO9Y0/fetch"
--fetcher_cache_size="2GB" --frameworks_home="" --gc_delay="1weeks" --gc_disk_headroom="0.1"
--hadoop_home="" --help="false" --hostname_lookup="true" --http_command_executor="false" --http_credentials="/tmp/Endpoint_SlaveEndpointTest_NoAuthorizer_0_4AO9Y0/http_credentials"
--http_heartbeat_interval="30secs" --initialize_driver_logging="true" --isolation="posix/cpu,posix/mem"
--launcher="posix" --launcher_dir="/mesos/mesos-1.5.0/_build/src" --logbufsecs="0" --logging_level="INFO"
--max_completed_executors_per_framework="150" --oversubscribed_resources_interval="15secs"
--perf_duration="10secs" --perf_interval="1mins" --port="5051" --qos_correction_interval_min="0ns"
--quiet="false" --recover="reconnect" --recovery_timeout="15mins" --registration_backoff_factor="10ms"
--resources="cpus:2;gpus:0;mem:1024;disk:1024;ports:[31000-32000]" --revocable_cpu_low_priority="true"
--runtime_dir="/tmp/Endpoint_SlaveEndpointTest_NoAuthorizer_0_4AO9Y0" --sandbox_directory="/mnt/mesos/sandbox"
--strict="true" --switch_user="true" --systemd_enable_support="true" --systemd_runtime_directory="/run/systemd/system"
--version="false" --work_dir="/tmp/Endpoint_SlaveEndpointTest_NoAuthorizer_0_W04EbR" --zk_session_timeout="10secs"
I0921 01:07:31.247566  6823 credentials.hpp:86] Loading credential for authentication from
'/tmp/Endpoint_SlaveEndpointTest_NoAuthorizer_0_4AO9Y0/credential'
I0921 01:07:31.247771  6823 slave.cpp:285] Agent using credential for: test-principal
I0921 01:07:31.247797  6823 credentials.hpp:37] Loading credentials for authentication from
'/tmp/Endpoint_SlaveEndpointTest_NoAuthorizer_0_4AO9Y0/http_credentials'
I0921 01:07:31.248064  6823 http.cpp:1045] Creating default 'basic' HTTP authenticator for
realm 'mesos-agent-readonly'
I0921 01:07:31.248247  6823 http.cpp:1045] Creating default 'basic' HTTP authenticator for
realm 'mesos-agent-readwrite'
I0921 01:07:31.249675  6823 slave.cpp:583] Agent resources: [{"name":"cpus","scalar":{"value":2.0},"type":"SCALAR"},{"name":"mem","scalar":{"value":1024.0},"type":"SCALAR"},{"name":"disk","scalar":{"value":1024.0},"type":"SCALAR"},{"name":"ports","ranges":{"range":[{"begin":31000,"end":32000}]},"type":"RANGES"}]
I0921 01:07:31.249914  6823 slave.cpp:591] Agent attributes: [  ]
I0921 01:07:31.249936  6823 slave.cpp:600] Agent hostname: 8402baff7bf9
I0921 01:07:31.250154  6811 status_update_manager.cpp:177] Pausing sending status updates
I0921 01:07:31.251662  6815 state.cpp:64] Recovering state from '/tmp/Endpoint_SlaveEndpointTest_NoAuthorizer_0_W04EbR/meta'
I0921 01:07:31.251921  6828 status_update_manager.cpp:203] Recovering status update manager
I0921 01:07:31.252220  6828 containerizer.cpp:648] Recovering containerizer
I0921 01:07:31.253844  6810 provisioner.cpp:416] Provisioner recovery complete
I0921 01:07:31.254302  6806 slave.cpp:6320] Finished recovery
I0921 01:07:31.254758  6806 slave.cpp:6502] Querying resource estimator for oversubscribable
resources
I0921 01:07:31.255022  6816 slave.cpp:6516] Received oversubscribable resources {} from the
resource estimator
I0921 01:07:31.257690  6821 process.cpp:3929] Handling HTTP event for process 'slave(812)'
with path: '/slave(812)/monitor/statistics'
I0921 01:07:31.259163  6826 http.cpp:1185] HTTP GET for /slave(812)/monitor/statistics from
172.17.0.8:49678
I0921 01:07:31.259270  6826 http.cpp:976] Authorizing principal 'test-principal' to GET the
'/monitor/statistics' endpoint
I0921 01:07:31.262817  6816 slave.cpp:867] Agent terminating
[       OK ] Endpoint/SlaveEndpointTest.NoAuthorizer/0 (32 ms)
[ RUN      ] Endpoint/SlaveEndpointTest.NoAuthorizer/1
I0921 01:07:31.276540  6786 containerizer.cpp:292] Using isolation { environment_secret, posix/cpu,
posix/mem, filesystem/posix, network/cni }
W0921 01:07:31.277122  6786 backend.cpp:76] Failed to create 'aufs' backend: AufsBackend requires
root privileges
W0921 01:07:31.277257  6786 backend.cpp:76] Failed to create 'bind' backend: BindBackend requires
root privileges
I0921 01:07:31.277295  6786 provisioner.cpp:255] Using default backend 'copy'
I0921 01:07:31.279448  6786 cluster.cpp:448] Creating default 'local' authorizer
I0921 01:07:31.282039  6819 slave.cpp:252] Mesos agent started on (813)@172.17.0.8:37732
I0921 01:07:31.282068  6819 slave.cpp:253] Flags at startup: --acls="" --appc_simple_discovery_uri_prefix="http://"
--appc_store_dir="/tmp/Endpoint_SlaveEndpointTest_NoAuthorizer_1_cerZrE/store/appc" --authenticate_http_readonly="true"
--authenticate_http_readwrite="true" --authenticatee="crammd5" --authentication_backoff_factor="1secs"
--authorizer="local" --cgroups_cpu_enable_pids_and_tids_count="false" --cgroups_enable_cfs="false"
--cgroups_hierarchy="/sys/fs/cgroup" --cgroups_limit_swap="false" --cgroups_root="mesos" --container_disk_watch_interval="15secs"
--containerizers="mesos" --credential="/tmp/Endpoint_SlaveEndpointTest_NoAuthorizer_1_cerZrE/credential"
--default_role="*" --disallow_sharing_agent_pid_namespace="false" --disk_watch_interval="1mins"
--docker="docker" --docker_kill_orphans="true" --docker_registry="https://registry-1.docker.io"
--docker_remove_delay="6hrs" --docker_socket="/var/run/docker.sock" --docker_stop_timeout="0ns"
--docker_store_dir="/tmp/Endpoint_SlaveEndpointTest_NoAuthorizer_1_cerZrE/store/docker" --docker_volume_checkpoint_dir="/var/run/mesos/isolators/docker/volume"
--enforce_container_disk_quota="false" --executor_registration_timeout="1mins" --executor_reregistration_timeout="2secs"
--executor_shutdown_grace_period="5secs" --fetcher_cache_dir="/tmp/Endpoint_SlaveEndpointTest_NoAuthorizer_1_cerZrE/fetch"
--fetcher_cache_size="2GB" --frameworks_home="" --gc_delay="1weeks" --gc_disk_headroom="0.1"
--hadoop_home="" --help="false" --hostname_lookup="true" --http_command_executor="false" --http_credentials="/tmp/Endpoint_SlaveEndpointTest_NoAuthorizer_1_cerZrE/http_credentials"
--http_heartbeat_interval="30secs" --initialize_driver_logging="true" --isolation="posix/cpu,posix/mem"
--launcher="posix" --launcher_dir="/mesos/mesos-1.5.0/_build/src" --logbufsecs="0" --logging_level="INFO"
--max_completed_executors_per_framework="150" --oversubscribed_resources_interval="15secs"
--perf_duration="10secs" --perf_interval="1mins" --port="5051" --qos_correction_interval_min="0ns"
--quiet="false" --recover="reconnect" --recovery_timeout="15mins" --registration_backoff_factor="10ms"
--resources="cpus:2;gpus:0;mem:1024;disk:1024;ports:[31000-32000]" --revocable_cpu_low_priority="true"
--runtime_dir="/tmp/Endpoint_SlaveEndpointTest_NoAuthorizer_1_cerZrE" --sandbox_directory="/mnt/mesos/sandbox"
--strict="true" --switch_user="true" --systemd_enable_support="true" --systemd_runtime_directory="/run/systemd/system"
--version="false" --work_dir="/tmp/Endpoint_SlaveEndpointTest_NoAuthorizer_1_6vMvzu" --zk_session_timeout="10secs"
I0921 01:07:31.282521  6819 credentials.hpp:86] Loading credential for authentication from
'/tmp/Endpoint_SlaveEndpointTest_NoAuthorizer_1_cerZrE/credential'
I0921 01:07:31.282685  6819 slave.cpp:285] Agent using credential for: test-principal
I0921 01:07:31.282718  6819 credentials.hpp:37] Loading credentials for authentication from
'/tmp/Endpoint_SlaveEndpointTest_NoAuthorizer_1_cerZrE/http_credentials'
I0921 01:07:31.283023  6819 http.cpp:1045] Creating default 'basic' HTTP authenticator for
realm 'mesos-agent-readonly'
I0921 01:07:31.283246  6819 http.cpp:1045] Creating default 'basic' HTTP authenticator for
realm 'mesos-agent-readwrite'
I0921 01:07:31.284888  6819 slave.cpp:583] Agent resources: [{"name":"cpus","scalar":{"value":2.0},"type":"SCALAR"},{"name":"mem","scalar":{"value":1024.0},"type":"SCALAR"},{"name":"disk","scalar":{"value":1024.0},"type":"SCALAR"},{"name":"ports","ranges":{"range":[{"begin":31000,"end":32000}]},"type":"RANGES"}]
I0921 01:07:31.285212  6819 slave.cpp:591] Agent attributes: [  ]
I0921 01:07:31.285229  6819 slave.cpp:600] Agent hostname: 8402baff7bf9
I0921 01:07:31.285449  6806 status_update_manager.cpp:177] Pausing sending status updates
I0921 01:07:31.286984  6826 state.cpp:64] Recovering state from '/tmp/Endpoint_SlaveEndpointTest_NoAuthorizer_1_6vMvzu/meta'
I0921 01:07:31.287345  6814 status_update_manager.cpp:203] Recovering status update manager
I0921 01:07:31.287600  6810 containerizer.cpp:648] Recovering containerizer
I0921 01:07:31.289307  6812 provisioner.cpp:416] Provisioner recovery complete
I0921 01:07:31.289752  6805 slave.cpp:6320] Finished recovery
I0921 01:07:31.290310  6805 slave.cpp:6502] Querying resource estimator for oversubscribable
resources
I0921 01:07:31.290607  6827 slave.cpp:6516] Received oversubscribable resources {} from the
resource estimator
I0921 01:07:31.292860  6808 process.cpp:3929] Handling HTTP event for process 'slave(813)'
with path: '/slave(813)/monitor/statistics.json'
I0921 01:07:31.294798  6822 http.cpp:1185] HTTP GET for /slave(813)/monitor/statistics.json
from 172.17.0.8:49680
I0921 01:07:31.294881  6822 http.cpp:976] Authorizing principal 'test-principal' to GET the
'/monitor/statistics.json' endpoint
I0921 01:07:31.298476  6810 slave.cpp:867] Agent terminating
[       OK ] Endpoint/SlaveEndpointTest.NoAuthorizer/1 (36 ms)
[ RUN      ] Endpoint/SlaveEndpointTest.NoAuthorizer/2
I0921 01:07:31.312628  6786 containerizer.cpp:292] Using isolation { environment_secret, posix/cpu,
posix/mem, filesystem/posix, network/cni }
W0921 01:07:31.313196  6786 backend.cpp:76] Failed to create 'aufs' backend: AufsBackend requires
root privileges
W0921 01:07:31.313310  6786 backend.cpp:76] Failed to create 'bind' backend: BindBackend requires
root privileges
I0921 01:07:31.313349  6786 provisioner.cpp:255] Using default backend 'copy'
I0921 01:07:31.315196  6786 cluster.cpp:448] Creating default 'local' authorizer
I0921 01:07:31.317287  6826 slave.cpp:252] Mesos agent started on (814)@172.17.0.8:37732
I0921 01:07:31.317314  6826 slave.cpp:253] Flags at startup: --acls="" --appc_simple_discovery_uri_prefix="http://"
--appc_store_dir="/tmp/Endpoint_SlaveEndpointTest_NoAuthorizer_2_qjHkgi/store/appc" --authenticate_http_readonly="true"
--authenticate_http_readwrite="true" --authenticatee="crammd5" --authentication_backoff_factor="1secs"
--authorizer="local" --cgroups_cpu_enable_pids_and_tids_count="false" --cgroups_enable_cfs="false"
--cgroups_hierarchy="/sys/fs/cgroup" --cgroups_limit_swap="false" --cgroups_root="mesos" --container_disk_watch_interval="15secs"
--containerizers="mesos" --credential="/tmp/Endpoint_SlaveEndpointTest_NoAuthorizer_2_qjHkgi/credential"
--default_role="*" --disallow_sharing_agent_pid_namespace="false" --disk_watch_interval="1mins"
--docker="docker" --docker_kill_orphans="true" --docker_registry="https://registry-1.docker.io"
--docker_remove_delay="6hrs" --docker_socket="/var/run/docker.sock" --docker_stop_timeout="0ns"
--docker_store_dir="/tmp/Endpoint_SlaveEndpointTest_NoAuthorizer_2_qjHkgi/store/docker" --docker_volume_checkpoint_dir="/var/run/mesos/isolators/docker/volume"
--enforce_container_disk_quota="false" --executor_registration_timeout="1mins" --executor_reregistration_timeout="2secs"
--executor_shutdown_grace_period="5secs" --fetcher_cache_dir="/tmp/Endpoint_SlaveEndpointTest_NoAuthorizer_2_qjHkgi/fetch"
--fetcher_cache_size="2GB" --frameworks_home="" --gc_delay="1weeks" --gc_disk_headroom="0.1"
--hadoop_home="" --help="false" --hostname_lookup="true" --http_command_executor="false" --http_credentials="/tmp/Endpoint_SlaveEndpointTest_NoAuthorizer_2_qjHkgi/http_credentials"
--http_heartbeat_interval="30secs" --initialize_driver_logging="true" --isolation="posix/cpu,posix/mem"
--launcher="posix" --launcher_dir="/mesos/mesos-1.5.0/_build/src" --logbufsecs="0" --logging_level="INFO"
--max_completed_executors_per_framework="150" --oversubscribed_resources_interval="15secs"
--perf_duration="10secs" --perf_interval="1mins" --port="5051" --qos_correction_interval_min="0ns"
--quiet="false" --recover="reconnect" --recovery_timeout="15mins" --registration_backoff_factor="10ms"
--resources="cpus:2;gpus:0;mem:1024;disk:1024;ports:[31000-32000]" --revocable_cpu_low_priority="true"
--runtime_dir="/tmp/Endpoint_SlaveEndpointTest_NoAuthorizer_2_qjHkgi" --sandbox_directory="/mnt/mesos/sandbox"
--strict="true" --switch_user="true" --systemd_enable_support="true" --systemd_runtime_directory="/run/systemd/system"
--version="false" --work_dir="/tmp/Endpoint_SlaveEndpointTest_NoAuthorizer_2_Asdsi8" --zk_session_timeout="10secs"
I0921 01:07:31.317723  6826 credentials.hpp:86] Loading credential for authentication from
'/tmp/Endpoint_SlaveEndpointTest_NoAuthorizer_2_qjHkgi/credential'
I0921 01:07:31.317894  6826 slave.cpp:285] Agent using credential for: test-principal
I0921 01:07:31.317917  6826 credentials.hpp:37] Loading credentials for authentication from
'/tmp/Endpoint_SlaveEndpointTest_NoAuthorizer_2_qjHkgi/http_credentials'
I0921 01:07:31.318297  6826 http.cpp:1045] Creating default 'basic' HTTP authenticator for
realm 'mesos-agent-readonly'
I0921 01:07:31.318569  6826 http.cpp:1045] Creating default 'basic' HTTP authenticator for
realm 'mesos-agent-readwrite'
I0921 01:07:31.320894  6826 slave.cpp:583] Agent resources: [{"name":"cpus","scalar":{"value":2.0},"type":"SCALAR"},{"name":"mem","scalar":{"value":1024.0},"type":"SCALAR"},{"name":"disk","scalar":{"value":1024.0},"type":"SCALAR"},{"name":"ports","ranges":{"range":[{"begin":31000,"end":32000}]},"type":"RANGES"}]
I0921 01:07:31.321290  6826 slave.cpp:591] Agent attributes: [  ]
I0921 01:07:31.321306  6826 slave.cpp:600] Agent hostname: 8402baff7bf9
I0921 01:07:31.321471  6806 status_update_manager.cpp:177] Pausing sending status updates
I0921 01:07:31.323086  6808 state.cpp:64] Recovering state from '/tmp/Endpoint_SlaveEndpointTest_NoAuthorizer_2_Asdsi8/meta'
I0921 01:07:31.323446  6828 status_update_manager.cpp:203] Recovering status update manager
I0921 01:07:31.323637  6824 containerizer.cpp:648] Recovering containerizer
I0921 01:07:31.325486  6823 provisioner.cpp:416] Provisioner recovery complete
I0921 01:07:31.325978  6818 slave.cpp:6320] Finished recovery
I0921 01:07:31.326421  6818 slave.cpp:6502] Querying resource estimator for oversubscribable
resources
I0921 01:07:31.326670  6822 slave.cpp:6516] Received oversubscribable resources {} from the
resource estimator
I0921 01:07:31.329838  6817 process.cpp:3929] Handling HTTP event for process 'slave(814)'
with path: '/slave(814)/containers'
I0921 01:07:31.331620  6816 http.cpp:1185] HTTP GET for /slave(814)/containers from 172.17.0.8:49682
I0921 01:07:31.331713  6816 http.cpp:976] Authorizing principal 'test-principal' to GET the
'/containers' endpoint
I0921 01:07:31.336086  6786 slave.cpp:867] Agent terminating
[       OK ] Endpoint/SlaveEndpointTest.NoAuthorizer/2 (38 ms)
[----------] 9 tests from Endpoint/SlaveEndpointTest (349 ms total)

[----------] 2 tests from ContainerizerType/DefaultContainerDNSFlagTest
[ RUN      ] ContainerizerType/DefaultContainerDNSFlagTest.ValidateFlag/0
[       OK ] ContainerizerType/DefaultContainerDNSFlagTest.ValidateFlag/0 (12 ms)
[ RUN      ] ContainerizerType/DefaultContainerDNSFlagTest.ValidateFlag/1
[       OK ] ContainerizerType/DefaultContainerDNSFlagTest.ValidateFlag/1 (11 ms)
[----------] 2 tests from ContainerizerType/DefaultContainerDNSFlagTest (23 ms total)

[----------] Global test environment tear-down
[==========] 1665 tests from 183 test cases ran. (635436 ms total)
[  PASSED  ] 1659 tests.
[  FAILED  ] 6 tests, listed below:
[  FAILED  ] DefaultExecutorCheckTest.CommandCheckDeliveredAndReconciled
[  FAILED  ] DefaultExecutorCheckTest.CommandCheckStatusChange
[  FAILED  ] DefaultExecutorCheckTest.CommandCheckSeesParentsEnv
[  FAILED  ] DefaultExecutorCheckTest.CommandCheckSharesWorkDirWithTask
[  FAILED  ] ExamplesTest.TestFramework
[  FAILED  ] MasterTest.IgnoreOldAgentReregistration

 6 FAILED TESTS
  YOU HAVE 20 DISABLED TESTS

I0921 01:07:31.434185  6829 process.cpp:1068] Failed to accept socket: future discarded
make[4]: *** [check-local] Error 1
make[4]: Leaving directory `/mesos/mesos-1.5.0/_build/src'
make[3]: *** [check-am] Error 2
make[3]: Leaving directory `/mesos/mesos-1.5.0/_build/src'
make[2]: *** [check] Error 2
make[2]: Leaving directory `/mesos/mesos-1.5.0/_build/src'
make[1]: *** [check-recursive] Error 1
make[1]: Leaving directory `/mesos/mesos-1.5.0/_build'
make: *** [distcheck] Error 1
+ docker rmi mesos-1505953311-18083
Untagged: mesos-1505953311-18083:latest
Deleted: sha256:34adac2e6ffb6d8469730580c2dfa930e628b6cd5c4209a6e0a04676c22ca004
Deleted: sha256:e9064bc07ff8eff301304f4af614cf3186d2edfb91373a88c1f77447ce516132
Deleted: sha256:1184140544139723446a3d1fcdaf78313cba9ceb93fbda45047d9059d51a85b4
Deleted: sha256:37cf328ecc529425978a73daa381b19e2514fb3cb8d4103bfa6147093fc79306
Deleted: sha256:a68a87386ee3ab76fd3ea80d64cd167932a0bb6db925ae4b8f51f7bb0aa75310
Deleted: sha256:99662fcba1576375fc4eb7c048430b8fcf0f6fba881fb4901fe0263e8348720e
Deleted: sha256:f7c9c1db44bcd0e0e0d327071a5a638b45ea6e007c65bb2968c59f20f785d077
Deleted: sha256:9501f24df1ae40ce28b4067178863d58890457a579706b953524db4414afa95b
Deleted: sha256:6bb725549001d9b633cd36e8bae4ed5e100117a7bd740ee578d451cc9ea2876d
Deleted: sha256:918fef512ccb9b94b4d474d61f1371b1ac04795f0c7a00533a367e7810d0c35f
Deleted: sha256:0fac29c170807160fa60f295d6ef48fe8a5c5ad6aa8f60c2e740243ff3a90127
Deleted: sha256:ba28468c8e087e4ec14d7f1a82a8e5b7a74878fdee0ee18ac6e7e09f3a6080fc
Deleted: sha256:1edb645d3985777c63c2d798bb7cecb4f161d11c093dc0cd9888b4b7cf69e99d
Deleted: sha256:a8d24b671ebbc4a15d938254c0991e503f50c87c442820df8aa489374b8c206c
Deleted: sha256:5e2ace136e7489f8bd9d5c6f81807d30c93a05955666e4eb84667f7cd541ff55
Deleted: sha256:debfc3f91357700ce80626c28fb7b24e02df6078573e46431236626aa23d32df
Deleted: sha256:8f6b5f897d8f314fa8759a6096ac43c62c5d67f90ce12af5f8be90e34f5e06b1
Deleted: sha256:4d4deaf02a67e9db30778bfa5025411906c14dfcaa0817f4404634928b17daf7
Deleted: sha256:c4ddba9f16954c4c54797b6fe89232d41f50107ca57368e9ffc822a29224d0a6
Deleted: sha256:a34adfaa5f14c8b685fff5bbbe40f578ddd399b3ac9fbeb18f81e9f86bcf5442
Deleted: sha256:c65a63d00e01b479d912feb28b1c06e0cdb68b08078ebc530e0a09e219bb1b52
Deleted: sha256:cd10433d65e41b173fa676eaf084b426917d9c915337a2d23484659ac2a148dd
Deleted: sha256:3bef840154ce8f34b1041f3099e095aa2e7199974344e6effac7aa10aaac0b87
Deleted: sha256:0090d85f8db49ebc538efa717c17faa290f2b74045e19d3eb292064d60c55c04
Deleted: sha256:5cce41d0dae60a11cdc709605d4077e3dbfef63333d4a4489e43a7691b84682f
Deleted: sha256:1da0fba95aec6037d15790a57c6f8810c1bd8ddbe5e90342aeea411b94e5c328
Deleted: sha256:1558337b834fb7fbe8013595fbb588480523da86f97a23fa9f265397c6bc5b2e
Deleted: sha256:5fc66c7e91962acc2a0904798ef2f399ae9ee8ce7a60846a3f80078fe3ea9bfd
Deleted: sha256:401ab132dda3b45b7ee1440cfdb72da5461d34877df20ab4712191874f84af3e
Build step 'Execute shell' marked build as failure
Not sending mail to unregistered user gregorywmann@gmail.com

Mime
View raw message