mesos-builds mailing list archives

Site index · List index
Message view « Date » · « Thread »
Top « Date » · « Thread »
From Apache Jenkins Server <jenk...@builds.apache.org>
Subject Build failed in Jenkins: Mesos-Buildbot » autotools,gcc,--verbose --enable-libevent --enable-ssl,GLOG_v=1 MESOS_VERBOSE=1,centos:7,(ubuntu)&&(!ubuntu-us1)&&(!ubuntu-eu2) #4187
Date Sat, 02 Sep 2017 04:22:16 GMT
See <https://builds.apache.org/job/Mesos-Buildbot/BUILDTOOL=autotools,COMPILER=gcc,CONFIGURATION=--verbose%20--enable-libevent%20--enable-ssl,ENVIRONMENT=GLOG_v=1%20MESOS_VERBOSE=1,OS=centos%3A7,label_exp=(ubuntu)&&(!ubuntu-us1)&&(!ubuntu-eu2)/4187/display/redirect?page=changes>

Changes:

[bmahler] Fixed an OOM due to a send loop for SSL sockets.

[bmahler] Added a test to reproduce the OOM issue in MESOS-7934.

[bmahler] Clarified some issues in the LibeventSSLSocket event_callback logic.

[bmahler] Added MESOS-7934 to the 1.2.3 CHANGELOG.

[bmahler] Added MESOS-7934 to the 1.3.2 CHANGELOG.

------------------------------------------
[...truncated 32.48 MB...]
I0902 04:22:01.337195  9660 provisioner.cpp:255] Using default backend 'copy'
I0902 04:22:01.340451 30869 slave.cpp:252] Mesos agent started on (814)@172.17.0.7:41112
I0902 04:22:01.340471 30869 slave.cpp:253] Flags at startup: --acls="" --appc_simple_discovery_uri_prefix="http://"
--appc_store_dir="/tmp/Endpoint_SlaveEndpointTest_UnauthorizedRequest_0_lnsVyp/store/appc"
--authenticate_http_executors="true" --authenticate_http_readonly="true" --authenticate_http_readwrite="true"
--authenticatee="crammd5" --authentication_backoff_factor="1secs" --authorizer="local" --cgroups_cpu_enable_pids_and_tids_count="false"
--cgroups_enable_cfs="false" --cgroups_hierarchy="/sys/fs/cgroup" --cgroups_limit_swap="false"
--cgroups_root="mesos" --container_disk_watch_interval="15secs" --containerizers="mesos" --credential="/tmp/Endpoint_SlaveEndpointTest_UnauthorizedRequest_0_lnsVyp/credential"
--default_role="*" --disallow_sharing_agent_pid_namespace="false" --disk_watch_interval="1mins"
--docker="docker" --docker_kill_orphans="true" --docker_registry="https://registry-1.docker.io"
--docker_remove_delay="6hrs" --docker_socket="/var/run/docker.sock" --docker_stop_timeout="0ns"
--docker_store_dir="/tmp/Endpoint_SlaveEndpointTest_UnauthorizedRequest_0_lnsVyp/store/docker"
--docker_volume_checkpoint_dir="/var/run/mesos/isolators/docker/volume" --enforce_container_disk_quota="false"
--executor_registration_timeout="1mins" --executor_reregistration_timeout="2secs" --executor_secret_key="/tmp/Endpoint_SlaveEndpointTest_UnauthorizedRequest_0_lnsVyp/executor_secret_key"
--executor_shutdown_grace_period="5secs" --fetcher_cache_dir="/tmp/Endpoint_SlaveEndpointTest_UnauthorizedRequest_0_lnsVyp/fetch"
--fetcher_cache_size="2GB" --frameworks_home="" --gc_delay="1weeks" --gc_disk_headroom="0.1"
--hadoop_home="" --help="false" --hostname_lookup="true" --http_command_executor="false" --http_credentials="/tmp/Endpoint_SlaveEndpointTest_UnauthorizedRequest_0_lnsVyp/http_credentials"
--http_heartbeat_interval="30secs" --initialize_driver_logging="true" --isolation="posix/cpu,posix/mem"
--launcher="posix" --launcher_dir="/mesos/mesos-1.5.0/_build/src" --logbufsecs="0" --logging_level="INFO"
--max_completed_executors_per_framework="150" --oversubscribed_resources_interval="15secs"
--perf_duration="10secs" --perf_interval="1mins" --port="5051" --qos_correction_interval_min="0ns"
--quiet="false" --recover="reconnect" --recovery_timeout="15mins" --registration_backoff_factor="10ms"
--resources="cpus:2;gpus:0;mem:1024;disk:1024;ports:[31000-32000]" --revocable_cpu_low_priority="true"
--runtime_dir="/tmp/Endpoint_SlaveEndpointTest_UnauthorizedRequest_0_lnsVyp" --sandbox_directory="/mnt/mesos/sandbox"
--strict="true" --switch_user="true" --systemd_enable_support="true" --systemd_runtime_directory="/run/systemd/system"
--version="false" --work_dir="/tmp/Endpoint_SlaveEndpointTest_UnauthorizedRequest_0_5k6ixN"
--zk_session_timeout="10secs"
I0902 04:22:01.340884 30869 credentials.hpp:86] Loading credential for authentication from
'/tmp/Endpoint_SlaveEndpointTest_UnauthorizedRequest_0_lnsVyp/credential'
I0902 04:22:01.341040 30869 slave.cpp:285] Agent using credential for: test-principal
I0902 04:22:01.341061 30869 credentials.hpp:37] Loading credentials for authentication from
'/tmp/Endpoint_SlaveEndpointTest_UnauthorizedRequest_0_lnsVyp/http_credentials'
I0902 04:22:01.341343 30869 http.cpp:1045] Creating default 'basic' HTTP authenticator for
realm 'mesos-agent-executor'
I0902 04:22:01.341471 30869 http.cpp:1066] Creating default 'jwt' HTTP authenticator for realm
'mesos-agent-executor'
I0902 04:22:01.341670 30869 http.cpp:1045] Creating default 'basic' HTTP authenticator for
realm 'mesos-agent-readonly'
I0902 04:22:01.341759 30869 http.cpp:1066] Creating default 'jwt' HTTP authenticator for realm
'mesos-agent-readonly'
I0902 04:22:01.341917 30869 http.cpp:1045] Creating default 'basic' HTTP authenticator for
realm 'mesos-agent-readwrite'
I0902 04:22:01.342006 30869 http.cpp:1066] Creating default 'jwt' HTTP authenticator for realm
'mesos-agent-readwrite'
I0902 04:22:01.343366 30869 slave.cpp:581] Agent resources: [{"name":"cpus","scalar":{"value":2.0},"type":"SCALAR"},{"name":"mem","scalar":{"value":1024.0},"type":"SCALAR"},{"name":"disk","scalar":{"value":1024.0},"type":"SCALAR"},{"name":"ports","ranges":{"range":[{"begin":31000,"end":32000}]},"type":"RANGES"}]
I0902 04:22:01.343582 30869 slave.cpp:589] Agent attributes: [  ]
I0902 04:22:01.343596 30869 slave.cpp:598] Agent hostname: b299825ee94a
I0902 04:22:01.343715 30859 status_update_manager.cpp:177] Pausing sending status updates
I0902 04:22:01.345300 30852 state.cpp:64] Recovering state from '/tmp/Endpoint_SlaveEndpointTest_UnauthorizedRequest_0_5k6ixN/meta'
I0902 04:22:01.345582 30860 status_update_manager.cpp:203] Recovering status update manager
I0902 04:22:01.345805 30853 containerizer.cpp:646] Recovering containerizer
I0902 04:22:01.347170 30851 provisioner.cpp:416] Provisioner recovery complete
I0902 04:22:01.347455 30857 slave.cpp:6296] Finished recovery
I0902 04:22:01.347903 30857 slave.cpp:6478] Querying resource estimator for oversubscribable
resources
I0902 04:22:01.348151 30856 slave.cpp:6492] Received oversubscribable resources {} from the
resource estimator
I0902 04:22:01.350471 30858 process.cpp:3956] Handling HTTP event for process 'slave(814)'
with path: '/slave(814)/monitor/statistics'
I0902 04:22:01.352154 30860 http.cpp:1185] HTTP GET for /slave(814)/monitor/statistics from
172.17.0.7:48576
I0902 04:22:01.352239 30860 http.cpp:976] Authorizing principal 'test-principal' to GET the
'/monitor/statistics' endpoint
I0902 04:22:01.353899 30862 slave.cpp:859] Agent terminating
[       OK ] Endpoint/SlaveEndpointTest.UnauthorizedRequest/0 (27 ms)
[ RUN      ] Endpoint/SlaveEndpointTest.UnauthorizedRequest/1
I0902 04:22:01.364044  9660 containerizer.cpp:290] Using isolation { environment_secret, posix/cpu,
posix/mem, filesystem/posix, network/cni }
W0902 04:22:01.364511  9660 backend.cpp:76] Failed to create 'aufs' backend: AufsBackend requires
root privileges
W0902 04:22:01.364615  9660 backend.cpp:76] Failed to create 'bind' backend: BindBackend requires
root privileges
I0902 04:22:01.364646  9660 provisioner.cpp:255] Using default backend 'copy'
I0902 04:22:01.367910 30862 slave.cpp:252] Mesos agent started on (815)@172.17.0.7:41112
I0902 04:22:01.367952 30862 slave.cpp:253] Flags at startup: --acls="" --appc_simple_discovery_uri_prefix="http://"
--appc_store_dir="/tmp/Endpoint_SlaveEndpointTest_UnauthorizedRequest_1_kUQrTR/store/appc"
--authenticate_http_executors="true" --authenticate_http_readonly="true" --authenticate_http_readwrite="true"
--authenticatee="crammd5" --authentication_backoff_factor="1secs" --authorizer="local" --cgroups_cpu_enable_pids_and_tids_count="false"
--cgroups_enable_cfs="false" --cgroups_hierarchy="/sys/fs/cgroup" --cgroups_limit_swap="false"
--cgroups_root="mesos" --container_disk_watch_interval="15secs" --containerizers="mesos" --credential="/tmp/Endpoint_SlaveEndpointTest_UnauthorizedRequest_1_kUQrTR/credential"
--default_role="*" --disallow_sharing_agent_pid_namespace="false" --disk_watch_interval="1mins"
--docker="docker" --docker_kill_orphans="true" --docker_registry="https://registry-1.docker.io"
--docker_remove_delay="6hrs" --docker_socket="/var/run/docker.sock" --docker_stop_timeout="0ns"
--docker_store_dir="/tmp/Endpoint_SlaveEndpointTest_UnauthorizedRequest_1_kUQrTR/store/docker"
--docker_volume_checkpoint_dir="/var/run/mesos/isolators/docker/volume" --enforce_container_disk_quota="false"
--executor_registration_timeout="1mins" --executor_reregistration_timeout="2secs" --executor_secret_key="/tmp/Endpoint_SlaveEndpointTest_UnauthorizedRequest_1_kUQrTR/executor_secret_key"
--executor_shutdown_grace_period="5secs" --fetcher_cache_dir="/tmp/Endpoint_SlaveEndpointTest_UnauthorizedRequest_1_kUQrTR/fetch"
--fetcher_cache_size="2GB" --frameworks_home="" --gc_delay="1weeks" --gc_disk_headroom="0.1"
--hadoop_home="" --help="false" --hostname_lookup="true" --http_command_executor="false" --http_credentials="/tmp/Endpoint_SlaveEndpointTest_UnauthorizedRequest_1_kUQrTR/http_credentials"
--http_heartbeat_interval="30secs" --initialize_driver_logging="true" --isolation="posix/cpu,posix/mem"
--launcher="posix" --launcher_dir="/mesos/mesos-1.5.0/_build/src" --logbufsecs="0" --logging_level="INFO"
--max_completed_executors_per_framework="150" --oversubscribed_resources_interval="15secs"
--perf_duration="10secs" --perf_interval="1mins" --port="5051" --qos_correction_interval_min="0ns"
--quiet="false" --recover="reconnect" --recovery_timeout="15mins" --registration_backoff_factor="10ms"
--resources="cpus:2;gpus:0;mem:1024;disk:1024;ports:[31000-32000]" --revocable_cpu_low_priority="true"
--runtime_dir="/tmp/Endpoint_SlaveEndpointTest_UnauthorizedRequest_1_kUQrTR" --sandbox_directory="/mnt/mesos/sandbox"
--strict="true" --switch_user="true" --systemd_enable_support="true" --systemd_runtime_directory="/run/systemd/system"
--version="false" --work_dir="/tmp/Endpoint_SlaveEndpointTest_UnauthorizedRequest_1_FobJNf"
--zk_session_timeout="10secs"
I0902 04:22:01.368454 30862 credentials.hpp:86] Loading credential for authentication from
'/tmp/Endpoint_SlaveEndpointTest_UnauthorizedRequest_1_kUQrTR/credential'
I0902 04:22:01.368674 30862 slave.cpp:285] Agent using credential for: test-principal
I0902 04:22:01.368695 30862 credentials.hpp:37] Loading credentials for authentication from
'/tmp/Endpoint_SlaveEndpointTest_UnauthorizedRequest_1_kUQrTR/http_credentials'
I0902 04:22:01.368984 30862 http.cpp:1045] Creating default 'basic' HTTP authenticator for
realm 'mesos-agent-executor'
I0902 04:22:01.369201 30862 http.cpp:1066] Creating default 'jwt' HTTP authenticator for realm
'mesos-agent-executor'
I0902 04:22:01.369434 30862 http.cpp:1045] Creating default 'basic' HTTP authenticator for
realm 'mesos-agent-readonly'
I0902 04:22:01.369532 30862 http.cpp:1066] Creating default 'jwt' HTTP authenticator for realm
'mesos-agent-readonly'
I0902 04:22:01.369714 30862 http.cpp:1045] Creating default 'basic' HTTP authenticator for
realm 'mesos-agent-readwrite'
I0902 04:22:01.369809 30862 http.cpp:1066] Creating default 'jwt' HTTP authenticator for realm
'mesos-agent-readwrite'
I0902 04:22:01.371191 30862 slave.cpp:581] Agent resources: [{"name":"cpus","scalar":{"value":2.0},"type":"SCALAR"},{"name":"mem","scalar":{"value":1024.0},"type":"SCALAR"},{"name":"disk","scalar":{"value":1024.0},"type":"SCALAR"},{"name":"ports","ranges":{"range":[{"begin":31000,"end":32000}]},"type":"RANGES"}]
I0902 04:22:01.371433 30862 slave.cpp:589] Agent attributes: [  ]
I0902 04:22:01.371448 30862 slave.cpp:598] Agent hostname: b299825ee94a
I0902 04:22:01.371608 30870 status_update_manager.cpp:177] Pausing sending status updates
I0902 04:22:01.373122 30855 state.cpp:64] Recovering state from '/tmp/Endpoint_SlaveEndpointTest_UnauthorizedRequest_1_FobJNf/meta'
I0902 04:22:01.373399 30865 status_update_manager.cpp:203] Recovering status update manager
I0902 04:22:01.373580 30871 containerizer.cpp:646] Recovering containerizer
I0902 04:22:01.374948 30854 provisioner.cpp:416] Provisioner recovery complete
I0902 04:22:01.375250 30861 slave.cpp:6296] Finished recovery
I0902 04:22:01.375689 30861 slave.cpp:6478] Querying resource estimator for oversubscribable
resources
I0902 04:22:01.375963 30852 slave.cpp:6492] Received oversubscribable resources {} from the
resource estimator
I0902 04:22:01.378340 30870 process.cpp:3956] Handling HTTP event for process 'slave(815)'
with path: '/slave(815)/monitor/statistics.json'
I0902 04:22:01.380120 30853 http.cpp:1185] HTTP GET for /slave(815)/monitor/statistics.json
from 172.17.0.7:48578
I0902 04:22:01.380205 30853 http.cpp:976] Authorizing principal 'test-principal' to GET the
'/monitor/statistics.json' endpoint
I0902 04:22:01.381868  9660 slave.cpp:859] Agent terminating
[       OK ] Endpoint/SlaveEndpointTest.UnauthorizedRequest/1 (28 ms)
[ RUN      ] Endpoint/SlaveEndpointTest.UnauthorizedRequest/2
I0902 04:22:01.392922  9660 containerizer.cpp:290] Using isolation { environment_secret, posix/cpu,
posix/mem, filesystem/posix, network/cni }
W0902 04:22:01.393412  9660 backend.cpp:76] Failed to create 'aufs' backend: AufsBackend requires
root privileges
W0902 04:22:01.393524  9660 backend.cpp:76] Failed to create 'bind' backend: BindBackend requires
root privileges
I0902 04:22:01.393558  9660 provisioner.cpp:255] Using default backend 'copy'
I0902 04:22:01.396857 30865 slave.cpp:252] Mesos agent started on (816)@172.17.0.7:41112
I0902 04:22:01.396880 30865 slave.cpp:253] Flags at startup: --acls="" --appc_simple_discovery_uri_prefix="http://"
--appc_store_dir="/tmp/Endpoint_SlaveEndpointTest_UnauthorizedRequest_2_aOoZuk/store/appc"
--authenticate_http_executors="true" --authenticate_http_readonly="true" --authenticate_http_readwrite="true"
--authenticatee="crammd5" --authentication_backoff_factor="1secs" --authorizer="local" --cgroups_cpu_enable_pids_and_tids_count="false"
--cgroups_enable_cfs="false" --cgroups_hierarchy="/sys/fs/cgroup" --cgroups_limit_swap="false"
--cgroups_root="mesos" --container_disk_watch_interval="15secs" --containerizers="mesos" --credential="/tmp/Endpoint_SlaveEndpointTest_UnauthorizedRequest_2_aOoZuk/credential"
--default_role="*" --disallow_sharing_agent_pid_namespace="false" --disk_watch_interval="1mins"
--docker="docker" --docker_kill_orphans="true" --docker_registry="https://registry-1.docker.io"
--docker_remove_delay="6hrs" --docker_socket="/var/run/docker.sock" --docker_stop_timeout="0ns"
--docker_store_dir="/tmp/Endpoint_SlaveEndpointTest_UnauthorizedRequest_2_aOoZuk/store/docker"
--docker_volume_checkpoint_dir="/var/run/mesos/isolators/docker/volume" --enforce_container_disk_quota="false"
--executor_registration_timeout="1mins" --executor_reregistration_timeout="2secs" --executor_secret_key="/tmp/Endpoint_SlaveEndpointTest_UnauthorizedRequest_2_aOoZuk/executor_secret_key"
--executor_shutdown_grace_period="5secs" --fetcher_cache_dir="/tmp/Endpoint_SlaveEndpointTest_UnauthorizedRequest_2_aOoZuk/fetch"
--fetcher_cache_size="2GB" --frameworks_home="" --gc_delay="1weeks" --gc_disk_headroom="0.1"
--hadoop_home="" --help="false" --hostname_lookup="true" --http_command_executor="false" --http_credentials="/tmp/Endpoint_SlaveEndpointTest_UnauthorizedRequest_2_aOoZuk/http_credentials"
--http_heartbeat_interval="30secs" --initialize_driver_logging="true" --isolation="posix/cpu,posix/mem"
--launcher="posix" --launcher_dir="/mesos/mesos-1.5.0/_build/src" --logbufsecs="0" --logging_level="INFO"
--max_completed_executors_per_framework="150" --oversubscribed_resources_interval="15secs"
--perf_duration="10secs" --perf_interval="1mins" --port="5051" --qos_correction_interval_min="0ns"
--quiet="false" --recover="reconnect" --recovery_timeout="15mins" --registration_backoff_factor="10ms"
--resources="cpus:2;gpus:0;mem:1024;disk:1024;ports:[31000-32000]" --revocable_cpu_low_priority="true"
--runtime_dir="/tmp/Endpoint_SlaveEndpointTest_UnauthorizedRequest_2_aOoZuk" --sandbox_directory="/mnt/mesos/sandbox"
--strict="true" --switch_user="true" --systemd_enable_support="true" --systemd_runtime_directory="/run/systemd/system"
--version="false" --work_dir="/tmp/Endpoint_SlaveEndpointTest_UnauthorizedRequest_2_yK5XkI"
--zk_session_timeout="10secs"
I0902 04:22:01.397284 30865 credentials.hpp:86] Loading credential for authentication from
'/tmp/Endpoint_SlaveEndpointTest_UnauthorizedRequest_2_aOoZuk/credential'
I0902 04:22:01.397441 30865 slave.cpp:285] Agent using credential for: test-principal
I0902 04:22:01.397462 30865 credentials.hpp:37] Loading credentials for authentication from
'/tmp/Endpoint_SlaveEndpointTest_UnauthorizedRequest_2_aOoZuk/http_credentials'
I0902 04:22:01.397732 30865 http.cpp:1045] Creating default 'basic' HTTP authenticator for
realm 'mesos-agent-executor'
I0902 04:22:01.397862 30865 http.cpp:1066] Creating default 'jwt' HTTP authenticator for realm
'mesos-agent-executor'
I0902 04:22:01.398066 30865 http.cpp:1045] Creating default 'basic' HTTP authenticator for
realm 'mesos-agent-readonly'
I0902 04:22:01.398155 30865 http.cpp:1066] Creating default 'jwt' HTTP authenticator for realm
'mesos-agent-readonly'
I0902 04:22:01.398339 30865 http.cpp:1045] Creating default 'basic' HTTP authenticator for
realm 'mesos-agent-readwrite'
I0902 04:22:01.398428 30865 http.cpp:1066] Creating default 'jwt' HTTP authenticator for realm
'mesos-agent-readwrite'
I0902 04:22:01.399780 30865 slave.cpp:581] Agent resources: [{"name":"cpus","scalar":{"value":2.0},"type":"SCALAR"},{"name":"mem","scalar":{"value":1024.0},"type":"SCALAR"},{"name":"disk","scalar":{"value":1024.0},"type":"SCALAR"},{"name":"ports","ranges":{"range":[{"begin":31000,"end":32000}]},"type":"RANGES"}]
I0902 04:22:01.399997 30865 slave.cpp:589] Agent attributes: [  ]
I0902 04:22:01.400012 30865 slave.cpp:598] Agent hostname: b299825ee94a
I0902 04:22:01.400172 30855 status_update_manager.cpp:177] Pausing sending status updates
I0902 04:22:01.401809 30850 state.cpp:64] Recovering state from '/tmp/Endpoint_SlaveEndpointTest_UnauthorizedRequest_2_yK5XkI/meta'
I0902 04:22:01.402173 30861 status_update_manager.cpp:203] Recovering status update manager
I0902 04:22:01.402396 30871 containerizer.cpp:646] Recovering containerizer
I0902 04:22:01.403652 30869 provisioner.cpp:416] Provisioner recovery complete
I0902 04:22:01.403944 30852 slave.cpp:6296] Finished recovery
I0902 04:22:01.404408 30852 slave.cpp:6478] Querying resource estimator for oversubscribable
resources
I0902 04:22:01.404654 30857 slave.cpp:6492] Received oversubscribable resources {} from the
resource estimator
I0902 04:22:01.407073 30851 process.cpp:3956] Handling HTTP event for process 'slave(816)'
with path: '/slave(816)/containers'
I0902 04:22:01.408807 30872 http.cpp:1185] HTTP GET for /slave(816)/containers from 172.17.0.7:48584
I0902 04:22:01.408910 30872 http.cpp:976] Authorizing principal 'test-principal' to GET the
'/containers' endpoint
I0902 04:22:01.410681 30859 slave.cpp:859] Agent terminating
[       OK ] Endpoint/SlaveEndpointTest.UnauthorizedRequest/2 (28 ms)
[ RUN      ] Endpoint/SlaveEndpointTest.NoAuthorizer/0
I0902 04:22:01.421990  9660 containerizer.cpp:290] Using isolation { environment_secret, posix/cpu,
posix/mem, filesystem/posix, network/cni }
W0902 04:22:01.422581  9660 backend.cpp:76] Failed to create 'aufs' backend: AufsBackend requires
root privileges
W0902 04:22:01.422719  9660 backend.cpp:76] Failed to create 'bind' backend: BindBackend requires
root privileges
I0902 04:22:01.422754  9660 provisioner.cpp:255] Using default backend 'copy'
I0902 04:22:01.424685  9660 cluster.cpp:448] Creating default 'local' authorizer
I0902 04:22:01.426594 30857 slave.cpp:252] Mesos agent started on (817)@172.17.0.7:41112
I0902 04:22:01.426616 30857 slave.cpp:253] Flags at startup: --acls="" --appc_simple_discovery_uri_prefix="http://"
--appc_store_dir="/tmp/Endpoint_SlaveEndpointTest_NoAuthorizer_0_oCcBnN/store/appc" --authenticate_http_executors="true"
--authenticate_http_readonly="true" --authenticate_http_readwrite="true" --authenticatee="crammd5"
--authentication_backoff_factor="1secs" --authorizer="local" --cgroups_cpu_enable_pids_and_tids_count="false"
--cgroups_enable_cfs="false" --cgroups_hierarchy="/sys/fs/cgroup" --cgroups_limit_swap="false"
--cgroups_root="mesos" --container_disk_watch_interval="15secs" --containerizers="mesos" --credential="/tmp/Endpoint_SlaveEndpointTest_NoAuthorizer_0_oCcBnN/credential"
--default_role="*" --disallow_sharing_agent_pid_namespace="false" --disk_watch_interval="1mins"
--docker="docker" --docker_kill_orphans="true" --docker_registry="https://registry-1.docker.io"
--docker_remove_delay="6hrs" --docker_socket="/var/run/docker.sock" --docker_stop_timeout="0ns"
--docker_store_dir="/tmp/Endpoint_SlaveEndpointTest_NoAuthorizer_0_oCcBnN/store/docker" --docker_volume_checkpoint_dir="/var/run/mesos/isolators/docker/volume"
--enforce_container_disk_quota="false" --executor_registration_timeout="1mins" --executor_reregistration_timeout="2secs"
--executor_secret_key="/tmp/Endpoint_SlaveEndpointTest_NoAuthorizer_0_oCcBnN/executor_secret_key"
--executor_shutdown_grace_period="5secs" --fetcher_cache_dir="/tmp/Endpoint_SlaveEndpointTest_NoAuthorizer_0_oCcBnN/fetch"
--fetcher_cache_size="2GB" --frameworks_home="" --gc_delay="1weeks" --gc_disk_headroom="0.1"
--hadoop_home="" --help="false" --hostname_lookup="true" --http_command_executor="false" --http_credentials="/tmp/Endpoint_SlaveEndpointTest_NoAuthorizer_0_oCcBnN/http_credentials"
--http_heartbeat_interval="30secs" --initialize_driver_logging="true" --isolation="posix/cpu,posix/mem"
--launcher="posix" --launcher_dir="/mesos/mesos-1.5.0/_build/src" --logbufsecs="0" --logging_level="INFO"
--max_completed_executors_per_framework="150" --oversubscribed_resources_interval="15secs"
--perf_duration="10secs" --perf_interval="1mins" --port="5051" --qos_correction_interval_min="0ns"
--quiet="false" --recover="reconnect" --recovery_timeout="15mins" --registration_backoff_factor="10ms"
--resources="cpus:2;gpus:0;mem:1024;disk:1024;ports:[31000-32000]" --revocable_cpu_low_priority="true"
--runtime_dir="/tmp/Endpoint_SlaveEndpointTest_NoAuthorizer_0_oCcBnN" --sandbox_directory="/mnt/mesos/sandbox"
--strict="true" --switch_user="true" --systemd_enable_support="true" --systemd_runtime_directory="/run/systemd/system"
--version="false" --work_dir="/tmp/Endpoint_SlaveEndpointTest_NoAuthorizer_0_EJSj9a" --zk_session_timeout="10secs"
I0902 04:22:01.426978 30857 credentials.hpp:86] Loading credential for authentication from
'/tmp/Endpoint_SlaveEndpointTest_NoAuthorizer_0_oCcBnN/credential'
I0902 04:22:01.427135 30857 slave.cpp:285] Agent using credential for: test-principal
I0902 04:22:01.427160 30857 credentials.hpp:37] Loading credentials for authentication from
'/tmp/Endpoint_SlaveEndpointTest_NoAuthorizer_0_oCcBnN/http_credentials'
I0902 04:22:01.427417 30857 http.cpp:1045] Creating default 'basic' HTTP authenticator for
realm 'mesos-agent-executor'
I0902 04:22:01.427536 30857 http.cpp:1066] Creating default 'jwt' HTTP authenticator for realm
'mesos-agent-executor'
I0902 04:22:01.427724 30857 http.cpp:1045] Creating default 'basic' HTTP authenticator for
realm 'mesos-agent-readonly'
I0902 04:22:01.427819 30857 http.cpp:1066] Creating default 'jwt' HTTP authenticator for realm
'mesos-agent-readonly'
I0902 04:22:01.427984 30857 http.cpp:1045] Creating default 'basic' HTTP authenticator for
realm 'mesos-agent-readwrite'
I0902 04:22:01.428076 30857 http.cpp:1066] Creating default 'jwt' HTTP authenticator for realm
'mesos-agent-readwrite'
I0902 04:22:01.429337 30857 slave.cpp:581] Agent resources: [{"name":"cpus","scalar":{"value":2.0},"type":"SCALAR"},{"name":"mem","scalar":{"value":1024.0},"type":"SCALAR"},{"name":"disk","scalar":{"value":1024.0},"type":"SCALAR"},{"name":"ports","ranges":{"range":[{"begin":31000,"end":32000}]},"type":"RANGES"}]
I0902 04:22:01.429549 30857 slave.cpp:589] Agent attributes: [  ]
I0902 04:22:01.429567 30857 slave.cpp:598] Agent hostname: b299825ee94a
I0902 04:22:01.429688 30865 status_update_manager.cpp:177] Pausing sending status updates
I0902 04:22:01.431074 30868 state.cpp:64] Recovering state from '/tmp/Endpoint_SlaveEndpointTest_NoAuthorizer_0_EJSj9a/meta'
I0902 04:22:01.431414 30859 status_update_manager.cpp:203] Recovering status update manager
I0902 04:22:01.431637 30870 containerizer.cpp:646] Recovering containerizer
I0902 04:22:01.432904 30853 provisioner.cpp:416] Provisioner recovery complete
I0902 04:22:01.433171 30857 slave.cpp:6296] Finished recovery
I0902 04:22:01.433532 30857 slave.cpp:6478] Querying resource estimator for oversubscribable
resources
I0902 04:22:01.433851 30862 slave.cpp:6492] Received oversubscribable resources {} from the
resource estimator
I0902 04:22:01.436060 30866 process.cpp:3956] Handling HTTP event for process 'slave(817)'
with path: '/slave(817)/monitor/statistics'
I0902 04:22:01.437649 30867 http.cpp:1185] HTTP GET for /slave(817)/monitor/statistics from
172.17.0.7:48586
I0902 04:22:01.437748 30867 http.cpp:976] Authorizing principal 'test-principal' to GET the
'/monitor/statistics' endpoint
I0902 04:22:01.440356 30850 slave.cpp:859] Agent terminating
[       OK ] Endpoint/SlaveEndpointTest.NoAuthorizer/0 (30 ms)
[ RUN      ] Endpoint/SlaveEndpointTest.NoAuthorizer/1
I0902 04:22:01.452059  9660 containerizer.cpp:290] Using isolation { environment_secret, posix/cpu,
posix/mem, filesystem/posix, network/cni }
W0902 04:22:01.452616  9660 backend.cpp:76] Failed to create 'aufs' backend: AufsBackend requires
root privileges
W0902 04:22:01.452744  9660 backend.cpp:76] Failed to create 'bind' backend: BindBackend requires
root privileges
I0902 04:22:01.452783  9660 provisioner.cpp:255] Using default backend 'copy'
I0902 04:22:01.454609  9660 cluster.cpp:448] Creating default 'local' authorizer
I0902 04:22:01.456552 30865 slave.cpp:252] Mesos agent started on (818)@172.17.0.7:41112
I0902 04:22:01.456576 30865 slave.cpp:253] Flags at startup: --acls="" --appc_simple_discovery_uri_prefix="http://"
--appc_store_dir="/tmp/Endpoint_SlaveEndpointTest_NoAuthorizer_1_hIbUxg/store/appc" --authenticate_http_executors="true"
--authenticate_http_readonly="true" --authenticate_http_readwrite="true" --authenticatee="crammd5"
--authentication_backoff_factor="1secs" --authorizer="local" --cgroups_cpu_enable_pids_and_tids_count="false"
--cgroups_enable_cfs="false" --cgroups_hierarchy="/sys/fs/cgroup" --cgroups_limit_swap="false"
--cgroups_root="mesos" --container_disk_watch_interval="15secs" --containerizers="mesos" --credential="/tmp/Endpoint_SlaveEndpointTest_NoAuthorizer_1_hIbUxg/credential"
--default_role="*" --disallow_sharing_agent_pid_namespace="false" --disk_watch_interval="1mins"
--docker="docker" --docker_kill_orphans="true" --docker_registry="https://registry-1.docker.io"
--docker_remove_delay="6hrs" --docker_socket="/var/run/docker.sock" --docker_stop_timeout="0ns"
--docker_store_dir="/tmp/Endpoint_SlaveEndpointTest_NoAuthorizer_1_hIbUxg/store/docker" --docker_volume_checkpoint_dir="/var/run/mesos/isolators/docker/volume"
--enforce_container_disk_quota="false" --executor_registration_timeout="1mins" --executor_reregistration_timeout="2secs"
--executor_secret_key="/tmp/Endpoint_SlaveEndpointTest_NoAuthorizer_1_hIbUxg/executor_secret_key"
--executor_shutdown_grace_period="5secs" --fetcher_cache_dir="/tmp/Endpoint_SlaveEndpointTest_NoAuthorizer_1_hIbUxg/fetch"
--fetcher_cache_size="2GB" --frameworks_home="" --gc_delay="1weeks" --gc_disk_headroom="0.1"
--hadoop_home="" --help="false" --hostname_lookup="true" --http_command_executor="false" --http_credentials="/tmp/Endpoint_SlaveEndpointTest_NoAuthorizer_1_hIbUxg/http_credentials"
--http_heartbeat_interval="30secs" --initialize_driver_logging="true" --isolation="posix/cpu,posix/mem"
--launcher="posix" --launcher_dir="/mesos/mesos-1.5.0/_build/src" --logbufsecs="0" --logging_level="INFO"
--max_completed_executors_per_framework="150" --oversubscribed_resources_interval="15secs"
--perf_duration="10secs" --perf_interval="1mins" --port="5051" --qos_correction_interval_min="0ns"
--quiet="false" --recover="reconnect" --recovery_timeout="15mins" --registration_backoff_factor="10ms"
--resources="cpus:2;gpus:0;mem:1024;disk:1024;ports:[31000-32000]" --revocable_cpu_low_priority="true"
--runtime_dir="/tmp/Endpoint_SlaveEndpointTest_NoAuthorizer_1_hIbUxg" --sandbox_directory="/mnt/mesos/sandbox"
--strict="true" --switch_user="true" --systemd_enable_support="true" --systemd_runtime_directory="/run/systemd/system"
--version="false" --work_dir="/tmp/Endpoint_SlaveEndpointTest_NoAuthorizer_1_C3oafE" --zk_session_timeout="10secs"
I0902 04:22:01.456951 30865 credentials.hpp:86] Loading credential for authentication from
'/tmp/Endpoint_SlaveEndpointTest_NoAuthorizer_1_hIbUxg/credential'
I0902 04:22:01.457124 30865 slave.cpp:285] Agent using credential for: test-principal
I0902 04:22:01.457149 30865 credentials.hpp:37] Loading credentials for authentication from
'/tmp/Endpoint_SlaveEndpointTest_NoAuthorizer_1_hIbUxg/http_credentials'
I0902 04:22:01.457417 30865 http.cpp:1045] Creating default 'basic' HTTP authenticator for
realm 'mesos-agent-executor'
I0902 04:22:01.457540 30865 http.cpp:1066] Creating default 'jwt' HTTP authenticator for realm
'mesos-agent-executor'
I0902 04:22:01.457732 30865 http.cpp:1045] Creating default 'basic' HTTP authenticator for
realm 'mesos-agent-readonly'
I0902 04:22:01.457829 30865 http.cpp:1066] Creating default 'jwt' HTTP authenticator for realm
'mesos-agent-readonly'
I0902 04:22:01.457998 30865 http.cpp:1045] Creating default 'basic' HTTP authenticator for
realm 'mesos-agent-readwrite'
I0902 04:22:01.458096 30865 http.cpp:1066] Creating default 'jwt' HTTP authenticator for realm
'mesos-agent-readwrite'
I0902 04:22:01.459394 30865 slave.cpp:581] Agent resources: [{"name":"cpus","scalar":{"value":2.0},"type":"SCALAR"},{"name":"mem","scalar":{"value":1024.0},"type":"SCALAR"},{"name":"disk","scalar":{"value":1024.0},"type":"SCALAR"},{"name":"ports","ranges":{"range":[{"begin":31000,"end":32000}]},"type":"RANGES"}]
I0902 04:22:01.459623 30865 slave.cpp:589] Agent attributes: [  ]
I0902 04:22:01.459642 30865 slave.cpp:598] Agent hostname: b299825ee94a
I0902 04:22:01.459770 30856 status_update_manager.cpp:177] Pausing sending status updates
I0902 04:22:01.461321 30851 state.cpp:64] Recovering state from '/tmp/Endpoint_SlaveEndpointTest_NoAuthorizer_1_C3oafE/meta'
I0902 04:22:01.461676 30869 status_update_manager.cpp:203] Recovering status update manager
I0902 04:22:01.461879 30864 containerizer.cpp:646] Recovering containerizer
I0902 04:22:01.463116 30871 provisioner.cpp:416] Provisioner recovery complete
I0902 04:22:01.463407 30865 slave.cpp:6296] Finished recovery
I0902 04:22:01.463834 30865 slave.cpp:6478] Querying resource estimator for oversubscribable
resources
I0902 04:22:01.464059 30854 slave.cpp:6492] Received oversubscribable resources {} from the
resource estimator
I0902 04:22:01.466403 30872 process.cpp:3956] Handling HTTP event for process 'slave(818)'
with path: '/slave(818)/monitor/statistics.json'
I0902 04:22:01.468142 30870 http.cpp:1185] HTTP GET for /slave(818)/monitor/statistics.json
from 172.17.0.7:48588
I0902 04:22:01.468215 30870 http.cpp:976] Authorizing principal 'test-principal' to GET the
'/monitor/statistics.json' endpoint
I0902 04:22:01.471122 30860 slave.cpp:859] Agent terminating
[       OK ] Endpoint/SlaveEndpointTest.NoAuthorizer/1 (30 ms)
[ RUN      ] Endpoint/SlaveEndpointTest.NoAuthorizer/2
I0902 04:22:01.481729  9660 containerizer.cpp:290] Using isolation { environment_secret, posix/cpu,
posix/mem, filesystem/posix, network/cni }
W0902 04:22:01.482223  9660 backend.cpp:76] Failed to create 'aufs' backend: AufsBackend requires
root privileges
W0902 04:22:01.482342  9660 backend.cpp:76] Failed to create 'bind' backend: BindBackend requires
root privileges
I0902 04:22:01.482380  9660 provisioner.cpp:255] Using default backend 'copy'
I0902 04:22:01.483935  9660 cluster.cpp:448] Creating default 'local' authorizer
I0902 04:22:01.486196 30860 slave.cpp:252] Mesos agent started on (819)@172.17.0.7:41112
I0902 04:22:01.486215 30860 slave.cpp:253] Flags at startup: --acls="" --appc_simple_discovery_uri_prefix="http://"
--appc_store_dir="/tmp/Endpoint_SlaveEndpointTest_NoAuthorizer_2_HEJ9ZJ/store/appc" --authenticate_http_executors="true"
--authenticate_http_readonly="true" --authenticate_http_readwrite="true" --authenticatee="crammd5"
--authentication_backoff_factor="1secs" --authorizer="local" --cgroups_cpu_enable_pids_and_tids_count="false"
--cgroups_enable_cfs="false" --cgroups_hierarchy="/sys/fs/cgroup" --cgroups_limit_swap="false"
--cgroups_root="mesos" --container_disk_watch_interval="15secs" --containerizers="mesos" --credential="/tmp/Endpoint_SlaveEndpointTest_NoAuthorizer_2_HEJ9ZJ/credential"
--default_role="*" --disallow_sharing_agent_pid_namespace="false" --disk_watch_interval="1mins"
--docker="docker" --docker_kill_orphans="true" --docker_registry="https://registry-1.docker.io"
--docker_remove_delay="6hrs" --docker_socket="/var/run/docker.sock" --docker_stop_timeout="0ns"
--docker_store_dir="/tmp/Endpoint_SlaveEndpointTest_NoAuthorizer_2_HEJ9ZJ/store/docker" --docker_volume_checkpoint_dir="/var/run/mesos/isolators/docker/volume"
--enforce_container_disk_quota="false" --executor_registration_timeout="1mins" --executor_reregistration_timeout="2secs"
--executor_secret_key="/tmp/Endpoint_SlaveEndpointTest_NoAuthorizer_2_HEJ9ZJ/executor_secret_key"
--executor_shutdown_grace_period="5secs" --fetcher_cache_dir="/tmp/Endpoint_SlaveEndpointTest_NoAuthorizer_2_HEJ9ZJ/fetch"
--fetcher_cache_size="2GB" --frameworks_home="" --gc_delay="1weeks" --gc_disk_headroom="0.1"
--hadoop_home="" --help="false" --hostname_lookup="true" --http_command_executor="false" --http_credentials="/tmp/Endpoint_SlaveEndpointTest_NoAuthorizer_2_HEJ9ZJ/http_credentials"
--http_heartbeat_interval="30secs" --initialize_driver_logging="true" --isolation="posix/cpu,posix/mem"
--launcher="posix" --launcher_dir="/mesos/mesos-1.5.0/_build/src" --logbufsecs="0" --logging_level="INFO"
--max_completed_executors_per_framework="150" --oversubscribed_resources_interval="15secs"
--perf_duration="10secs" --perf_interval="1mins" --port="5051" --qos_correction_interval_min="0ns"
--quiet="false" --recover="reconnect" --recovery_timeout="15mins" --registration_backoff_factor="10ms"
--resources="cpus:2;gpus:0;mem:1024;disk:1024;ports:[31000-32000]" --revocable_cpu_low_priority="true"
--runtime_dir="/tmp/Endpoint_SlaveEndpointTest_NoAuthorizer_2_HEJ9ZJ" --sandbox_directory="/mnt/mesos/sandbox"
--strict="true" --switch_user="true" --systemd_enable_support="true" --systemd_runtime_directory="/run/systemd/system"
--version="false" --work_dir="/tmp/Endpoint_SlaveEndpointTest_NoAuthorizer_2_PyuWC7" --zk_session_timeout="10secs"
I0902 04:22:01.486620 30860 credentials.hpp:86] Loading credential for authentication from
'/tmp/Endpoint_SlaveEndpointTest_NoAuthorizer_2_HEJ9ZJ/credential'
I0902 04:22:01.486773 30860 slave.cpp:285] Agent using credential for: test-principal
I0902 04:22:01.486795 30860 credentials.hpp:37] Loading credentials for authentication from
'/tmp/Endpoint_SlaveEndpointTest_NoAuthorizer_2_HEJ9ZJ/http_credentials'
I0902 04:22:01.487057 30860 http.cpp:1045] Creating default 'basic' HTTP authenticator for
realm 'mesos-agent-executor'
I0902 04:22:01.487179 30860 http.cpp:1066] Creating default 'jwt' HTTP authenticator for realm
'mesos-agent-executor'
I0902 04:22:01.487370 30860 http.cpp:1045] Creating default 'basic' HTTP authenticator for
realm 'mesos-agent-readonly'
I0902 04:22:01.487460 30860 http.cpp:1066] Creating default 'jwt' HTTP authenticator for realm
'mesos-agent-readonly'
I0902 04:22:01.487619 30860 http.cpp:1045] Creating default 'basic' HTTP authenticator for
realm 'mesos-agent-readwrite'
I0902 04:22:01.487709 30860 http.cpp:1066] Creating default 'jwt' HTTP authenticator for realm
'mesos-agent-readwrite'
I0902 04:22:01.489002 30860 slave.cpp:581] Agent resources: [{"name":"cpus","scalar":{"value":2.0},"type":"SCALAR"},{"name":"mem","scalar":{"value":1024.0},"type":"SCALAR"},{"name":"disk","scalar":{"value":1024.0},"type":"SCALAR"},{"name":"ports","ranges":{"range":[{"begin":31000,"end":32000}]},"type":"RANGES"}]
I0902 04:22:01.489218 30860 slave.cpp:589] Agent attributes: [  ]
I0902 04:22:01.489233 30860 slave.cpp:598] Agent hostname: b299825ee94a
I0902 04:22:01.489344 30869 status_update_manager.cpp:177] Pausing sending status updates
I0902 04:22:01.495990 30864 state.cpp:64] Recovering state from '/tmp/Endpoint_SlaveEndpointTest_NoAuthorizer_2_PyuWC7/meta'
I0902 04:22:01.496271 30867 status_update_manager.cpp:203] Recovering status update manager
I0902 04:22:01.496433 30859 containerizer.cpp:646] Recovering containerizer
I0902 04:22:01.497740 30857 provisioner.cpp:416] Provisioner recovery complete
I0902 04:22:01.498037 30860 slave.cpp:6296] Finished recovery
I0902 04:22:01.498487 30860 slave.cpp:6478] Querying resource estimator for oversubscribable
resources
I0902 04:22:01.498713 30852 slave.cpp:6492] Received oversubscribable resources {} from the
resource estimator
I0902 04:22:01.500850 30863 process.cpp:3956] Handling HTTP event for process 'slave(819)'
with path: '/slave(819)/containers'
I0902 04:22:01.502465 30865 http.cpp:1185] HTTP GET for /slave(819)/containers from 172.17.0.7:48594
I0902 04:22:01.502539 30865 http.cpp:976] Authorizing principal 'test-principal' to GET the
'/containers' endpoint
I0902 04:22:01.505340 30850 slave.cpp:859] Agent terminating
[       OK ] Endpoint/SlaveEndpointTest.NoAuthorizer/2 (35 ms)
[----------] 9 tests from Endpoint/SlaveEndpointTest (280 ms total)

[----------] 2 tests from ContainerizerType/DefaultContainerDNSFlagTest
[ RUN      ] ContainerizerType/DefaultContainerDNSFlagTest.ValidateFlag/0
[       OK ] ContainerizerType/DefaultContainerDNSFlagTest.ValidateFlag/0 (13 ms)
[ RUN      ] ContainerizerType/DefaultContainerDNSFlagTest.ValidateFlag/1
[       OK ] ContainerizerType/DefaultContainerDNSFlagTest.ValidateFlag/1 (8 ms)
[----------] 2 tests from ContainerizerType/DefaultContainerDNSFlagTest (22 ms total)

[----------] Global test environment tear-down
[==========] 1672 tests from 185 test cases ran. (538322 ms total)
[  PASSED  ] 1670 tests.
[  FAILED  ] 2 tests, listed below:
[  FAILED  ] CommandExecutorCheckTest.CommandCheckDeliveredAndReconciled
[  FAILED  ] DefaultExecutorCheckTest.CommandCheckDeliveredAndReconciled

 2 FAILED TESTS
  YOU HAVE 20 DISABLED TESTS

I0902 04:22:01.590827 30873 process.cpp:1072] Failed to accept socket: future discarded
make[4]: *** [check-local] Error 1
make[4]: Leaving directory `/mesos/mesos-1.5.0/_build/src'
make[3]: *** [check-am] Error 2
make[3]: Leaving directory `/mesos/mesos-1.5.0/_build/src'
make[2]: *** [check] Error 2
make[2]: Leaving directory `/mesos/mesos-1.5.0/_build/src'
make[1]: *** [check-recursive] Error 1
make[1]: Leaving directory `/mesos/mesos-1.5.0/_build'
make: *** [distcheck] Error 1
+ docker rmi mesos-1504323381-7289
Untagged: mesos-1504323381-7289:latest
Deleted: sha256:3fe9215fc23d2133ae494fcdbd91859568f46ed45cd324651479f7eca0099384
Deleted: sha256:5b71ff20035ddb88a672a9e72c6d21c07e718a459fd61b14ba463a358b2584cd
Deleted: sha256:6eabbd75aebf575089c7591afbd2385a19eb0ccbe766ca3e72f4eb3104dc54c0
Deleted: sha256:4ab6154e60cc41a106453e10c8ba34f4370d703c9e13e08ca943bde9997bbe87
Deleted: sha256:ac505f3b3d123a2fb33cf44549bfbb7693d34338277be46441ddc910959f27b4
Deleted: sha256:1d38761cdc0146db8b4a81a65c44a7f98a80e3072cc76201a1636fd3ef5de896
Deleted: sha256:70753eeab977f8ea13c859c30b6860b4857f453a76736c108ce76e60336781ac
Deleted: sha256:f40ab05396f9efe87b168ab9cbb30c422a989f6e741f47e07b6f39a97e403e7a
Deleted: sha256:9d69a7f11ee570795adde0ecb1f09c1bff8a079b1e89562c814950774c5980a9
Deleted: sha256:78c43010ee72e2d16a6242a39d035835b17f6c8f51c2543496ec9c121962ebf4
Deleted: sha256:6ccaf363cb98de345da19fad77786630a052b2137e688dca8bc7e5100650e668
Deleted: sha256:5d445a30550c6dcfe10c04e2814d4f716cdda758e2816660101c2d57a8e61767
Deleted: sha256:3d2e5f5886fb3ab4ea4d6e2f417a3c63ad1d02dbecf2780e74dc51f041f2e74b
Deleted: sha256:6cfb36dcd244657ac0e5211d66b921020a864b6a49bd04c01557ef9076c76ced
Deleted: sha256:18108fe8ac9ea77819ce290b5828a2e48839aa0584457f7d61c8f2778f9d83f0
Deleted: sha256:be15e22db32726a95d10878959c4ecee94ee8e58eae865807c0cf0b60bab4619
Deleted: sha256:ab253b718a70f0f3639fe42f53f8db9f9b929757be9739dad990a29034ed218f
Deleted: sha256:8e01fa6124b85f7eb48dda46426fc13202e877609aba5a01c600c164c0afb38c
Deleted: sha256:50ded46052037e4079f9a71470d2fc8a0b37ff5fe6cd0d8002efbdc28cb55ba9
Deleted: sha256:7798198cb9ed799bdce5cdc910cc1b0823ff377263df25e397e52cba5e1e69d5
Deleted: sha256:0ac7e2bc91bd718e87d496a4fb3a65d89e2554264a0a778cf8fc0bf7a60352c8
Deleted: sha256:5430abbac97b813a7d20fe3ff39006a55dc756507a8af24ef5cc55ed56c977a9
Deleted: sha256:8fcbe857b22bcd038d6e81e61667fa3b63b2f81a4c915df5ec00a5e2e3be86b3
Deleted: sha256:12e6b334c8a31f419772cec478922ff020ec04bcb9fc97df502320cc8d5f5e6d
Deleted: sha256:87e850b13308c6ea86c780ba7be400f2043162fc3cd0b042777dba0196cc600e
Build step 'Execute shell' marked build as failure
Not sending mail to unregistered user songzihao1990@gmail.com

Mime
View raw message