mesos-builds mailing list archives

Site index · List index
Message view « Date » · « Thread »
Top « Date » · « Thread »
From Apache Jenkins Server <jenk...@builds.apache.org>
Subject Build failed in Jenkins: Mesos-Reviewbot #19537
Date Mon, 25 Sep 2017 17:09:34 GMT
See <https://builds.apache.org/job/Mesos-Reviewbot/19537/display/redirect>

------------------------------------------
[...truncated 31.70 MB...]
I0925 17:09:28.535276  5796 credentials.hpp:37] Loading credentials for authentication from
'/tmp/Endpoint_SlaveEndpointTest_AuthorizedRequest_2_laKJuQ/http_credentials'
I0925 17:09:28.535513  5796 http.cpp:1045] Creating default 'basic' HTTP authenticator for
realm 'mesos-agent-readonly'
I0925 17:09:28.535835  5796 http.cpp:1045] Creating default 'basic' HTTP authenticator for
realm 'mesos-agent-readwrite'
I0925 17:09:28.538063  5796 slave.cpp:585] Agent resources: [{"name":"cpus","scalar":{"value":2.0},"type":"SCALAR"},{"name":"mem","scalar":{"value":1024.0},"type":"SCALAR"},{"name":"disk","scalar":{"value":1024.0},"type":"SCALAR"},{"name":"ports","ranges":{"range":[{"begin":31000,"end":32000}]},"type":"RANGES"}]
I0925 17:09:28.538489  5796 slave.cpp:593] Agent attributes: [  ]
I0925 17:09:28.538518  5796 slave.cpp:602] Agent hostname: 58e41e53f694
I0925 17:09:28.538727  5809 status_update_manager.cpp:177] Pausing sending status updates
I0925 17:09:28.540314  5810 state.cpp:64] Recovering state from '/tmp/Endpoint_SlaveEndpointTest_AuthorizedRequest_2_tNcT0r/meta'
I0925 17:09:28.540688  5814 status_update_manager.cpp:203] Recovering status update manager
I0925 17:09:28.540920  5814 containerizer.cpp:648] Recovering containerizer
I0925 17:09:28.542148  5812 provisioner.cpp:416] Provisioner recovery complete
I0925 17:09:28.542647  5809 slave.cpp:6322] Finished recovery
I0925 17:09:28.543076  5809 slave.cpp:6504] Querying resource estimator for oversubscribable
resources
I0925 17:09:28.543330  5810 slave.cpp:6518] Received oversubscribable resources {} from the
resource estimator
I0925 17:09:28.545990  5802 process.cpp:3929] Handling HTTP event for process 'slave(811)'
with path: '/slave(811)/containers'
I0925 17:09:28.547550  5805 http.cpp:1185] HTTP GET for /slave(811)/containers from 172.17.0.2:43982
I0925 17:09:28.547621  5805 http.cpp:976] Authorizing principal 'test-principal' to GET the
'/containers' endpoint
I0925 17:09:28.551973  5772 slave.cpp:869] Agent terminating
[       OK ] Endpoint/SlaveEndpointTest.AuthorizedRequest/2 (34 ms)
[ RUN      ] Endpoint/SlaveEndpointTest.UnauthorizedRequest/0
I0925 17:09:28.564715  5772 containerizer.cpp:292] Using isolation { environment_secret, posix/cpu,
posix/mem, filesystem/posix, network/cni }
W0925 17:09:28.565233  5772 backend.cpp:76] Failed to create 'aufs' backend: AufsBackend requires
root privileges
W0925 17:09:28.565351  5772 backend.cpp:76] Failed to create 'bind' backend: BindBackend requires
root privileges
I0925 17:09:28.565390  5772 provisioner.cpp:255] Using default backend 'copy'
I0925 17:09:28.569283  5810 slave.cpp:254] Mesos agent started on (812)@172.17.0.2:37602
I0925 17:09:28.569319  5810 slave.cpp:255] Flags at startup: --acls="" --appc_simple_discovery_uri_prefix="http://"
--appc_store_dir="/tmp/Endpoint_SlaveEndpointTest_UnauthorizedRequest_0_vvhhHq/store/appc"
--authenticate_http_readonly="true" --authenticate_http_readwrite="true" --authenticatee="crammd5"
--authentication_backoff_factor="1secs" --authorizer="local" --cgroups_cpu_enable_pids_and_tids_count="false"
--cgroups_enable_cfs="false" --cgroups_hierarchy="/sys/fs/cgroup" --cgroups_limit_swap="false"
--cgroups_root="mesos" --container_disk_watch_interval="15secs" --containerizers="mesos" --credential="/tmp/Endpoint_SlaveEndpointTest_UnauthorizedRequest_0_vvhhHq/credential"
--default_role="*" --disallow_sharing_agent_pid_namespace="false" --disk_watch_interval="1mins"
--docker="docker" --docker_kill_orphans="true" --docker_registry="https://registry-1.docker.io"
--docker_remove_delay="6hrs" --docker_socket="/var/run/docker.sock" --docker_stop_timeout="0ns"
--docker_store_dir="/tmp/Endpoint_SlaveEndpointTest_UnauthorizedRequest_0_vvhhHq/store/docker"
--docker_volume_checkpoint_dir="/var/run/mesos/isolators/docker/volume" --enforce_container_disk_quota="false"
--executor_registration_timeout="1mins" --executor_reregistration_timeout="2secs" --executor_shutdown_grace_period="5secs"
--fetcher_cache_dir="/tmp/Endpoint_SlaveEndpointTest_UnauthorizedRequest_0_vvhhHq/fetch" --fetcher_cache_size="2GB"
--frameworks_home="" --gc_delay="1weeks" --gc_disk_headroom="0.1" --hadoop_home="" --help="false"
--hostname_lookup="true" --http_command_executor="false" --http_credentials="/tmp/Endpoint_SlaveEndpointTest_UnauthorizedRequest_0_vvhhHq/http_credentials"
--http_heartbeat_interval="30secs" --initialize_driver_logging="true" --isolation="posix/cpu,posix/mem"
--launcher="posix" --launcher_dir="/mesos/mesos-1.5.0/_build/src" --logbufsecs="0" --logging_level="INFO"
--max_completed_executors_per_framework="150" --oversubscribed_resources_interval="15secs"
--perf_duration="10secs" --perf_interval="1mins" --port="5051" --qos_correction_interval_min="0ns"
--quiet="false" --recover="reconnect" --recovery_timeout="15mins" --registration_backoff_factor="10ms"
--resources="cpus:2;gpus:0;mem:1024;disk:1024;ports:[31000-32000]" --revocable_cpu_low_priority="true"
--runtime_dir="/tmp/Endpoint_SlaveEndpointTest_UnauthorizedRequest_0_vvhhHq" --sandbox_directory="/mnt/mesos/sandbox"
--strict="true" --switch_user="true" --systemd_enable_support="true" --systemd_runtime_directory="/run/systemd/system"
--version="false" --work_dir="/tmp/Endpoint_SlaveEndpointTest_UnauthorizedRequest_0_tUYl81"
--zk_session_timeout="10secs"
I0925 17:09:28.569735  5810 credentials.hpp:86] Loading credential for authentication from
'/tmp/Endpoint_SlaveEndpointTest_UnauthorizedRequest_0_vvhhHq/credential'
I0925 17:09:28.569919  5810 slave.cpp:287] Agent using credential for: test-principal
I0925 17:09:28.569943  5810 credentials.hpp:37] Loading credentials for authentication from
'/tmp/Endpoint_SlaveEndpointTest_UnauthorizedRequest_0_vvhhHq/http_credentials'
I0925 17:09:28.570192  5810 http.cpp:1045] Creating default 'basic' HTTP authenticator for
realm 'mesos-agent-readonly'
I0925 17:09:28.570389  5810 http.cpp:1045] Creating default 'basic' HTTP authenticator for
realm 'mesos-agent-readwrite'
I0925 17:09:28.572651  5810 slave.cpp:585] Agent resources: [{"name":"cpus","scalar":{"value":2.0},"type":"SCALAR"},{"name":"mem","scalar":{"value":1024.0},"type":"SCALAR"},{"name":"disk","scalar":{"value":1024.0},"type":"SCALAR"},{"name":"ports","ranges":{"range":[{"begin":31000,"end":32000}]},"type":"RANGES"}]
I0925 17:09:28.573052  5810 slave.cpp:593] Agent attributes: [  ]
I0925 17:09:28.573077  5810 slave.cpp:602] Agent hostname: 58e41e53f694
I0925 17:09:28.573225  5812 status_update_manager.cpp:177] Pausing sending status updates
I0925 17:09:28.574596  5814 state.cpp:64] Recovering state from '/tmp/Endpoint_SlaveEndpointTest_UnauthorizedRequest_0_tUYl81/meta'
I0925 17:09:28.574968  5795 status_update_manager.cpp:203] Recovering status update manager
I0925 17:09:28.575273  5806 containerizer.cpp:648] Recovering containerizer
I0925 17:09:28.576750  5797 provisioner.cpp:416] Provisioner recovery complete
I0925 17:09:28.577162  5804 slave.cpp:6322] Finished recovery
I0925 17:09:28.577589  5804 slave.cpp:6504] Querying resource estimator for oversubscribable
resources
I0925 17:09:28.577802  5814 slave.cpp:6518] Received oversubscribable resources {} from the
resource estimator
I0925 17:09:28.580328  5802 process.cpp:3929] Handling HTTP event for process 'slave(812)'
with path: '/slave(812)/monitor/statistics'
I0925 17:09:28.582001  5801 http.cpp:1185] HTTP GET for /slave(812)/monitor/statistics from
172.17.0.2:43984
I0925 17:09:28.582075  5801 http.cpp:976] Authorizing principal 'test-principal' to GET the
'/monitor/statistics' endpoint
I0925 17:09:28.585036  5772 slave.cpp:869] Agent terminating
[       OK ] Endpoint/SlaveEndpointTest.UnauthorizedRequest/0 (33 ms)
[ RUN      ] Endpoint/SlaveEndpointTest.UnauthorizedRequest/1
I0925 17:09:28.597709  5772 containerizer.cpp:292] Using isolation { environment_secret, posix/cpu,
posix/mem, filesystem/posix, network/cni }
W0925 17:09:28.598167  5772 backend.cpp:76] Failed to create 'aufs' backend: AufsBackend requires
root privileges
W0925 17:09:28.598274  5772 backend.cpp:76] Failed to create 'bind' backend: BindBackend requires
root privileges
I0925 17:09:28.598307  5772 provisioner.cpp:255] Using default backend 'copy'
I0925 17:09:28.602416  5807 slave.cpp:254] Mesos agent started on (813)@172.17.0.2:37602
I0925 17:09:28.602458  5807 slave.cpp:255] Flags at startup: --acls="" --appc_simple_discovery_uri_prefix="http://"
--appc_store_dir="/tmp/Endpoint_SlaveEndpointTest_UnauthorizedRequest_1_LvtKd1/store/appc"
--authenticate_http_readonly="true" --authenticate_http_readwrite="true" --authenticatee="crammd5"
--authentication_backoff_factor="1secs" --authorizer="local" --cgroups_cpu_enable_pids_and_tids_count="false"
--cgroups_enable_cfs="false" --cgroups_hierarchy="/sys/fs/cgroup" --cgroups_limit_swap="false"
--cgroups_root="mesos" --container_disk_watch_interval="15secs" --containerizers="mesos" --credential="/tmp/Endpoint_SlaveEndpointTest_UnauthorizedRequest_1_LvtKd1/credential"
--default_role="*" --disallow_sharing_agent_pid_namespace="false" --disk_watch_interval="1mins"
--docker="docker" --docker_kill_orphans="true" --docker_registry="https://registry-1.docker.io"
--docker_remove_delay="6hrs" --docker_socket="/var/run/docker.sock" --docker_stop_timeout="0ns"
--docker_store_dir="/tmp/Endpoint_SlaveEndpointTest_UnauthorizedRequest_1_LvtKd1/store/docker"
--docker_volume_checkpoint_dir="/var/run/mesos/isolators/docker/volume" --enforce_container_disk_quota="false"
--executor_registration_timeout="1mins" --executor_reregistration_timeout="2secs" --executor_shutdown_grace_period="5secs"
--fetcher_cache_dir="/tmp/Endpoint_SlaveEndpointTest_UnauthorizedRequest_1_LvtKd1/fetch" --fetcher_cache_size="2GB"
--frameworks_home="" --gc_delay="1weeks" --gc_disk_headroom="0.1" --hadoop_home="" --help="false"
--hostname_lookup="true" --http_command_executor="false" --http_credentials="/tmp/Endpoint_SlaveEndpointTest_UnauthorizedRequest_1_LvtKd1/http_credentials"
--http_heartbeat_interval="30secs" --initialize_driver_logging="true" --isolation="posix/cpu,posix/mem"
--launcher="posix" --launcher_dir="/mesos/mesos-1.5.0/_build/src" --logbufsecs="0" --logging_level="INFO"
--max_completed_executors_per_framework="150" --oversubscribed_resources_interval="15secs"
--perf_duration="10secs" --perf_interval="1mins" --port="5051" --qos_correction_interval_min="0ns"
--quiet="false" --recover="reconnect" --recovery_timeout="15mins" --registration_backoff_factor="10ms"
--resources="cpus:2;gpus:0;mem:1024;disk:1024;ports:[31000-32000]" --revocable_cpu_low_priority="true"
--runtime_dir="/tmp/Endpoint_SlaveEndpointTest_UnauthorizedRequest_1_LvtKd1" --sandbox_directory="/mnt/mesos/sandbox"
--strict="true" --switch_user="true" --systemd_enable_support="true" --systemd_runtime_directory="/run/systemd/system"
--version="false" --work_dir="/tmp/Endpoint_SlaveEndpointTest_UnauthorizedRequest_1_D0xTzC"
--zk_session_timeout="10secs"
I0925 17:09:28.602952  5807 credentials.hpp:86] Loading credential for authentication from
'/tmp/Endpoint_SlaveEndpointTest_UnauthorizedRequest_1_LvtKd1/credential'
I0925 17:09:28.603137  5807 slave.cpp:287] Agent using credential for: test-principal
I0925 17:09:28.603163  5807 credentials.hpp:37] Loading credentials for authentication from
'/tmp/Endpoint_SlaveEndpointTest_UnauthorizedRequest_1_LvtKd1/http_credentials'
I0925 17:09:28.603526  5807 http.cpp:1045] Creating default 'basic' HTTP authenticator for
realm 'mesos-agent-readonly'
I0925 17:09:28.603737  5807 http.cpp:1045] Creating default 'basic' HTTP authenticator for
realm 'mesos-agent-readwrite'
I0925 17:09:28.605438  5807 slave.cpp:585] Agent resources: [{"name":"cpus","scalar":{"value":2.0},"type":"SCALAR"},{"name":"mem","scalar":{"value":1024.0},"type":"SCALAR"},{"name":"disk","scalar":{"value":1024.0},"type":"SCALAR"},{"name":"ports","ranges":{"range":[{"begin":31000,"end":32000}]},"type":"RANGES"}]
I0925 17:09:28.605705  5807 slave.cpp:593] Agent attributes: [  ]
I0925 17:09:28.605722  5807 slave.cpp:602] Agent hostname: 58e41e53f694
I0925 17:09:28.605934  5806 status_update_manager.cpp:177] Pausing sending status updates
I0925 17:09:28.607553  5808 state.cpp:64] Recovering state from '/tmp/Endpoint_SlaveEndpointTest_UnauthorizedRequest_1_D0xTzC/meta'
I0925 17:09:28.607899  5812 status_update_manager.cpp:203] Recovering status update manager
I0925 17:09:28.608110  5812 containerizer.cpp:648] Recovering containerizer
I0925 17:09:28.609565  5796 provisioner.cpp:416] Provisioner recovery complete
I0925 17:09:28.610013  5802 slave.cpp:6322] Finished recovery
I0925 17:09:28.610457  5802 slave.cpp:6504] Querying resource estimator for oversubscribable
resources
I0925 17:09:28.610740  5797 slave.cpp:6518] Received oversubscribable resources {} from the
resource estimator
I0925 17:09:28.613289  5791 process.cpp:3929] Handling HTTP event for process 'slave(813)'
with path: '/slave(813)/monitor/statistics.json'
I0925 17:09:28.614855  5792 http.cpp:1185] HTTP GET for /slave(813)/monitor/statistics.json
from 172.17.0.2:43986
I0925 17:09:28.614924  5792 http.cpp:976] Authorizing principal 'test-principal' to GET the
'/monitor/statistics.json' endpoint
I0925 17:09:28.617276  5772 slave.cpp:869] Agent terminating
[       OK ] Endpoint/SlaveEndpointTest.UnauthorizedRequest/1 (31 ms)
[ RUN      ] Endpoint/SlaveEndpointTest.UnauthorizedRequest/2
I0925 17:09:28.628695  5772 containerizer.cpp:292] Using isolation { environment_secret, posix/cpu,
posix/mem, filesystem/posix, network/cni }
W0925 17:09:28.629166  5772 backend.cpp:76] Failed to create 'aufs' backend: AufsBackend requires
root privileges
W0925 17:09:28.629271  5772 backend.cpp:76] Failed to create 'bind' backend: BindBackend requires
root privileges
I0925 17:09:28.629302  5772 provisioner.cpp:255] Using default backend 'copy'
I0925 17:09:28.633148  5814 slave.cpp:254] Mesos agent started on (814)@172.17.0.2:37602
I0925 17:09:28.633173  5814 slave.cpp:255] Flags at startup: --acls="" --appc_simple_discovery_uri_prefix="http://"
--appc_store_dir="/tmp/Endpoint_SlaveEndpointTest_UnauthorizedRequest_2_pWSV2B/store/appc"
--authenticate_http_readonly="true" --authenticate_http_readwrite="true" --authenticatee="crammd5"
--authentication_backoff_factor="1secs" --authorizer="local" --cgroups_cpu_enable_pids_and_tids_count="false"
--cgroups_enable_cfs="false" --cgroups_hierarchy="/sys/fs/cgroup" --cgroups_limit_swap="false"
--cgroups_root="mesos" --container_disk_watch_interval="15secs" --containerizers="mesos" --credential="/tmp/Endpoint_SlaveEndpointTest_UnauthorizedRequest_2_pWSV2B/credential"
--default_role="*" --disallow_sharing_agent_pid_namespace="false" --disk_watch_interval="1mins"
--docker="docker" --docker_kill_orphans="true" --docker_registry="https://registry-1.docker.io"
--docker_remove_delay="6hrs" --docker_socket="/var/run/docker.sock" --docker_stop_timeout="0ns"
--docker_store_dir="/tmp/Endpoint_SlaveEndpointTest_UnauthorizedRequest_2_pWSV2B/store/docker"
--docker_volume_checkpoint_dir="/var/run/mesos/isolators/docker/volume" --enforce_container_disk_quota="false"
--executor_registration_timeout="1mins" --executor_reregistration_timeout="2secs" --executor_shutdown_grace_period="5secs"
--fetcher_cache_dir="/tmp/Endpoint_SlaveEndpointTest_UnauthorizedRequest_2_pWSV2B/fetch" --fetcher_cache_size="2GB"
--frameworks_home="" --gc_delay="1weeks" --gc_disk_headroom="0.1" --hadoop_home="" --help="false"
--hostname_lookup="true" --http_command_executor="false" --http_credentials="/tmp/Endpoint_SlaveEndpointTest_UnauthorizedRequest_2_pWSV2B/http_credentials"
--http_heartbeat_interval="30secs" --initialize_driver_logging="true" --isolation="posix/cpu,posix/mem"
--launcher="posix" --launcher_dir="/mesos/mesos-1.5.0/_build/src" --logbufsecs="0" --logging_level="INFO"
--max_completed_executors_per_framework="150" --oversubscribed_resources_interval="15secs"
--perf_duration="10secs" --perf_interval="1mins" --port="5051" --qos_correction_interval_min="0ns"
--quiet="false" --recover="reconnect" --recovery_timeout="15mins" --registration_backoff_factor="10ms"
--resources="cpus:2;gpus:0;mem:1024;disk:1024;ports:[31000-32000]" --revocable_cpu_low_priority="true"
--runtime_dir="/tmp/Endpoint_SlaveEndpointTest_UnauthorizedRequest_2_pWSV2B" --sandbox_directory="/mnt/mesos/sandbox"
--strict="true" --switch_user="true" --systemd_enable_support="true" --systemd_runtime_directory="/run/systemd/system"
--version="false" --work_dir="/tmp/Endpoint_SlaveEndpointTest_UnauthorizedRequest_2_5yjtkd"
--zk_session_timeout="10secs"
I0925 17:09:28.633708  5814 credentials.hpp:86] Loading credential for authentication from
'/tmp/Endpoint_SlaveEndpointTest_UnauthorizedRequest_2_pWSV2B/credential'
I0925 17:09:28.633875  5814 slave.cpp:287] Agent using credential for: test-principal
I0925 17:09:28.633899  5814 credentials.hpp:37] Loading credentials for authentication from
'/tmp/Endpoint_SlaveEndpointTest_UnauthorizedRequest_2_pWSV2B/http_credentials'
I0925 17:09:28.634181  5814 http.cpp:1045] Creating default 'basic' HTTP authenticator for
realm 'mesos-agent-readonly'
I0925 17:09:28.634404  5814 http.cpp:1045] Creating default 'basic' HTTP authenticator for
realm 'mesos-agent-readwrite'
I0925 17:09:28.636663  5814 slave.cpp:585] Agent resources: [{"name":"cpus","scalar":{"value":2.0},"type":"SCALAR"},{"name":"mem","scalar":{"value":1024.0},"type":"SCALAR"},{"name":"disk","scalar":{"value":1024.0},"type":"SCALAR"},{"name":"ports","ranges":{"range":[{"begin":31000,"end":32000}]},"type":"RANGES"}]
I0925 17:09:28.637058  5814 slave.cpp:593] Agent attributes: [  ]
I0925 17:09:28.637094  5814 slave.cpp:602] Agent hostname: 58e41e53f694
I0925 17:09:28.637290  5810 status_update_manager.cpp:177] Pausing sending status updates
I0925 17:09:28.638911  5809 state.cpp:64] Recovering state from '/tmp/Endpoint_SlaveEndpointTest_UnauthorizedRequest_2_5yjtkd/meta'
I0925 17:09:28.639204  5803 status_update_manager.cpp:203] Recovering status update manager
I0925 17:09:28.639408  5799 containerizer.cpp:648] Recovering containerizer
I0925 17:09:28.640913  5800 provisioner.cpp:416] Provisioner recovery complete
I0925 17:09:28.641419  5802 slave.cpp:6322] Finished recovery
I0925 17:09:28.641867  5802 slave.cpp:6504] Querying resource estimator for oversubscribable
resources
I0925 17:09:28.642210  5791 slave.cpp:6518] Received oversubscribable resources {} from the
resource estimator
I0925 17:09:28.644942  5807 process.cpp:3929] Handling HTTP event for process 'slave(814)'
with path: '/slave(814)/containers'
I0925 17:09:28.646338  5794 http.cpp:1185] HTTP GET for /slave(814)/containers from 172.17.0.2:43988
I0925 17:09:28.646466  5794 http.cpp:976] Authorizing principal 'test-principal' to GET the
'/containers' endpoint
I0925 17:09:28.649122  5772 slave.cpp:869] Agent terminating
[       OK ] Endpoint/SlaveEndpointTest.UnauthorizedRequest/2 (34 ms)
[ RUN      ] Endpoint/SlaveEndpointTest.NoAuthorizer/0
I0925 17:09:28.664232  5772 containerizer.cpp:292] Using isolation { environment_secret, posix/cpu,
posix/mem, filesystem/posix, network/cni }
W0925 17:09:28.664796  5772 backend.cpp:76] Failed to create 'aufs' backend: AufsBackend requires
root privileges
W0925 17:09:28.664932  5772 backend.cpp:76] Failed to create 'bind' backend: BindBackend requires
root privileges
I0925 17:09:28.664973  5772 provisioner.cpp:255] Using default backend 'copy'
I0925 17:09:28.667129  5772 cluster.cpp:448] Creating default 'local' authorizer
I0925 17:09:28.670027  5792 slave.cpp:254] Mesos agent started on (815)@172.17.0.2:37602
I0925 17:09:28.670056  5792 slave.cpp:255] Flags at startup: --acls="" --appc_simple_discovery_uri_prefix="http://"
--appc_store_dir="/tmp/Endpoint_SlaveEndpointTest_NoAuthorizer_0_vRpbcd/store/appc" --authenticate_http_readonly="true"
--authenticate_http_readwrite="true" --authenticatee="crammd5" --authentication_backoff_factor="1secs"
--authorizer="local" --cgroups_cpu_enable_pids_and_tids_count="false" --cgroups_enable_cfs="false"
--cgroups_hierarchy="/sys/fs/cgroup" --cgroups_limit_swap="false" --cgroups_root="mesos" --container_disk_watch_interval="15secs"
--containerizers="mesos" --credential="/tmp/Endpoint_SlaveEndpointTest_NoAuthorizer_0_vRpbcd/credential"
--default_role="*" --disallow_sharing_agent_pid_namespace="false" --disk_watch_interval="1mins"
--docker="docker" --docker_kill_orphans="true" --docker_registry="https://registry-1.docker.io"
--docker_remove_delay="6hrs" --docker_socket="/var/run/docker.sock" --docker_stop_timeout="0ns"
--docker_store_dir="/tmp/Endpoint_SlaveEndpointTest_NoAuthorizer_0_vRpbcd/store/docker" --docker_volume_checkpoint_dir="/var/run/mesos/isolators/docker/volume"
--enforce_container_disk_quota="false" --executor_registration_timeout="1mins" --executor_reregistration_timeout="2secs"
--executor_shutdown_grace_period="5secs" --fetcher_cache_dir="/tmp/Endpoint_SlaveEndpointTest_NoAuthorizer_0_vRpbcd/fetch"
--fetcher_cache_size="2GB" --frameworks_home="" --gc_delay="1weeks" --gc_disk_headroom="0.1"
--hadoop_home="" --help="false" --hostname_lookup="true" --http_command_executor="false" --http_credentials="/tmp/Endpoint_SlaveEndpointTest_NoAuthorizer_0_vRpbcd/http_credentials"
--http_heartbeat_interval="30secs" --initialize_driver_logging="true" --isolation="posix/cpu,posix/mem"
--launcher="posix" --launcher_dir="/mesos/mesos-1.5.0/_build/src" --logbufsecs="0" --logging_level="INFO"
--max_completed_executors_per_framework="150" --oversubscribed_resources_interval="15secs"
--perf_duration="10secs" --perf_interval="1mins" --port="5051" --qos_correction_interval_min="0ns"
--quiet="false" --recover="reconnect" --recovery_timeout="15mins" --registration_backoff_factor="10ms"
--resources="cpus:2;gpus:0;mem:1024;disk:1024;ports:[31000-32000]" --revocable_cpu_low_priority="true"
--runtime_dir="/tmp/Endpoint_SlaveEndpointTest_NoAuthorizer_0_vRpbcd" --sandbox_directory="/mnt/mesos/sandbox"
--strict="true" --switch_user="true" --systemd_enable_support="true" --systemd_runtime_directory="/run/systemd/system"
--version="false" --work_dir="/tmp/Endpoint_SlaveEndpointTest_NoAuthorizer_0_5EUyoO" --zk_session_timeout="10secs"
I0925 17:09:28.670600  5792 credentials.hpp:86] Loading credential for authentication from
'/tmp/Endpoint_SlaveEndpointTest_NoAuthorizer_0_vRpbcd/credential'
I0925 17:09:28.670773  5792 slave.cpp:287] Agent using credential for: test-principal
I0925 17:09:28.670796  5792 credentials.hpp:37] Loading credentials for authentication from
'/tmp/Endpoint_SlaveEndpointTest_NoAuthorizer_0_vRpbcd/http_credentials'
I0925 17:09:28.671054  5792 http.cpp:1045] Creating default 'basic' HTTP authenticator for
realm 'mesos-agent-readonly'
I0925 17:09:28.671234  5792 http.cpp:1045] Creating default 'basic' HTTP authenticator for
realm 'mesos-agent-readwrite'
I0925 17:09:28.672660  5792 slave.cpp:585] Agent resources: [{"name":"cpus","scalar":{"value":2.0},"type":"SCALAR"},{"name":"mem","scalar":{"value":1024.0},"type":"SCALAR"},{"name":"disk","scalar":{"value":1024.0},"type":"SCALAR"},{"name":"ports","ranges":{"range":[{"begin":31000,"end":32000}]},"type":"RANGES"}]
I0925 17:09:28.672895  5792 slave.cpp:593] Agent attributes: [  ]
I0925 17:09:28.672917  5792 slave.cpp:602] Agent hostname: 58e41e53f694
I0925 17:09:28.673107  5810 status_update_manager.cpp:177] Pausing sending status updates
I0925 17:09:28.674479  5806 state.cpp:64] Recovering state from '/tmp/Endpoint_SlaveEndpointTest_NoAuthorizer_0_5EUyoO/meta'
I0925 17:09:28.674835  5813 status_update_manager.cpp:203] Recovering status update manager
I0925 17:09:28.675101  5794 containerizer.cpp:648] Recovering containerizer
I0925 17:09:28.676818  5807 provisioner.cpp:416] Provisioner recovery complete
I0925 17:09:28.677219  5791 slave.cpp:6322] Finished recovery
I0925 17:09:28.677594  5791 slave.cpp:6504] Querying resource estimator for oversubscribable
resources
I0925 17:09:28.677922  5813 slave.cpp:6518] Received oversubscribable resources {} from the
resource estimator
I0925 17:09:28.680826  5809 process.cpp:3929] Handling HTTP event for process 'slave(815)'
with path: '/slave(815)/monitor/statistics'
I0925 17:09:28.682598  5797 http.cpp:1185] HTTP GET for /slave(815)/monitor/statistics from
172.17.0.2:43990
I0925 17:09:28.682678  5797 http.cpp:976] Authorizing principal 'test-principal' to GET the
'/monitor/statistics' endpoint
I0925 17:09:28.687260  5772 slave.cpp:869] Agent terminating
[       OK ] Endpoint/SlaveEndpointTest.NoAuthorizer/0 (37 ms)
[ RUN      ] Endpoint/SlaveEndpointTest.NoAuthorizer/1
I0925 17:09:28.700064  5772 containerizer.cpp:292] Using isolation { environment_secret, posix/cpu,
posix/mem, filesystem/posix, network/cni }
W0925 17:09:28.700551  5772 backend.cpp:76] Failed to create 'aufs' backend: AufsBackend requires
root privileges
W0925 17:09:28.700667  5772 backend.cpp:76] Failed to create 'bind' backend: BindBackend requires
root privileges
I0925 17:09:28.700716  5772 provisioner.cpp:255] Using default backend 'copy'
I0925 17:09:28.702530  5772 cluster.cpp:448] Creating default 'local' authorizer
I0925 17:09:28.704756  5808 slave.cpp:254] Mesos agent started on (816)@172.17.0.2:37602
I0925 17:09:28.704782  5808 slave.cpp:255] Flags at startup: --acls="" --appc_simple_discovery_uri_prefix="http://"
--appc_store_dir="/tmp/Endpoint_SlaveEndpointTest_NoAuthorizer_1_RG22GO/store/appc" --authenticate_http_readonly="true"
--authenticate_http_readwrite="true" --authenticatee="crammd5" --authentication_backoff_factor="1secs"
--authorizer="local" --cgroups_cpu_enable_pids_and_tids_count="false" --cgroups_enable_cfs="false"
--cgroups_hierarchy="/sys/fs/cgroup" --cgroups_limit_swap="false" --cgroups_root="mesos" --container_disk_watch_interval="15secs"
--containerizers="mesos" --credential="/tmp/Endpoint_SlaveEndpointTest_NoAuthorizer_1_RG22GO/credential"
--default_role="*" --disallow_sharing_agent_pid_namespace="false" --disk_watch_interval="1mins"
--docker="docker" --docker_kill_orphans="true" --docker_registry="https://registry-1.docker.io"
--docker_remove_delay="6hrs" --docker_socket="/var/run/docker.sock" --docker_stop_timeout="0ns"
--docker_store_dir="/tmp/Endpoint_SlaveEndpointTest_NoAuthorizer_1_RG22GO/store/docker" --docker_volume_checkpoint_dir="/var/run/mesos/isolators/docker/volume"
--enforce_container_disk_quota="false" --executor_registration_timeout="1mins" --executor_reregistration_timeout="2secs"
--executor_shutdown_grace_period="5secs" --fetcher_cache_dir="/tmp/Endpoint_SlaveEndpointTest_NoAuthorizer_1_RG22GO/fetch"
--fetcher_cache_size="2GB" --frameworks_home="" --gc_delay="1weeks" --gc_disk_headroom="0.1"
--hadoop_home="" --help="false" --hostname_lookup="true" --http_command_executor="false" --http_credentials="/tmp/Endpoint_SlaveEndpointTest_NoAuthorizer_1_RG22GO/http_credentials"
--http_heartbeat_interval="30secs" --initialize_driver_logging="true" --isolation="posix/cpu,posix/mem"
--launcher="posix" --launcher_dir="/mesos/mesos-1.5.0/_build/src" --logbufsecs="0" --logging_level="INFO"
--max_completed_executors_per_framework="150" --oversubscribed_resources_interval="15secs"
--perf_duration="10secs" --perf_interval="1mins" --port="5051" --qos_correction_interval_min="0ns"
--quiet="false" --recover="reconnect" --recovery_timeout="15mins" --registration_backoff_factor="10ms"
--resources="cpus:2;gpus:0;mem:1024;disk:1024;ports:[31000-32000]" --revocable_cpu_low_priority="true"
--runtime_dir="/tmp/Endpoint_SlaveEndpointTest_NoAuthorizer_1_RG22GO" --sandbox_directory="/mnt/mesos/sandbox"
--strict="true" --switch_user="true" --systemd_enable_support="true" --systemd_runtime_directory="/run/systemd/system"
--version="false" --work_dir="/tmp/Endpoint_SlaveEndpointTest_NoAuthorizer_1_RFM1Np" --zk_session_timeout="10secs"
I0925 17:09:28.705181  5808 credentials.hpp:86] Loading credential for authentication from
'/tmp/Endpoint_SlaveEndpointTest_NoAuthorizer_1_RG22GO/credential'
I0925 17:09:28.705377  5808 slave.cpp:287] Agent using credential for: test-principal
I0925 17:09:28.705402  5808 credentials.hpp:37] Loading credentials for authentication from
'/tmp/Endpoint_SlaveEndpointTest_NoAuthorizer_1_RG22GO/http_credentials'
I0925 17:09:28.705662  5808 http.cpp:1045] Creating default 'basic' HTTP authenticator for
realm 'mesos-agent-readonly'
I0925 17:09:28.705850  5808 http.cpp:1045] Creating default 'basic' HTTP authenticator for
realm 'mesos-agent-readwrite'
I0925 17:09:28.707365  5808 slave.cpp:585] Agent resources: [{"name":"cpus","scalar":{"value":2.0},"type":"SCALAR"},{"name":"mem","scalar":{"value":1024.0},"type":"SCALAR"},{"name":"disk","scalar":{"value":1024.0},"type":"SCALAR"},{"name":"ports","ranges":{"range":[{"begin":31000,"end":32000}]},"type":"RANGES"}]
I0925 17:09:28.707600  5808 slave.cpp:593] Agent attributes: [  ]
I0925 17:09:28.707613  5808 slave.cpp:602] Agent hostname: 58e41e53f694
I0925 17:09:28.707798  5796 status_update_manager.cpp:177] Pausing sending status updates
I0925 17:09:28.709338  5799 state.cpp:64] Recovering state from '/tmp/Endpoint_SlaveEndpointTest_NoAuthorizer_1_RFM1Np/meta'
I0925 17:09:28.709700  5810 status_update_manager.cpp:203] Recovering status update manager
I0925 17:09:28.709955  5810 containerizer.cpp:648] Recovering containerizer
I0925 17:09:28.711766  5797 provisioner.cpp:416] Provisioner recovery complete
I0925 17:09:28.712224  5801 slave.cpp:6322] Finished recovery
I0925 17:09:28.712700  5801 slave.cpp:6504] Querying resource estimator for oversubscribable
resources
I0925 17:09:28.713001  5804 slave.cpp:6518] Received oversubscribable resources {} from the
resource estimator
I0925 17:09:28.715333  5792 process.cpp:3929] Handling HTTP event for process 'slave(816)'
with path: '/slave(816)/monitor/statistics.json'
I0925 17:09:28.716753  5800 http.cpp:1185] HTTP GET for /slave(816)/monitor/statistics.json
from 172.17.0.2:43992
I0925 17:09:28.716840  5800 http.cpp:976] Authorizing principal 'test-principal' to GET the
'/monitor/statistics.json' endpoint
I0925 17:09:28.721767  5772 slave.cpp:869] Agent terminating
[       OK ] Endpoint/SlaveEndpointTest.NoAuthorizer/1 (35 ms)
[ RUN      ] Endpoint/SlaveEndpointTest.NoAuthorizer/2
I0925 17:09:28.738723  5772 containerizer.cpp:292] Using isolation { environment_secret, posix/cpu,
posix/mem, filesystem/posix, network/cni }
W0925 17:09:28.739398  5772 backend.cpp:76] Failed to create 'aufs' backend: AufsBackend requires
root privileges
W0925 17:09:28.739568  5772 backend.cpp:76] Failed to create 'bind' backend: BindBackend requires
root privileges
I0925 17:09:28.739624  5772 provisioner.cpp:255] Using default backend 'copy'
I0925 17:09:28.742427  5772 cluster.cpp:448] Creating default 'local' authorizer
I0925 17:09:28.745893  5801 slave.cpp:254] Mesos agent started on (817)@172.17.0.2:37602
I0925 17:09:28.745923  5801 slave.cpp:255] Flags at startup: --acls="" --appc_simple_discovery_uri_prefix="http://"
--appc_store_dir="/tmp/Endpoint_SlaveEndpointTest_NoAuthorizer_2_URMqxq/store/appc" --authenticate_http_readonly="true"
--authenticate_http_readwrite="true" --authenticatee="crammd5" --authentication_backoff_factor="1secs"
--authorizer="local" --cgroups_cpu_enable_pids_and_tids_count="false" --cgroups_enable_cfs="false"
--cgroups_hierarchy="/sys/fs/cgroup" --cgroups_limit_swap="false" --cgroups_root="mesos" --container_disk_watch_interval="15secs"
--containerizers="mesos" --credential="/tmp/Endpoint_SlaveEndpointTest_NoAuthorizer_2_URMqxq/credential"
--default_role="*" --disallow_sharing_agent_pid_namespace="false" --disk_watch_interval="1mins"
--docker="docker" --docker_kill_orphans="true" --docker_registry="https://registry-1.docker.io"
--docker_remove_delay="6hrs" --docker_socket="/var/run/docker.sock" --docker_stop_timeout="0ns"
--docker_store_dir="/tmp/Endpoint_SlaveEndpointTest_NoAuthorizer_2_URMqxq/store/docker" --docker_volume_checkpoint_dir="/var/run/mesos/isolators/docker/volume"
--enforce_container_disk_quota="false" --executor_registration_timeout="1mins" --executor_reregistration_timeout="2secs"
--executor_shutdown_grace_period="5secs" --fetcher_cache_dir="/tmp/Endpoint_SlaveEndpointTest_NoAuthorizer_2_URMqxq/fetch"
--fetcher_cache_size="2GB" --frameworks_home="" --gc_delay="1weeks" --gc_disk_headroom="0.1"
--hadoop_home="" --help="false" --hostname_lookup="true" --http_command_executor="false" --http_credentials="/tmp/Endpoint_SlaveEndpointTest_NoAuthorizer_2_URMqxq/http_credentials"
--http_heartbeat_interval="30secs" --initialize_driver_logging="true" --isolation="posix/cpu,posix/mem"
--launcher="posix" --launcher_dir="/mesos/mesos-1.5.0/_build/src" --logbufsecs="0" --logging_level="INFO"
--max_completed_executors_per_framework="150" --oversubscribed_resources_interval="15secs"
--perf_duration="10secs" --perf_interval="1mins" --port="5051" --qos_correction_interval_min="0ns"
--quiet="false" --recover="reconnect" --recovery_timeout="15mins" --registration_backoff_factor="10ms"
--resources="cpus:2;gpus:0;mem:1024;disk:1024;ports:[31000-32000]" --revocable_cpu_low_priority="true"
--runtime_dir="/tmp/Endpoint_SlaveEndpointTest_NoAuthorizer_2_URMqxq" --sandbox_directory="/mnt/mesos/sandbox"
--strict="true" --switch_user="true" --systemd_enable_support="true" --systemd_runtime_directory="/run/systemd/system"
--version="false" --work_dir="/tmp/Endpoint_SlaveEndpointTest_NoAuthorizer_2_6XNUy1" --zk_session_timeout="10secs"
I0925 17:09:28.746553  5801 credentials.hpp:86] Loading credential for authentication from
'/tmp/Endpoint_SlaveEndpointTest_NoAuthorizer_2_URMqxq/credential'
I0925 17:09:28.746742  5801 slave.cpp:287] Agent using credential for: test-principal
I0925 17:09:28.746785  5801 credentials.hpp:37] Loading credentials for authentication from
'/tmp/Endpoint_SlaveEndpointTest_NoAuthorizer_2_URMqxq/http_credentials'
I0925 17:09:28.747094  5801 http.cpp:1045] Creating default 'basic' HTTP authenticator for
realm 'mesos-agent-readonly'
I0925 17:09:28.747398  5801 http.cpp:1045] Creating default 'basic' HTTP authenticator for
realm 'mesos-agent-readwrite'
I0925 17:09:28.749356  5801 slave.cpp:585] Agent resources: [{"name":"cpus","scalar":{"value":2.0},"type":"SCALAR"},{"name":"mem","scalar":{"value":1024.0},"type":"SCALAR"},{"name":"disk","scalar":{"value":1024.0},"type":"SCALAR"},{"name":"ports","ranges":{"range":[{"begin":31000,"end":32000}]},"type":"RANGES"}]
I0925 17:09:28.749656  5801 slave.cpp:593] Agent attributes: [  ]
I0925 17:09:28.749672  5801 slave.cpp:602] Agent hostname: 58e41e53f694
I0925 17:09:28.749868  5797 status_update_manager.cpp:177] Pausing sending status updates
I0925 17:09:28.751566  5796 state.cpp:64] Recovering state from '/tmp/Endpoint_SlaveEndpointTest_NoAuthorizer_2_6XNUy1/meta'
I0925 17:09:28.752007  5807 status_update_manager.cpp:203] Recovering status update manager
I0925 17:09:28.752256  5806 containerizer.cpp:648] Recovering containerizer
I0925 17:09:28.753906  5803 provisioner.cpp:416] Provisioner recovery complete
I0925 17:09:28.754570  5793 slave.cpp:6322] Finished recovery
I0925 17:09:28.755254  5793 slave.cpp:6504] Querying resource estimator for oversubscribable
resources
I0925 17:09:28.755633  5808 slave.cpp:6518] Received oversubscribable resources {} from the
resource estimator
I0925 17:09:28.759277  5799 process.cpp:3929] Handling HTTP event for process 'slave(817)'
with path: '/slave(817)/containers'
I0925 17:09:28.760851  5795 http.cpp:1185] HTTP GET for /slave(817)/containers from 172.17.0.2:43994
I0925 17:09:28.760965  5795 http.cpp:976] Authorizing principal 'test-principal' to GET the
'/containers' endpoint
I0925 17:09:28.766315  5772 slave.cpp:869] Agent terminating
[       OK ] Endpoint/SlaveEndpointTest.NoAuthorizer/2 (44 ms)
[----------] 9 tests from Endpoint/SlaveEndpointTest (320 ms total)

[----------] 2 tests from ContainerizerType/DefaultContainerDNSFlagTest
[ RUN      ] ContainerizerType/DefaultContainerDNSFlagTest.ValidateFlag/0
[       OK ] ContainerizerType/DefaultContainerDNSFlagTest.ValidateFlag/0 (17 ms)
[ RUN      ] ContainerizerType/DefaultContainerDNSFlagTest.ValidateFlag/1
[       OK ] ContainerizerType/DefaultContainerDNSFlagTest.ValidateFlag/1 (15 ms)
[----------] 2 tests from ContainerizerType/DefaultContainerDNSFlagTest (32 ms total)

[----------] Global test environment tear-down
[==========] 1676 tests from 184 test cases ran. (632284 ms total)
[  PASSED  ] 1675 tests.
[  FAILED  ] 1 test, listed below:
[  FAILED  ] ExamplesTest.TestFramework

 1 FAILED TEST
  YOU HAVE 20 DISABLED TESTS

I0925 17:09:28.883908  5815 process.cpp:1068] Failed to accept socket: future discarded
make[4]: *** [check-local] Error 1
make[4]: Leaving directory `/mesos/mesos-1.5.0/_build/src'
make[3]: *** [check-am] Error 2
make[3]: Leaving directory `/mesos/mesos-1.5.0/_build/src'
make[2]: *** [check] Error 2
make[2]: Leaving directory `/mesos/mesos-1.5.0/_build/src'
make[1]: *** [check-recursive] Error 1
make[1]: Leaving directory `/mesos/mesos-1.5.0/_build'
make: *** [distcheck] Error 1
+ docker rmi mesos-1506355888-30621
Untagged: mesos-1506355888-30621:latest
Deleted: sha256:c5f9141b2dbbe1e4647cf5a3860e11e7ad2d59edbf92149825664e9395fb803e
Deleted: sha256:13b1a7d86807e08adc8a857df1361378e2bfb12fb2319ed9e6356e6cea0cd9e8
Deleted: sha256:684b70f12b8cb47ae4b25bb02a97cdf6c24ccfd4a6ba2185839d4ef470bdf851
Deleted: sha256:4def4e9632c1c60917b06aec0334db52717875cc3ac0c5a4d961de7eace9b799
Deleted: sha256:8751941e1608bbd30718e0a05b66c9e7808d7de75eace73041504b5f126c969f
Deleted: sha256:80f40f8b3db226de23cfec0d2e01e85fd74643bb6a78da437280a0936b86e3aa
Deleted: sha256:72c25aed90fe14b36bc1f9c5bed19e2cfd6395a691839df0000ff30c784c5fa9
Deleted: sha256:afc91349a95e4b6ce7cf25606eaab10fe7cc520b84376e69bf261f1c22ef5977
Deleted: sha256:d1f771196c5a5ce63b3e17f6ff73c130bc7f6e6c89abcecc19e6b50689c23d49
Deleted: sha256:28d8a7bdb6169d308d6f14c418e5a682b9000c380ddffe551f869ea88b94601e
Deleted: sha256:c799b3c66e9ffeda7784f0737d186d3b6608155be59415740e0d33773a3a7435
Deleted: sha256:b71632c83921721d9ad6f88db71c3da2224f82731b76b805048e0e201ec875a8
Deleted: sha256:2a0753ee06c9b17cb7f6104beeb703439e9ce8fd1caeec1582c3765595972f65
Deleted: sha256:9ad0ef5926dcd93f778772568679ce640338dca8b6aeb190c3baaf20ae0a18c3
Deleted: sha256:84130755d50fd69a73e9568e245adcf40adb44eba3f2ab9a00110d7ff2bd7d17
Deleted: sha256:f9391aea6b981fec76a7d669d2e6847b0b7fc38f98833a9707d2be9ef1afad3f
Deleted: sha256:c7735ffd9ecfe0e6a76c6bb2935130883c4a1a031dd363c24ef3dbcbff5a2903
Deleted: sha256:5437f50baaa8f41c2f952607af22f54c739bcfe54df5471a689aaa852cd5d00c
Deleted: sha256:b642f3143488d941d8096b851e0b57cab61b951f4e93917e52f3352abee69759
Deleted: sha256:23cae5921aa2fb79ddb458cdb01b5f2e4d9a109202db1d25db24e5c9ae62aa02
Deleted: sha256:2782aa945ea3d8a997583eb309f2eb44248af2e23f6567743f4f3ae44758c365
Deleted: sha256:c1a6c7fcfdb90a94a65ff4d5b468c31b475e96d508c2e7927ea8ed662df3d9ae
Deleted: sha256:6e2e683cbca7eda70066c3102829b47d95c3f6104120690315720312bafc4d2a
Deleted: sha256:ce4f8b88267a46238a02c0cad863de95005c1b5a09fe4d5a68eb8e5723d9f45a
Deleted: sha256:c5d7d41e746586aa0be1c43160f54275da2e78c4b3633d63348f6934fba8f9a9
Deleted: sha256:592a0969d76765e2d741489cdf8e5b01f9086aa42beb05118c20894b85fb960d
Deleted: sha256:cc9f3e088ffa443663e10b6d1dc4f064836c25ff0e9ea816dc22e444a40aecd8
Deleted: sha256:8819c83a79c777309d1ca6fd79500cffae156e1492e88af2ec701ce71d738541
Build step 'Execute shell' marked build as failure

Mime
View raw message