mesos-builds mailing list archives

Site index · List index
Message view « Date » · « Thread »
Top « Date » · « Thread »
From Apache Jenkins Server <jenk...@builds.apache.org>
Subject Build failed in Jenkins: Mesos-Buildbot » cmake,clang,--verbose --enable-libevent --enable-ssl,GLOG_v=1 MESOS_VERBOSE=1,ubuntu:14.04,(ubuntu)&&(!ubuntu-us1)&&(!ubuntu-eu2)&&(!qnode3)&&(!H23) #4240
Date Tue, 19 Sep 2017 18:46:09 GMT
See <https://builds.apache.org/job/Mesos-Buildbot/BUILDTOOL=cmake,COMPILER=clang,CONFIGURATION=--verbose%20--enable-libevent%20--enable-ssl,ENVIRONMENT=GLOG_v=1%20MESOS_VERBOSE=1,OS=ubuntu%3A14.04,label_exp=(ubuntu)&&(!ubuntu-us1)&&(!ubuntu-eu2)&&(!qnode3)&&(!H23)/4240/display/redirect?page=changes>

Changes:

[yujie.jay] Added a link to secrets doc from container volume doc.

------------------------------------------
[...truncated 1.14 MB...]
[ 81%] Building CXX object src/tests/CMakeFiles/test-helper.dir/utils.cpp.o
cd /mesos/build/src/tests && /usr/bin/clang++-3.5  -DBUILD_DIR=\"/mesos/build\" -DBUILD_FLAGS=\"\" -DBUILD_JAVA_JVM_LIBRARY=\"\" -DHAS_AUTHENTICATION=1 -DHAVE_LIBZ -DLIBDIR=\"/usr/local/libmesos\" -DPICOJSON_USE_INT64 -DPKGDATADIR=\"/usr/local/share/mesos\" -DPKGLIBEXECDIR=\"/usr/local/libexec/mesos\" -DPKGMODULEDIR=\"\" -DSBINDIR=\"\" -DSOURCE_DIR=\"/mesos\" -DTESTLIBEXECDIR=\"\" -DUSE_CMAKE_BUILD_CONFIG -DUSE_SSL_SOCKET=1 -DUSE_STATIC_LIB -DVERSION=\"1.5.0\" -DZOOKEEPER_VERSION=\"3.4.8\" -D__STDC_FORMAT_MACROS -I/mesos/include -I/mesos/build/include -I/mesos/build/include/mesos -I/mesos/build/src -I/mesos/src -I/mesos/3rdparty/libprocess/src/../include -I/mesos/3rdparty/stout/include -isystem /usr/include/apr-1.0 -isystem /mesos/build/3rdparty/boost-1.53.0/src/boost-1.53.0 -isystem /mesos/build/3rdparty/elfio-3.2/src/elfio-3.2 -isystem /mesos/build/3rdparty/glog-0.3.3/src/glog-0.3.3-build/include -isystem /mesos/build/3rdparty/picojson-1.3.0/src/picojson-1.3.0 -isystem /mesos/build/3rdparty/protobuf-3.3.0/src/protobuf-3.3.0/src -isystem /usr/include/subversion-1 -isystem /mesos/build/3rdparty/http_parser-2.6.2/src/http_parser-2.6.2 -isystem /mesos/build/3rdparty/zookeeper-3.4.8/src/zookeeper-3.4.8/src/c/include -isystem /mesos/build/3rdparty/zookeeper-3.4.8/src/zookeeper-3.4.8/src/c/generated -isystem /mesos/build/3rdparty/nvml-352.79/src/nvml-352.79 -isystem /mesos/build/3rdparty/leveldb-1.19/src/leveldb-1.19/include -isystem /mesos/build/3rdparty/googletest-1.8.0/src/googletest-1.8.0/googlemock/include -isystem /mesos/build/3rdparty/googletest-1.8.0/src/googletest-1.8.0/googletest/include  -std=c++11 -Wformat-security -fstack-protector-strong -fPIE   -o CMakeFiles/test-helper.dir/utils.cpp.o -c /mesos/src/tests/utils.cpp
[ 81%] Building CXX object src/tests/CMakeFiles/test-helper.dir/kill_policy_test_helper.cpp.o
cd /mesos/build/src/tests && /usr/bin/clang++-3.5  -DBUILD_DIR=\"/mesos/build\" -DBUILD_FLAGS=\"\" -DBUILD_JAVA_JVM_LIBRARY=\"\" -DHAS_AUTHENTICATION=1 -DHAVE_LIBZ -DLIBDIR=\"/usr/local/libmesos\" -DPICOJSON_USE_INT64 -DPKGDATADIR=\"/usr/local/share/mesos\" -DPKGLIBEXECDIR=\"/usr/local/libexec/mesos\" -DPKGMODULEDIR=\"\" -DSBINDIR=\"\" -DSOURCE_DIR=\"/mesos\" -DTESTLIBEXECDIR=\"\" -DUSE_CMAKE_BUILD_CONFIG -DUSE_SSL_SOCKET=1 -DUSE_STATIC_LIB -DVERSION=\"1.5.0\" -DZOOKEEPER_VERSION=\"3.4.8\" -D__STDC_FORMAT_MACROS -I/mesos/include -I/mesos/build/include -I/mesos/build/include/mesos -I/mesos/build/src -I/mesos/src -I/mesos/3rdparty/libprocess/src/../include -I/mesos/3rdparty/stout/include -isystem /usr/include/apr-1.0 -isystem /mesos/build/3rdparty/boost-1.53.0/src/boost-1.53.0 -isystem /mesos/build/3rdparty/elfio-3.2/src/elfio-3.2 -isystem /mesos/build/3rdparty/glog-0.3.3/src/glog-0.3.3-build/include -isystem /mesos/build/3rdparty/picojson-1.3.0/src/picojson-1.3.0 -isystem /mesos/build/3rdparty/protobuf-3.3.0/src/protobuf-3.3.0/src -isystem /usr/include/subversion-1 -isystem /mesos/build/3rdparty/http_parser-2.6.2/src/http_parser-2.6.2 -isystem /mesos/build/3rdparty/zookeeper-3.4.8/src/zookeeper-3.4.8/src/c/include -isystem /mesos/build/3rdparty/zookeeper-3.4.8/src/zookeeper-3.4.8/src/c/generated -isystem /mesos/build/3rdparty/nvml-352.79/src/nvml-352.79 -isystem /mesos/build/3rdparty/leveldb-1.19/src/leveldb-1.19/include -isystem /mesos/build/3rdparty/googletest-1.8.0/src/googletest-1.8.0/googlemock/include -isystem /mesos/build/3rdparty/googletest-1.8.0/src/googletest-1.8.0/googletest/include  -std=c++11 -Wformat-security -fstack-protector-strong -fPIE   -o CMakeFiles/test-helper.dir/kill_policy_test_helper.cpp.o -c /mesos/src/tests/kill_policy_test_helper.cpp
[ 81%] Building CXX object src/tests/CMakeFiles/test-helper.dir/containerizer/memory_test_helper.cpp.o
cd /mesos/build/src/tests && /usr/bin/clang++-3.5  -DBUILD_DIR=\"/mesos/build\" -DBUILD_FLAGS=\"\" -DBUILD_JAVA_JVM_LIBRARY=\"\" -DHAS_AUTHENTICATION=1 -DHAVE_LIBZ -DLIBDIR=\"/usr/local/libmesos\" -DPICOJSON_USE_INT64 -DPKGDATADIR=\"/usr/local/share/mesos\" -DPKGLIBEXECDIR=\"/usr/local/libexec/mesos\" -DPKGMODULEDIR=\"\" -DSBINDIR=\"\" -DSOURCE_DIR=\"/mesos\" -DTESTLIBEXECDIR=\"\" -DUSE_CMAKE_BUILD_CONFIG -DUSE_SSL_SOCKET=1 -DUSE_STATIC_LIB -DVERSION=\"1.5.0\" -DZOOKEEPER_VERSION=\"3.4.8\" -D__STDC_FORMAT_MACROS -I/mesos/include -I/mesos/build/include -I/mesos/build/include/mesos -I/mesos/build/src -I/mesos/src -I/mesos/3rdparty/libprocess/src/../include -I/mesos/3rdparty/stout/include -isystem /usr/include/apr-1.0 -isystem /mesos/build/3rdparty/boost-1.53.0/src/boost-1.53.0 -isystem /mesos/build/3rdparty/elfio-3.2/src/elfio-3.2 -isystem /mesos/build/3rdparty/glog-0.3.3/src/glog-0.3.3-build/include -isystem /mesos/build/3rdparty/picojson-1.3.0/src/picojson-1.3.0 -isystem /mesos/build/3rdparty/protobuf-3.3.0/src/protobuf-3.3.0/src -isystem /usr/include/subversion-1 -isystem /mesos/build/3rdparty/http_parser-2.6.2/src/http_parser-2.6.2 -isystem /mesos/build/3rdparty/zookeeper-3.4.8/src/zookeeper-3.4.8/src/c/include -isystem /mesos/build/3rdparty/zookeeper-3.4.8/src/zookeeper-3.4.8/src/c/generated -isystem /mesos/build/3rdparty/nvml-352.79/src/nvml-352.79 -isystem /mesos/build/3rdparty/leveldb-1.19/src/leveldb-1.19/include -isystem /mesos/build/3rdparty/googletest-1.8.0/src/googletest-1.8.0/googlemock/include -isystem /mesos/build/3rdparty/googletest-1.8.0/src/googletest-1.8.0/googletest/include  -std=c++11 -Wformat-security -fstack-protector-strong -fPIE   -o CMakeFiles/test-helper.dir/containerizer/memory_test_helper.cpp.o -c /mesos/src/tests/containerizer/memory_test_helper.cpp
[ 81%] Building CXX object src/tests/CMakeFiles/test-helper.dir/containerizer/capabilities_test_helper.cpp.o
cd /mesos/build/src/tests && /usr/bin/clang++-3.5  -DBUILD_DIR=\"/mesos/build\" -DBUILD_FLAGS=\"\" -DBUILD_JAVA_JVM_LIBRARY=\"\" -DHAS_AUTHENTICATION=1 -DHAVE_LIBZ -DLIBDIR=\"/usr/local/libmesos\" -DPICOJSON_USE_INT64 -DPKGDATADIR=\"/usr/local/share/mesos\" -DPKGLIBEXECDIR=\"/usr/local/libexec/mesos\" -DPKGMODULEDIR=\"\" -DSBINDIR=\"\" -DSOURCE_DIR=\"/mesos\" -DTESTLIBEXECDIR=\"\" -DUSE_CMAKE_BUILD_CONFIG -DUSE_SSL_SOCKET=1 -DUSE_STATIC_LIB -DVERSION=\"1.5.0\" -DZOOKEEPER_VERSION=\"3.4.8\" -D__STDC_FORMAT_MACROS -I/mesos/include -I/mesos/build/include -I/mesos/build/include/mesos -I/mesos/build/src -I/mesos/src -I/mesos/3rdparty/libprocess/src/../include -I/mesos/3rdparty/stout/include -isystem /usr/include/apr-1.0 -isystem /mesos/build/3rdparty/boost-1.53.0/src/boost-1.53.0 -isystem /mesos/build/3rdparty/elfio-3.2/src/elfio-3.2 -isystem /mesos/build/3rdparty/glog-0.3.3/src/glog-0.3.3-build/include -isystem /mesos/build/3rdparty/picojson-1.3.0/src/picojson-1.3.0 -isystem /mesos/build/3rdparty/protobuf-3.3.0/src/protobuf-3.3.0/src -isystem /usr/include/subversion-1 -isystem /mesos/build/3rdparty/http_parser-2.6.2/src/http_parser-2.6.2 -isystem /mesos/build/3rdparty/zookeeper-3.4.8/src/zookeeper-3.4.8/src/c/include -isystem /mesos/build/3rdparty/zookeeper-3.4.8/src/zookeeper-3.4.8/src/c/generated -isystem /mesos/build/3rdparty/nvml-352.79/src/nvml-352.79 -isystem /mesos/build/3rdparty/leveldb-1.19/src/leveldb-1.19/include -isystem /mesos/build/3rdparty/googletest-1.8.0/src/googletest-1.8.0/googlemock/include -isystem /mesos/build/3rdparty/googletest-1.8.0/src/googletest-1.8.0/googletest/include  -std=c++11 -Wformat-security -fstack-protector-strong -fPIE   -o CMakeFiles/test-helper.dir/containerizer/capabilities_test_helper.cpp.o -c /mesos/src/tests/containerizer/capabilities_test_helper.cpp
[ 81%] Building CXX object src/tests/CMakeFiles/test-helper.dir/containerizer/setns_test_helper.cpp.o
cd /mesos/build/src/tests && /usr/bin/clang++-3.5  -DBUILD_DIR=\"/mesos/build\" -DBUILD_FLAGS=\"\" -DBUILD_JAVA_JVM_LIBRARY=\"\" -DHAS_AUTHENTICATION=1 -DHAVE_LIBZ -DLIBDIR=\"/usr/local/libmesos\" -DPICOJSON_USE_INT64 -DPKGDATADIR=\"/usr/local/share/mesos\" -DPKGLIBEXECDIR=\"/usr/local/libexec/mesos\" -DPKGMODULEDIR=\"\" -DSBINDIR=\"\" -DSOURCE_DIR=\"/mesos\" -DTESTLIBEXECDIR=\"\" -DUSE_CMAKE_BUILD_CONFIG -DUSE_SSL_SOCKET=1 -DUSE_STATIC_LIB -DVERSION=\"1.5.0\" -DZOOKEEPER_VERSION=\"3.4.8\" -D__STDC_FORMAT_MACROS -I/mesos/include -I/mesos/build/include -I/mesos/build/include/mesos -I/mesos/build/src -I/mesos/src -I/mesos/3rdparty/libprocess/src/../include -I/mesos/3rdparty/stout/include -isystem /usr/include/apr-1.0 -isystem /mesos/build/3rdparty/boost-1.53.0/src/boost-1.53.0 -isystem /mesos/build/3rdparty/elfio-3.2/src/elfio-3.2 -isystem /mesos/build/3rdparty/glog-0.3.3/src/glog-0.3.3-build/include -isystem /mesos/build/3rdparty/picojson-1.3.0/src/picojson-1.3.0 -isystem /mesos/build/3rdparty/protobuf-3.3.0/src/protobuf-3.3.0/src -isystem /usr/include/subversion-1 -isystem /mesos/build/3rdparty/http_parser-2.6.2/src/http_parser-2.6.2 -isystem /mesos/build/3rdparty/zookeeper-3.4.8/src/zookeeper-3.4.8/src/c/include -isystem /mesos/build/3rdparty/zookeeper-3.4.8/src/zookeeper-3.4.8/src/c/generated -isystem /mesos/build/3rdparty/nvml-352.79/src/nvml-352.79 -isystem /mesos/build/3rdparty/leveldb-1.19/src/leveldb-1.19/include -isystem /mesos/build/3rdparty/googletest-1.8.0/src/googletest-1.8.0/googlemock/include -isystem /mesos/build/3rdparty/googletest-1.8.0/src/googletest-1.8.0/googletest/include  -std=c++11 -Wformat-security -fstack-protector-strong -fPIE   -o CMakeFiles/test-helper.dir/containerizer/setns_test_helper.cpp.o -c /mesos/src/tests/containerizer/setns_test_helper.cpp
[ 81%] Linking CXX executable ../test-helper
cd /mesos/build/src/tests && /usr/local/bin/cmake -E cmake_link_script CMakeFiles/test-helper.dir/link.txt --verbose=1
/usr/bin/clang++-3.5   -std=c++11 -Wformat-security -fstack-protector-strong   CMakeFiles/test-helper.dir/active_user_test_helper.cpp.o CMakeFiles/test-helper.dir/flags.cpp.o CMakeFiles/test-helper.dir/http_server_test_helper.cpp.o CMakeFiles/test-helper.dir/resources_utils.cpp.o CMakeFiles/test-helper.dir/test_helper_main.cpp.o CMakeFiles/test-helper.dir/utils.cpp.o CMakeFiles/test-helper.dir/kill_policy_test_helper.cpp.o CMakeFiles/test-helper.dir/containerizer/memory_test_helper.cpp.o CMakeFiles/test-helper.dir/containerizer/capabilities_test_helper.cpp.o CMakeFiles/test-helper.dir/containerizer/setns_test_helper.cpp.o  -o ../test-helper -Wl,-rpath,/mesos/build/src/.libs:/mesos/build/3rdparty/libprocess/src:/mesos/build/3rdparty/glog-0.3.3/src/glog-0.3.3-build/lib:/mesos/build/3rdparty/libevent-2.1.5-beta/src/libevent-2.1.5-beta-build/lib:/mesos/build/src:/mesos/build/3rdparty/protobuf-3.3.0/src/protobuf-3.3.0-build ../.libs/libmesos.so.1.5.0 ../../3rdparty/libprocess/src/libprocess.so /usr/lib/x86_64-linux-gnu/libapr-1.so /usr/lib/x86_64-linux-gnu/libcurl.so ../../3rdparty/glog-0.3.3/src/glog-0.3.3-build/lib/libglog.so -lpthread /usr/lib/x86_64-linux-gnu/libz.so -lrt -ldl /usr/lib/x86_64-linux-gnu/libsvn_delta-1.so /usr/lib/x86_64-linux-gnu/libsvn_diff-1.so /usr/lib/x86_64-linux-gnu/libsvn_subr-1.so ../../3rdparty/http_parser-2.6.2/src/http_parser-2.6.2-build/libhttp_parser.a /usr/lib/x86_64-linux-gnu/libssl.so /usr/lib/x86_64-linux-gnu/libcrypto.so ../../3rdparty/zookeeper-3.4.8/src/zookeeper-3.4.8-build/libzookeeper.a ../../3rdparty/zookeeper-3.4.8/src/zookeeper-3.4.8-build/libhashtable.a ../libmesos-protobufs.so ../../3rdparty/protobuf-3.3.0/src/protobuf-3.3.0-build/libprotobuf.so ../../3rdparty/leveldb-1.19/src/leveldb-1.19/out-static/libleveldb.a -lsasl2 ../../3rdparty/googletest-1.8.0/src/googletest-1.8.0-build/googlemock/libgmock.a ../../3rdparty/googletest-1.8.0/src/googletest-1.8.0-build/googlemock/gtest/libgtest.a ../.libs/libload_qos_controller.so ../.libs/libfixed_resource_estimator.so ../.libs/liblogrotate_container_logger.so -Wl,-rpath-link,/mesos/build/3rdparty/libevent-2.1.5-beta/src/libevent-2.1.5-beta-build/lib 
make[3]: Leaving directory `/mesos/build'
[ 81%] Built target test-helper
make -f src/tests/CMakeFiles/mesos-tests.dir/build.make src/tests/CMakeFiles/mesos-tests.dir/depend
make[3]: Entering directory `/mesos/build'
cd /mesos/build && /usr/local/bin/cmake -E cmake_depends "Unix Makefiles" /mesos /mesos/src/tests /mesos/build /mesos/build/src/tests /mesos/build/src/tests/CMakeFiles/mesos-tests.dir/DependInfo.cmake --color=
Scanning dependencies of target mesos-tests
make[3]: Leaving directory `/mesos/build'
make -f src/tests/CMakeFiles/mesos-tests.dir/build.make src/tests/CMakeFiles/mesos-tests.dir/build
make[3]: Entering directory `/mesos/build'
[ 81%] Building CXX object src/tests/CMakeFiles/mesos-tests.dir/active_user_test_helper.cpp.o
cd /mesos/build/src/tests && /usr/bin/clang++-3.5  -DBUILD_DIR=\"/mesos/build\" -DBUILD_FLAGS=\"\" -DBUILD_JAVA_JVM_LIBRARY=\"\" -DHAS_AUTHENTICATION=1 -DHAVE_LIBZ -DLIBDIR=\"/usr/local/libmesos\" -DPICOJSON_USE_INT64 -DPKGDATADIR=\"/usr/local/share/mesos\" -DPKGLIBEXECDIR=\"/usr/local/libexec/mesos\" -DPKGMODULEDIR=\"\" -DSBINDIR=\"\" -DSOURCE_DIR=\"/mesos\" -DTESTLIBEXECDIR=\"\" -DUSE_CMAKE_BUILD_CONFIG -DUSE_SSL_SOCKET=1 -DUSE_STATIC_LIB -DVERSION=\"1.5.0\" -DZOOKEEPER_VERSION=\"3.4.8\" -D__STDC_FORMAT_MACROS -I/mesos/include -I/mesos/build/include -I/mesos/build/include/mesos -I/mesos/build/src -I/mesos/src -I/mesos/3rdparty/libprocess/src/../include -I/mesos/3rdparty/stout/include -isystem /usr/include/apr-1.0 -isystem /mesos/build/3rdparty/boost-1.53.0/src/boost-1.53.0 -isystem /mesos/build/3rdparty/elfio-3.2/src/elfio-3.2 -isystem /mesos/build/3rdparty/glog-0.3.3/src/glog-0.3.3-build/include -isystem /mesos/build/3rdparty/picojson-1.3.0/src/picojson-1.3.0 -isystem /mesos/build/3rdparty/protobuf-3.3.0/src/protobuf-3.3.0/src -isystem /usr/include/subversion-1 -isystem /mesos/build/3rdparty/http_parser-2.6.2/src/http_parser-2.6.2 -isystem /mesos/build/3rdparty/zookeeper-3.4.8/src/zookeeper-3.4.8/src/c/include -isystem /mesos/build/3rdparty/zookeeper-3.4.8/src/zookeeper-3.4.8/src/c/generated -isystem /mesos/build/3rdparty/nvml-352.79/src/nvml-352.79 -isystem /mesos/build/3rdparty/leveldb-1.19/src/leveldb-1.19/include -isystem /mesos/build/3rdparty/googletest-1.8.0/src/googletest-1.8.0/googlemock/include -isystem /mesos/build/3rdparty/googletest-1.8.0/src/googletest-1.8.0/googletest/include  -std=c++11 -Wformat-security -fstack-protector-strong -fPIE   -o CMakeFiles/mesos-tests.dir/active_user_test_helper.cpp.o -c /mesos/src/tests/active_user_test_helper.cpp
[ 81%] Building CXX object src/tests/CMakeFiles/mesos-tests.dir/cluster.cpp.o
cd /mesos/build/src/tests && /usr/bin/clang++-3.5  -DBUILD_DIR=\"/mesos/build\" -DBUILD_FLAGS=\"\" -DBUILD_JAVA_JVM_LIBRARY=\"\" -DHAS_AUTHENTICATION=1 -DHAVE_LIBZ -DLIBDIR=\"/usr/local/libmesos\" -DPICOJSON_USE_INT64 -DPKGDATADIR=\"/usr/local/share/mesos\" -DPKGLIBEXECDIR=\"/usr/local/libexec/mesos\" -DPKGMODULEDIR=\"\" -DSBINDIR=\"\" -DSOURCE_DIR=\"/mesos\" -DTESTLIBEXECDIR=\"\" -DUSE_CMAKE_BUILD_CONFIG -DUSE_SSL_SOCKET=1 -DUSE_STATIC_LIB -DVERSION=\"1.5.0\" -DZOOKEEPER_VERSION=\"3.4.8\" -D__STDC_FORMAT_MACROS -I/mesos/include -I/mesos/build/include -I/mesos/build/include/mesos -I/mesos/build/src -I/mesos/src -I/mesos/3rdparty/libprocess/src/../include -I/mesos/3rdparty/stout/include -isystem /usr/include/apr-1.0 -isystem /mesos/build/3rdparty/boost-1.53.0/src/boost-1.53.0 -isystem /mesos/build/3rdparty/elfio-3.2/src/elfio-3.2 -isystem /mesos/build/3rdparty/glog-0.3.3/src/glog-0.3.3-build/include -isystem /mesos/build/3rdparty/picojson-1.3.0/src/picojson-1.3.0 -isystem /mesos/build/3rdparty/protobuf-3.3.0/src/protobuf-3.3.0/src -isystem /usr/include/subversion-1 -isystem /mesos/build/3rdparty/http_parser-2.6.2/src/http_parser-2.6.2 -isystem /mesos/build/3rdparty/zookeeper-3.4.8/src/zookeeper-3.4.8/src/c/include -isystem /mesos/build/3rdparty/zookeeper-3.4.8/src/zookeeper-3.4.8/src/c/generated -isystem /mesos/build/3rdparty/nvml-352.79/src/nvml-352.79 -isystem /mesos/build/3rdparty/leveldb-1.19/src/leveldb-1.19/include -isystem /mesos/build/3rdparty/googletest-1.8.0/src/googletest-1.8.0/googlemock/include -isystem /mesos/build/3rdparty/googletest-1.8.0/src/googletest-1.8.0/googletest/include  -std=c++11 -Wformat-security -fstack-protector-strong -fPIE   -o CMakeFiles/mesos-tests.dir/cluster.cpp.o -c /mesos/src/tests/cluster.cpp
[ 81%] Building CXX object src/tests/CMakeFiles/mesos-tests.dir/containerizer.cpp.o
cd /mesos/build/src/tests && /usr/bin/clang++-3.5  -DBUILD_DIR=\"/mesos/build\" -DBUILD_FLAGS=\"\" -DBUILD_JAVA_JVM_LIBRARY=\"\" -DHAS_AUTHENTICATION=1 -DHAVE_LIBZ -DLIBDIR=\"/usr/local/libmesos\" -DPICOJSON_USE_INT64 -DPKGDATADIR=\"/usr/local/share/mesos\" -DPKGLIBEXECDIR=\"/usr/local/libexec/mesos\" -DPKGMODULEDIR=\"\" -DSBINDIR=\"\" -DSOURCE_DIR=\"/mesos\" -DTESTLIBEXECDIR=\"\" -DUSE_CMAKE_BUILD_CONFIG -DUSE_SSL_SOCKET=1 -DUSE_STATIC_LIB -DVERSION=\"1.5.0\" -DZOOKEEPER_VERSION=\"3.4.8\" -D__STDC_FORMAT_MACROS -I/mesos/include -I/mesos/build/include -I/mesos/build/include/mesos -I/mesos/build/src -I/mesos/src -I/mesos/3rdparty/libprocess/src/../include -I/mesos/3rdparty/stout/include -isystem /usr/include/apr-1.0 -isystem /mesos/build/3rdparty/boost-1.53.0/src/boost-1.53.0 -isystem /mesos/build/3rdparty/elfio-3.2/src/elfio-3.2 -isystem /mesos/build/3rdparty/glog-0.3.3/src/glog-0.3.3-build/include -isystem /mesos/build/3rdparty/picojson-1.3.0/src/picojson-1.3.0 -isystem /mesos/build/3rdparty/protobuf-3.3.0/src/protobuf-3.3.0/src -isystem /usr/include/subversion-1 -isystem /mesos/build/3rdparty/http_parser-2.6.2/src/http_parser-2.6.2 -isystem /mesos/build/3rdparty/zookeeper-3.4.8/src/zookeeper-3.4.8/src/c/include -isystem /mesos/build/3rdparty/zookeeper-3.4.8/src/zookeeper-3.4.8/src/c/generated -isystem /mesos/build/3rdparty/nvml-352.79/src/nvml-352.79 -isystem /mesos/build/3rdparty/leveldb-1.19/src/leveldb-1.19/include -isystem /mesos/build/3rdparty/googletest-1.8.0/src/googletest-1.8.0/googlemock/include -isystem /mesos/build/3rdparty/googletest-1.8.0/src/googletest-1.8.0/googletest/include  -std=c++11 -Wformat-security -fstack-protector-strong -fPIE   -o CMakeFiles/mesos-tests.dir/containerizer.cpp.o -c /mesos/src/tests/containerizer.cpp
[ 81%] Building CXX object src/tests/CMakeFiles/mesos-tests.dir/flags.cpp.o
cd /mesos/build/src/tests && /usr/bin/clang++-3.5  -DBUILD_DIR=\"/mesos/build\" -DBUILD_FLAGS=\"\" -DBUILD_JAVA_JVM_LIBRARY=\"\" -DHAS_AUTHENTICATION=1 -DHAVE_LIBZ -DLIBDIR=\"/usr/local/libmesos\" -DPICOJSON_USE_INT64 -DPKGDATADIR=\"/usr/local/share/mesos\" -DPKGLIBEXECDIR=\"/usr/local/libexec/mesos\" -DPKGMODULEDIR=\"\" -DSBINDIR=\"\" -DSOURCE_DIR=\"/mesos\" -DTESTLIBEXECDIR=\"\" -DUSE_CMAKE_BUILD_CONFIG -DUSE_SSL_SOCKET=1 -DUSE_STATIC_LIB -DVERSION=\"1.5.0\" -DZOOKEEPER_VERSION=\"3.4.8\" -D__STDC_FORMAT_MACROS -I/mesos/include -I/mesos/build/include -I/mesos/build/include/mesos -I/mesos/build/src -I/mesos/src -I/mesos/3rdparty/libprocess/src/../include -I/mesos/3rdparty/stout/include -isystem /usr/include/apr-1.0 -isystem /mesos/build/3rdparty/boost-1.53.0/src/boost-1.53.0 -isystem /mesos/build/3rdparty/elfio-3.2/src/elfio-3.2 -isystem /mesos/build/3rdparty/glog-0.3.3/src/glog-0.3.3-build/include -isystem /mesos/build/3rdparty/picojson-1.3.0/src/picojson-1.3.0 -isystem /mesos/build/3rdparty/protobuf-3.3.0/src/protobuf-3.3.0/src -isystem /usr/include/subversion-1 -isystem /mesos/build/3rdparty/http_parser-2.6.2/src/http_parser-2.6.2 -isystem /mesos/build/3rdparty/zookeeper-3.4.8/src/zookeeper-3.4.8/src/c/include -isystem /mesos/build/3rdparty/zookeeper-3.4.8/src/zookeeper-3.4.8/src/c/generated -isystem /mesos/build/3rdparty/nvml-352.79/src/nvml-352.79 -isystem /mesos/build/3rdparty/leveldb-1.19/src/leveldb-1.19/include -isystem /mesos/build/3rdparty/googletest-1.8.0/src/googletest-1.8.0/googlemock/include -isystem /mesos/build/3rdparty/googletest-1.8.0/src/googletest-1.8.0/googletest/include  -std=c++11 -Wformat-security -fstack-protector-strong -fPIE   -o CMakeFiles/mesos-tests.dir/flags.cpp.o -c /mesos/src/tests/flags.cpp
[ 81%] Building CXX object src/tests/CMakeFiles/mesos-tests.dir/http_server_test_helper.cpp.o
cd /mesos/build/src/tests && /usr/bin/clang++-3.5  -DBUILD_DIR=\"/mesos/build\" -DBUILD_FLAGS=\"\" -DBUILD_JAVA_JVM_LIBRARY=\"\" -DHAS_AUTHENTICATION=1 -DHAVE_LIBZ -DLIBDIR=\"/usr/local/libmesos\" -DPICOJSON_USE_INT64 -DPKGDATADIR=\"/usr/local/share/mesos\" -DPKGLIBEXECDIR=\"/usr/local/libexec/mesos\" -DPKGMODULEDIR=\"\" -DSBINDIR=\"\" -DSOURCE_DIR=\"/mesos\" -DTESTLIBEXECDIR=\"\" -DUSE_CMAKE_BUILD_CONFIG -DUSE_SSL_SOCKET=1 -DUSE_STATIC_LIB -DVERSION=\"1.5.0\" -DZOOKEEPER_VERSION=\"3.4.8\" -D__STDC_FORMAT_MACROS -I/mesos/include -I/mesos/build/include -I/mesos/build/include/mesos -I/mesos/build/src -I/mesos/src -I/mesos/3rdparty/libprocess/src/../include -I/mesos/3rdparty/stout/include -isystem /usr/include/apr-1.0 -isystem /mesos/build/3rdparty/boost-1.53.0/src/boost-1.53.0 -isystem /mesos/build/3rdparty/elfio-3.2/src/elfio-3.2 -isystem /mesos/build/3rdparty/glog-0.3.3/src/glog-0.3.3-build/include -isystem /mesos/build/3rdparty/picojson-1.3.0/src/picojson-1.3.0 -isystem /mesos/build/3rdparty/protobuf-3.3.0/src/protobuf-3.3.0/src -isystem /usr/include/subversion-1 -isystem /mesos/build/3rdparty/http_parser-2.6.2/src/http_parser-2.6.2 -isystem /mesos/build/3rdparty/zookeeper-3.4.8/src/zookeeper-3.4.8/src/c/include -isystem /mesos/build/3rdparty/zookeeper-3.4.8/src/zookeeper-3.4.8/src/c/generated -isystem /mesos/build/3rdparty/nvml-352.79/src/nvml-352.79 -isystem /mesos/build/3rdparty/leveldb-1.19/src/leveldb-1.19/include -isystem /mesos/build/3rdparty/googletest-1.8.0/src/googletest-1.8.0/googlemock/include -isystem /mesos/build/3rdparty/googletest-1.8.0/src/googletest-1.8.0/googletest/include  -std=c++11 -Wformat-security -fstack-protector-strong -fPIE   -o CMakeFiles/mesos-tests.dir/http_server_test_helper.cpp.o -c /mesos/src/tests/http_server_test_helper.cpp
[ 82%] Building CXX object src/tests/CMakeFiles/mesos-tests.dir/environment.cpp.o
cd /mesos/build/src/tests && /usr/bin/clang++-3.5  -DBUILD_DIR=\"/mesos/build\" -DBUILD_FLAGS=\"\" -DBUILD_JAVA_JVM_LIBRARY=\"\" -DHAS_AUTHENTICATION=1 -DHAVE_LIBZ -DLIBDIR=\"/usr/local/libmesos\" -DPICOJSON_USE_INT64 -DPKGDATADIR=\"/usr/local/share/mesos\" -DPKGLIBEXECDIR=\"/usr/local/libexec/mesos\" -DPKGMODULEDIR=\"\" -DSBINDIR=\"\" -DSOURCE_DIR=\"/mesos\" -DTESTLIBEXECDIR=\"\" -DUSE_CMAKE_BUILD_CONFIG -DUSE_SSL_SOCKET=1 -DUSE_STATIC_LIB -DVERSION=\"1.5.0\" -DZOOKEEPER_VERSION=\"3.4.8\" -D__STDC_FORMAT_MACROS -I/mesos/include -I/mesos/build/include -I/mesos/build/include/mesos -I/mesos/build/src -I/mesos/src -I/mesos/3rdparty/libprocess/src/../include -I/mesos/3rdparty/stout/include -isystem /usr/include/apr-1.0 -isystem /mesos/build/3rdparty/boost-1.53.0/src/boost-1.53.0 -isystem /mesos/build/3rdparty/elfio-3.2/src/elfio-3.2 -isystem /mesos/build/3rdparty/glog-0.3.3/src/glog-0.3.3-build/include -isystem /mesos/build/3rdparty/picojson-1.3.0/src/picojson-1.3.0 -isystem /mesos/build/3rdparty/protobuf-3.3.0/src/protobuf-3.3.0/src -isystem /usr/include/subversion-1 -isystem /mesos/build/3rdparty/http_parser-2.6.2/src/http_parser-2.6.2 -isystem /mesos/build/3rdparty/zookeeper-3.4.8/src/zookeeper-3.4.8/src/c/include -isystem /mesos/build/3rdparty/zookeeper-3.4.8/src/zookeeper-3.4.8/src/c/generated -isystem /mesos/build/3rdparty/nvml-352.79/src/nvml-352.79 -isystem /mesos/build/3rdparty/leveldb-1.19/src/leveldb-1.19/include -isystem /mesos/build/3rdparty/googletest-1.8.0/src/googletest-1.8.0/googlemock/include -isystem /mesos/build/3rdparty/googletest-1.8.0/src/googletest-1.8.0/googletest/include  -std=c++11 -Wformat-security -fstack-protector-strong -fPIE   -o CMakeFiles/mesos-tests.dir/environment.cpp.o -c /mesos/src/tests/environment.cpp
[ 82%] Building CXX object src/tests/CMakeFiles/mesos-tests.dir/main.cpp.o
cd /mesos/build/src/tests && /usr/bin/clang++-3.5  -DBUILD_DIR=\"/mesos/build\" -DBUILD_FLAGS=\"\" -DBUILD_JAVA_JVM_LIBRARY=\"\" -DHAS_AUTHENTICATION=1 -DHAVE_LIBZ -DLIBDIR=\"/usr/local/libmesos\" -DPICOJSON_USE_INT64 -DPKGDATADIR=\"/usr/local/share/mesos\" -DPKGLIBEXECDIR=\"/usr/local/libexec/mesos\" -DPKGMODULEDIR=\"\" -DSBINDIR=\"\" -DSOURCE_DIR=\"/mesos\" -DTESTLIBEXECDIR=\"\" -DUSE_CMAKE_BUILD_CONFIG -DUSE_SSL_SOCKET=1 -DUSE_STATIC_LIB -DVERSION=\"1.5.0\" -DZOOKEEPER_VERSION=\"3.4.8\" -D__STDC_FORMAT_MACROS -I/mesos/include -I/mesos/build/include -I/mesos/build/include/mesos -I/mesos/build/src -I/mesos/src -I/mesos/3rdparty/libprocess/src/../include -I/mesos/3rdparty/stout/include -isystem /usr/include/apr-1.0 -isystem /mesos/build/3rdparty/boost-1.53.0/src/boost-1.53.0 -isystem /mesos/build/3rdparty/elfio-3.2/src/elfio-3.2 -isystem /mesos/build/3rdparty/glog-0.3.3/src/glog-0.3.3-build/include -isystem /mesos/build/3rdparty/picojson-1.3.0/src/picojson-1.3.0 -isystem /mesos/build/3rdparty/protobuf-3.3.0/src/protobuf-3.3.0/src -isystem /usr/include/subversion-1 -isystem /mesos/build/3rdparty/http_parser-2.6.2/src/http_parser-2.6.2 -isystem /mesos/build/3rdparty/zookeeper-3.4.8/src/zookeeper-3.4.8/src/c/include -isystem /mesos/build/3rdparty/zookeeper-3.4.8/src/zookeeper-3.4.8/src/c/generated -isystem /mesos/build/3rdparty/nvml-352.79/src/nvml-352.79 -isystem /mesos/build/3rdparty/leveldb-1.19/src/leveldb-1.19/include -isystem /mesos/build/3rdparty/googletest-1.8.0/src/googletest-1.8.0/googlemock/include -isystem /mesos/build/3rdparty/googletest-1.8.0/src/googletest-1.8.0/googletest/include  -std=c++11 -Wformat-security -fstack-protector-strong -fPIE   -o CMakeFiles/mesos-tests.dir/main.cpp.o -c /mesos/src/tests/main.cpp
[ 82%] Building CXX object src/tests/CMakeFiles/mesos-tests.dir/mesos.cpp.o
cd /mesos/build/src/tests && /usr/bin/clang++-3.5  -DBUILD_DIR=\"/mesos/build\" -DBUILD_FLAGS=\"\" -DBUILD_JAVA_JVM_LIBRARY=\"\" -DHAS_AUTHENTICATION=1 -DHAVE_LIBZ -DLIBDIR=\"/usr/local/libmesos\" -DPICOJSON_USE_INT64 -DPKGDATADIR=\"/usr/local/share/mesos\" -DPKGLIBEXECDIR=\"/usr/local/libexec/mesos\" -DPKGMODULEDIR=\"\" -DSBINDIR=\"\" -DSOURCE_DIR=\"/mesos\" -DTESTLIBEXECDIR=\"\" -DUSE_CMAKE_BUILD_CONFIG -DUSE_SSL_SOCKET=1 -DUSE_STATIC_LIB -DVERSION=\"1.5.0\" -DZOOKEEPER_VERSION=\"3.4.8\" -D__STDC_FORMAT_MACROS -I/mesos/include -I/mesos/build/include -I/mesos/build/include/mesos -I/mesos/build/src -I/mesos/src -I/mesos/3rdparty/libprocess/src/../include -I/mesos/3rdparty/stout/include -isystem /usr/include/apr-1.0 -isystem /mesos/build/3rdparty/boost-1.53.0/src/boost-1.53.0 -isystem /mesos/build/3rdparty/elfio-3.2/src/elfio-3.2 -isystem /mesos/build/3rdparty/glog-0.3.3/src/glog-0.3.3-build/include -isystem /mesos/build/3rdparty/picojson-1.3.0/src/picojson-1.3.0 -isystem /mesos/build/3rdparty/protobuf-3.3.0/src/protobuf-3.3.0/src -isystem /usr/include/subversion-1 -isystem /mesos/build/3rdparty/http_parser-2.6.2/src/http_parser-2.6.2 -isystem /mesos/build/3rdparty/zookeeper-3.4.8/src/zookeeper-3.4.8/src/c/include -isystem /mesos/build/3rdparty/zookeeper-3.4.8/src/zookeeper-3.4.8/src/c/generated -isystem /mesos/build/3rdparty/nvml-352.79/src/nvml-352.79 -isystem /mesos/build/3rdparty/leveldb-1.19/src/leveldb-1.19/include -isystem /mesos/build/3rdparty/googletest-1.8.0/src/googletest-1.8.0/googlemock/include -isystem /mesos/build/3rdparty/googletest-1.8.0/src/googletest-1.8.0/googletest/include  -std=c++11 -Wformat-security -fstack-protector-strong -fPIE   -o CMakeFiles/mesos-tests.dir/mesos.cpp.o -c /mesos/src/tests/mesos.cpp
[ 82%] Building CXX object src/tests/CMakeFiles/mesos-tests.dir/mock_docker.cpp.o
cd /mesos/build/src/tests && /usr/bin/clang++-3.5  -DBUILD_DIR=\"/mesos/build\" -DBUILD_FLAGS=\"\" -DBUILD_JAVA_JVM_LIBRARY=\"\" -DHAS_AUTHENTICATION=1 -DHAVE_LIBZ -DLIBDIR=\"/usr/local/libmesos\" -DPICOJSON_USE_INT64 -DPKGDATADIR=\"/usr/local/share/mesos\" -DPKGLIBEXECDIR=\"/usr/local/libexec/mesos\" -DPKGMODULEDIR=\"\" -DSBINDIR=\"\" -DSOURCE_DIR=\"/mesos\" -DTESTLIBEXECDIR=\"\" -DUSE_CMAKE_BUILD_CONFIG -DUSE_SSL_SOCKET=1 -DUSE_STATIC_LIB -DVERSION=\"1.5.0\" -DZOOKEEPER_VERSION=\"3.4.8\" -D__STDC_FORMAT_MACROS -I/mesos/include -I/mesos/build/include -I/mesos/build/include/mesos -I/mesos/build/src -I/mesos/src -I/mesos/3rdparty/libprocess/src/../include -I/mesos/3rdparty/stout/include -isystem /usr/include/apr-1.0 -isystem /mesos/build/3rdparty/boost-1.53.0/src/boost-1.53.0 -isystem /mesos/build/3rdparty/elfio-3.2/src/elfio-3.2 -isystem /mesos/build/3rdparty/glog-0.3.3/src/glog-0.3.3-build/include -isystem /mesos/build/3rdparty/picojson-1.3.0/src/picojson-1.3.0 -isystem /mesos/build/3rdparty/protobuf-3.3.0/src/protobuf-3.3.0/src -isystem /usr/include/subversion-1 -isystem /mesos/build/3rdparty/http_parser-2.6.2/src/http_parser-2.6.2 -isystem /mesos/build/3rdparty/zookeeper-3.4.8/src/zookeeper-3.4.8/src/c/include -isystem /mesos/build/3rdparty/zookeeper-3.4.8/src/zookeeper-3.4.8/src/c/generated -isystem /mesos/build/3rdparty/nvml-352.79/src/nvml-352.79 -isystem /mesos/build/3rdparty/leveldb-1.19/src/leveldb-1.19/include -isystem /mesos/build/3rdparty/googletest-1.8.0/src/googletest-1.8.0/googlemock/include -isystem /mesos/build/3rdparty/googletest-1.8.0/src/googletest-1.8.0/googletest/include  -std=c++11 -Wformat-security -fstack-protector-strong -fPIE   -o CMakeFiles/mesos-tests.dir/mock_docker.cpp.o -c /mesos/src/tests/mock_docker.cpp
[ 82%] Building CXX object src/tests/CMakeFiles/mesos-tests.dir/mock_fetcher.cpp.o
cd /mesos/build/src/tests && /usr/bin/clang++-3.5  -DBUILD_DIR=\"/mesos/build\" -DBUILD_FLAGS=\"\" -DBUILD_JAVA_JVM_LIBRARY=\"\" -DHAS_AUTHENTICATION=1 -DHAVE_LIBZ -DLIBDIR=\"/usr/local/libmesos\" -DPICOJSON_USE_INT64 -DPKGDATADIR=\"/usr/local/share/mesos\" -DPKGLIBEXECDIR=\"/usr/local/libexec/mesos\" -DPKGMODULEDIR=\"\" -DSBINDIR=\"\" -DSOURCE_DIR=\"/mesos\" -DTESTLIBEXECDIR=\"\" -DUSE_CMAKE_BUILD_CONFIG -DUSE_SSL_SOCKET=1 -DUSE_STATIC_LIB -DVERSION=\"1.5.0\" -DZOOKEEPER_VERSION=\"3.4.8\" -D__STDC_FORMAT_MACROS -I/mesos/include -I/mesos/build/include -I/mesos/build/include/mesos -I/mesos/build/src -I/mesos/src -I/mesos/3rdparty/libprocess/src/../include -I/mesos/3rdparty/stout/include -isystem /usr/include/apr-1.0 -isystem /mesos/build/3rdparty/boost-1.53.0/src/boost-1.53.0 -isystem /mesos/build/3rdparty/elfio-3.2/src/elfio-3.2 -isystem /mesos/build/3rdparty/glog-0.3.3/src/glog-0.3.3-build/include -isystem /mesos/build/3rdparty/picojson-1.3.0/src/picojson-1.3.0 -isystem /mesos/build/3rdparty/protobuf-3.3.0/src/protobuf-3.3.0/src -isystem /usr/include/subversion-1 -isystem /mesos/build/3rdparty/http_parser-2.6.2/src/http_parser-2.6.2 -isystem /mesos/build/3rdparty/zookeeper-3.4.8/src/zookeeper-3.4.8/src/c/include -isystem /mesos/build/3rdparty/zookeeper-3.4.8/src/zookeeper-3.4.8/src/c/generated -isystem /mesos/build/3rdparty/nvml-352.79/src/nvml-352.79 -isystem /mesos/build/3rdparty/leveldb-1.19/src/leveldb-1.19/include -isystem /mesos/build/3rdparty/googletest-1.8.0/src/googletest-1.8.0/googlemock/include -isystem /mesos/build/3rdparty/googletest-1.8.0/src/googletest-1.8.0/googletest/include  -std=c++11 -Wformat-security -fstack-protector-strong -fPIE   -o CMakeFiles/mesos-tests.dir/mock_fetcher.cpp.o -c /mesos/src/tests/mock_fetcher.cpp
[ 83%] Building CXX object src/tests/CMakeFiles/mesos-tests.dir/mock_registrar.cpp.o
cd /mesos/build/src/tests && /usr/bin/clang++-3.5  -DBUILD_DIR=\"/mesos/build\" -DBUILD_FLAGS=\"\" -DBUILD_JAVA_JVM_LIBRARY=\"\" -DHAS_AUTHENTICATION=1 -DHAVE_LIBZ -DLIBDIR=\"/usr/local/libmesos\" -DPICOJSON_USE_INT64 -DPKGDATADIR=\"/usr/local/share/mesos\" -DPKGLIBEXECDIR=\"/usr/local/libexec/mesos\" -DPKGMODULEDIR=\"\" -DSBINDIR=\"\" -DSOURCE_DIR=\"/mesos\" -DTESTLIBEXECDIR=\"\" -DUSE_CMAKE_BUILD_CONFIG -DUSE_SSL_SOCKET=1 -DUSE_STATIC_LIB -DVERSION=\"1.5.0\" -DZOOKEEPER_VERSION=\"3.4.8\" -D__STDC_FORMAT_MACROS -I/mesos/include -I/mesos/build/include -I/mesos/build/include/mesos -I/mesos/build/src -I/mesos/src -I/mesos/3rdparty/libprocess/src/../include -I/mesos/3rdparty/stout/include -isystem /usr/include/apr-1.0 -isystem /mesos/build/3rdparty/boost-1.53.0/src/boost-1.53.0 -isystem /mesos/build/3rdparty/elfio-3.2/src/elfio-3.2 -isystem /mesos/build/3rdparty/glog-0.3.3/src/glog-0.3.3-build/include -isystem /mesos/build/3rdparty/picojson-1.3.0/src/picojson-1.3.0 -isystem /mesos/build/3rdparty/protobuf-3.3.0/src/protobuf-3.3.0/src -isystem /usr/include/subversion-1 -isystem /mesos/build/3rdparty/http_parser-2.6.2/src/http_parser-2.6.2 -isystem /mesos/build/3rdparty/zookeeper-3.4.8/src/zookeeper-3.4.8/src/c/include -isystem /mesos/build/3rdparty/zookeeper-3.4.8/src/zookeeper-3.4.8/src/c/generated -isystem /mesos/build/3rdparty/nvml-352.79/src/nvml-352.79 -isystem /mesos/build/3rdparty/leveldb-1.19/src/leveldb-1.19/include -isystem /mesos/build/3rdparty/googletest-1.8.0/src/googletest-1.8.0/googlemock/include -isystem /mesos/build/3rdparty/googletest-1.8.0/src/googletest-1.8.0/googletest/include  -std=c++11 -Wformat-security -fstack-protector-strong -fPIE   -o CMakeFiles/mesos-tests.dir/mock_registrar.cpp.o -c /mesos/src/tests/mock_registrar.cpp
[ 83%] Building CXX object src/tests/CMakeFiles/mesos-tests.dir/mock_slave.cpp.o
cd /mesos/build/src/tests && /usr/bin/clang++-3.5  -DBUILD_DIR=\"/mesos/build\" -DBUILD_FLAGS=\"\" -DBUILD_JAVA_JVM_LIBRARY=\"\" -DHAS_AUTHENTICATION=1 -DHAVE_LIBZ -DLIBDIR=\"/usr/local/libmesos\" -DPICOJSON_USE_INT64 -DPKGDATADIR=\"/usr/local/share/mesos\" -DPKGLIBEXECDIR=\"/usr/local/libexec/mesos\" -DPKGMODULEDIR=\"\" -DSBINDIR=\"\" -DSOURCE_DIR=\"/mesos\" -DTESTLIBEXECDIR=\"\" -DUSE_CMAKE_BUILD_CONFIG -DUSE_SSL_SOCKET=1 -DUSE_STATIC_LIB -DVERSION=\"1.5.0\" -DZOOKEEPER_VERSION=\"3.4.8\" -D__STDC_FORMAT_MACROS -I/mesos/include -I/mesos/build/include -I/mesos/build/include/mesos -I/mesos/build/src -I/mesos/src -I/mesos/3rdparty/libprocess/src/../include -I/mesos/3rdparty/stout/include -isystem /usr/include/apr-1.0 -isystem /mesos/build/3rdparty/boost-1.53.0/src/boost-1.53.0 -isystem /mesos/build/3rdparty/elfio-3.2/src/elfio-3.2 -isystem /mesos/build/3rdparty/glog-0.3.3/src/glog-0.3.3-build/include -isystem /mesos/build/3rdparty/picojson-1.3.0/src/picojson-1.3.0 -isystem /mesos/build/3rdparty/protobuf-3.3.0/src/protobuf-3.3.0/src -isystem /usr/include/subversion-1 -isystem /mesos/build/3rdparty/http_parser-2.6.2/src/http_parser-2.6.2 -isystem /mesos/build/3rdparty/zookeeper-3.4.8/src/zookeeper-3.4.8/src/c/include -isystem /mesos/build/3rdparty/zookeeper-3.4.8/src/zookeeper-3.4.8/src/c/generated -isystem /mesos/build/3rdparty/nvml-352.79/src/nvml-352.79 -isystem /mesos/build/3rdparty/leveldb-1.19/src/leveldb-1.19/include -isystem /mesos/build/3rdparty/googletest-1.8.0/src/googletest-1.8.0/googlemock/include -isystem /mesos/build/3rdparty/googletest-1.8.0/src/googletest-1.8.0/googletest/include  -std=c++11 -Wformat-security -fstack-protector-strong -fPIE   -o CMakeFiles/mesos-tests.dir/mock_slave.cpp.o -c /mesos/src/tests/mock_slave.cpp
[ 83%] Building CXX object src/tests/CMakeFiles/mesos-tests.dir/module.cpp.o
cd /mesos/build/src/tests && /usr/bin/clang++-3.5  -DBUILD_DIR=\"/mesos/build\" -DBUILD_FLAGS=\"\" -DBUILD_JAVA_JVM_LIBRARY=\"\" -DHAS_AUTHENTICATION=1 -DHAVE_LIBZ -DLIBDIR=\"/usr/local/libmesos\" -DPICOJSON_USE_INT64 -DPKGDATADIR=\"/usr/local/share/mesos\" -DPKGLIBEXECDIR=\"/usr/local/libexec/mesos\" -DPKGMODULEDIR=\"\" -DSBINDIR=\"\" -DSOURCE_DIR=\"/mesos\" -DTESTLIBEXECDIR=\"\" -DUSE_CMAKE_BUILD_CONFIG -DUSE_SSL_SOCKET=1 -DUSE_STATIC_LIB -DVERSION=\"1.5.0\" -DZOOKEEPER_VERSION=\"3.4.8\" -D__STDC_FORMAT_MACROS -I/mesos/include -I/mesos/build/include -I/mesos/build/include/mesos -I/mesos/build/src -I/mesos/src -I/mesos/3rdparty/libprocess/src/../include -I/mesos/3rdparty/stout/include -isystem /usr/include/apr-1.0 -isystem /mesos/build/3rdparty/boost-1.53.0/src/boost-1.53.0 -isystem /mesos/build/3rdparty/elfio-3.2/src/elfio-3.2 -isystem /mesos/build/3rdparty/glog-0.3.3/src/glog-0.3.3-build/include -isystem /mesos/build/3rdparty/picojson-1.3.0/src/picojson-1.3.0 -isystem /mesos/build/3rdparty/protobuf-3.3.0/src/protobuf-3.3.0/src -isystem /usr/include/subversion-1 -isystem /mesos/build/3rdparty/http_parser-2.6.2/src/http_parser-2.6.2 -isystem /mesos/build/3rdparty/zookeeper-3.4.8/src/zookeeper-3.4.8/src/c/include -isystem /mesos/build/3rdparty/zookeeper-3.4.8/src/zookeeper-3.4.8/src/c/generated -isystem /mesos/build/3rdparty/nvml-352.79/src/nvml-352.79 -isystem /mesos/build/3rdparty/leveldb-1.19/src/leveldb-1.19/include -isystem /mesos/build/3rdparty/googletest-1.8.0/src/googletest-1.8.0/googlemock/include -isystem /mesos/build/3rdparty/googletest-1.8.0/src/googletest-1.8.0/googletest/include  -std=c++11 -Wformat-security -fstack-protector-strong -fPIE   -o CMakeFiles/mesos-tests.dir/module.cpp.o -c /mesos/src/tests/module.cpp
[ 83%] Building CXX object src/tests/CMakeFiles/mesos-tests.dir/resources_utils.cpp.o
cd /mesos/build/src/tests && /usr/bin/clang++-3.5  -DBUILD_DIR=\"/mesos/build\" -DBUILD_FLAGS=\"\" -DBUILD_JAVA_JVM_LIBRARY=\"\" -DHAS_AUTHENTICATION=1 -DHAVE_LIBZ -DLIBDIR=\"/usr/local/libmesos\" -DPICOJSON_USE_INT64 -DPKGDATADIR=\"/usr/local/share/mesos\" -DPKGLIBEXECDIR=\"/usr/local/libexec/mesos\" -DPKGMODULEDIR=\"\" -DSBINDIR=\"\" -DSOURCE_DIR=\"/mesos\" -DTESTLIBEXECDIR=\"\" -DUSE_CMAKE_BUILD_CONFIG -DUSE_SSL_SOCKET=1 -DUSE_STATIC_LIB -DVERSION=\"1.5.0\" -DZOOKEEPER_VERSION=\"3.4.8\" -D__STDC_FORMAT_MACROS -I/mesos/include -I/mesos/build/include -I/mesos/build/include/mesos -I/mesos/build/src -I/mesos/src -I/mesos/3rdparty/libprocess/src/../include -I/mesos/3rdparty/stout/include -isystem /usr/include/apr-1.0 -isystem /mesos/build/3rdparty/boost-1.53.0/src/boost-1.53.0 -isystem /mesos/build/3rdparty/elfio-3.2/src/elfio-3.2 -isystem /mesos/build/3rdparty/glog-0.3.3/src/glog-0.3.3-build/include -isystem /mesos/build/3rdparty/picojson-1.3.0/src/picojson-1.3.0 -isystem /mesos/build/3rdparty/protobuf-3.3.0/src/protobuf-3.3.0/src -isystem /usr/include/subversion-1 -isystem /mesos/build/3rdparty/http_parser-2.6.2/src/http_parser-2.6.2 -isystem /mesos/build/3rdparty/zookeeper-3.4.8/src/zookeeper-3.4.8/src/c/include -isystem /mesos/build/3rdparty/zookeeper-3.4.8/src/zookeeper-3.4.8/src/c/generated -isystem /mesos/build/3rdparty/nvml-352.79/src/nvml-352.79 -isystem /mesos/build/3rdparty/leveldb-1.19/src/leveldb-1.19/include -isystem /mesos/build/3rdparty/googletest-1.8.0/src/googletest-1.8.0/googlemock/include -isystem /mesos/build/3rdparty/googletest-1.8.0/src/googletest-1.8.0/googletest/include  -std=c++11 -Wformat-security -fstack-protector-strong -fPIE   -o CMakeFiles/mesos-tests.dir/resources_utils.cpp.o -c /mesos/src/tests/resources_utils.cpp
[ 83%] Building CXX object src/tests/CMakeFiles/mesos-tests.dir/utils.cpp.o
cd /mesos/build/src/tests && /usr/bin/clang++-3.5  -DBUILD_DIR=\"/mesos/build\" -DBUILD_FLAGS=\"\" -DBUILD_JAVA_JVM_LIBRARY=\"\" -DHAS_AUTHENTICATION=1 -DHAVE_LIBZ -DLIBDIR=\"/usr/local/libmesos\" -DPICOJSON_USE_INT64 -DPKGDATADIR=\"/usr/local/share/mesos\" -DPKGLIBEXECDIR=\"/usr/local/libexec/mesos\" -DPKGMODULEDIR=\"\" -DSBINDIR=\"\" -DSOURCE_DIR=\"/mesos\" -DTESTLIBEXECDIR=\"\" -DUSE_CMAKE_BUILD_CONFIG -DUSE_SSL_SOCKET=1 -DUSE_STATIC_LIB -DVERSION=\"1.5.0\" -DZOOKEEPER_VERSION=\"3.4.8\" -D__STDC_FORMAT_MACROS -I/mesos/include -I/mesos/build/include -I/mesos/build/include/mesos -I/mesos/build/src -I/mesos/src -I/mesos/3rdparty/libprocess/src/../include -I/mesos/3rdparty/stout/include -isystem /usr/include/apr-1.0 -isystem /mesos/build/3rdparty/boost-1.53.0/src/boost-1.53.0 -isystem /mesos/build/3rdparty/elfio-3.2/src/elfio-3.2 -isystem /mesos/build/3rdparty/glog-0.3.3/src/glog-0.3.3-build/include -isystem /mesos/build/3rdparty/picojson-1.3.0/src/picojson-1.3.0 -isystem /mesos/build/3rdparty/protobuf-3.3.0/src/protobuf-3.3.0/src -isystem /usr/include/subversion-1 -isystem /mesos/build/3rdparty/http_parser-2.6.2/src/http_parser-2.6.2 -isystem /mesos/build/3rdparty/zookeeper-3.4.8/src/zookeeper-3.4.8/src/c/include -isystem /mesos/build/3rdparty/zookeeper-3.4.8/src/zookeeper-3.4.8/src/c/generated -isystem /mesos/build/3rdparty/nvml-352.79/src/nvml-352.79 -isystem /mesos/build/3rdparty/leveldb-1.19/src/leveldb-1.19/include -isystem /mesos/build/3rdparty/googletest-1.8.0/src/googletest-1.8.0/googlemock/include -isystem /mesos/build/3rdparty/googletest-1.8.0/src/googletest-1.8.0/googletest/include  -std=c++11 -Wformat-security -fstack-protector-strong -fPIE   -o CMakeFiles/mesos-tests.dir/utils.cpp.o -c /mesos/src/tests/utils.cpp
[ 83%] Building CXX object src/tests/CMakeFiles/mesos-tests.dir/containerizer/launcher.cpp.o
cd /mesos/build/src/tests && /usr/bin/clang++-3.5  -DBUILD_DIR=\"/mesos/build\" -DBUILD_FLAGS=\"\" -DBUILD_JAVA_JVM_LIBRARY=\"\" -DHAS_AUTHENTICATION=1 -DHAVE_LIBZ -DLIBDIR=\"/usr/local/libmesos\" -DPICOJSON_USE_INT64 -DPKGDATADIR=\"/usr/local/share/mesos\" -DPKGLIBEXECDIR=\"/usr/local/libexec/mesos\" -DPKGMODULEDIR=\"\" -DSBINDIR=\"\" -DSOURCE_DIR=\"/mesos\" -DTESTLIBEXECDIR=\"\" -DUSE_CMAKE_BUILD_CONFIG -DUSE_SSL_SOCKET=1 -DUSE_STATIC_LIB -DVERSION=\"1.5.0\" -DZOOKEEPER_VERSION=\"3.4.8\" -D__STDC_FORMAT_MACROS -I/mesos/include -I/mesos/build/include -I/mesos/build/include/mesos -I/mesos/build/src -I/mesos/src -I/mesos/3rdparty/libprocess/src/../include -I/mesos/3rdparty/stout/include -isystem /usr/include/apr-1.0 -isystem /mesos/build/3rdparty/boost-1.53.0/src/boost-1.53.0 -isystem /mesos/build/3rdparty/elfio-3.2/src/elfio-3.2 -isystem /mesos/build/3rdparty/glog-0.3.3/src/glog-0.3.3-build/include -isystem /mesos/build/3rdparty/picojson-1.3.0/src/picojson-1.3.0 -isystem /mesos/build/3rdparty/protobuf-3.3.0/src/protobuf-3.3.0/src -isystem /usr/include/subversion-1 -isystem /mesos/build/3rdparty/http_parser-2.6.2/src/http_parser-2.6.2 -isystem /mesos/build/3rdparty/zookeeper-3.4.8/src/zookeeper-3.4.8/src/c/include -isystem /mesos/build/3rdparty/zookeeper-3.4.8/src/zookeeper-3.4.8/src/c/generated -isystem /mesos/build/3rdparty/nvml-352.79/src/nvml-352.79 -isystem /mesos/build/3rdparty/leveldb-1.19/src/leveldb-1.19/include -isystem /mesos/build/3rdparty/googletest-1.8.0/src/googletest-1.8.0/googlemock/include -isystem /mesos/build/3rdparty/googletest-1.8.0/src/googletest-1.8.0/googletest/include  -std=c++11 -Wformat-security -fstack-protector-strong -fPIE   -o CMakeFiles/mesos-tests.dir/containerizer/launcher.cpp.o -c /mesos/src/tests/containerizer/launcher.cpp
[ 83%] Building CXX object src/tests/CMakeFiles/mesos-tests.dir/kill_policy_test_helper.cpp.o
cd /mesos/build/src/tests && /usr/bin/clang++-3.5  -DBUILD_DIR=\"/mesos/build\" -DBUILD_FLAGS=\"\" -DBUILD_JAVA_JVM_LIBRARY=\"\" -DHAS_AUTHENTICATION=1 -DHAVE_LIBZ -DLIBDIR=\"/usr/local/libmesos\" -DPICOJSON_USE_INT64 -DPKGDATADIR=\"/usr/local/share/mesos\" -DPKGLIBEXECDIR=\"/usr/local/libexec/mesos\" -DPKGMODULEDIR=\"\" -DSBINDIR=\"\" -DSOURCE_DIR=\"/mesos\" -DTESTLIBEXECDIR=\"\" -DUSE_CMAKE_BUILD_CONFIG -DUSE_SSL_SOCKET=1 -DUSE_STATIC_LIB -DVERSION=\"1.5.0\" -DZOOKEEPER_VERSION=\"3.4.8\" -D__STDC_FORMAT_MACROS -I/mesos/include -I/mesos/build/include -I/mesos/build/include/mesos -I/mesos/build/src -I/mesos/src -I/mesos/3rdparty/libprocess/src/../include -I/mesos/3rdparty/stout/include -isystem /usr/include/apr-1.0 -isystem /mesos/build/3rdparty/boost-1.53.0/src/boost-1.53.0 -isystem /mesos/build/3rdparty/elfio-3.2/src/elfio-3.2 -isystem /mesos/build/3rdparty/glog-0.3.3/src/glog-0.3.3-build/include -isystem /mesos/build/3rdparty/picojson-1.3.0/src/picojson-1.3.0 -isystem /mesos/build/3rdparty/protobuf-3.3.0/src/protobuf-3.3.0/src -isystem /usr/include/subversion-1 -isystem /mesos/build/3rdparty/http_parser-2.6.2/src/http_parser-2.6.2 -isystem /mesos/build/3rdparty/zookeeper-3.4.8/src/zookeeper-3.4.8/src/c/include -isystem /mesos/build/3rdparty/zookeeper-3.4.8/src/zookeeper-3.4.8/src/c/generated -isystem /mesos/build/3rdparty/nvml-352.79/src/nvml-352.79 -isystem /mesos/build/3rdparty/leveldb-1.19/src/leveldb-1.19/include -isystem /mesos/build/3rdparty/googletest-1.8.0/src/googletest-1.8.0/googlemock/include -isystem /mesos/build/3rdparty/googletest-1.8.0/src/googletest-1.8.0/googletest/include  -std=c++11 -Wformat-security -fstack-protector-strong -fPIE   -o CMakeFiles/mesos-tests.dir/kill_policy_test_helper.cpp.o -c /mesos/src/tests/kill_policy_test_helper.cpp
[ 83%] Building CXX object src/tests/CMakeFiles/mesos-tests.dir/script.cpp.o
cd /mesos/build/src/tests && /usr/bin/clang++-3.5  -DBUILD_DIR=\"/mesos/build\" -DBUILD_FLAGS=\"\" -DBUILD_JAVA_JVM_LIBRARY=\"\" -DHAS_AUTHENTICATION=1 -DHAVE_LIBZ -DLIBDIR=\"/usr/local/libmesos\" -DPICOJSON_USE_INT64 -DPKGDATADIR=\"/usr/local/share/mesos\" -DPKGLIBEXECDIR=\"/usr/local/libexec/mesos\" -DPKGMODULEDIR=\"\" -DSBINDIR=\"\" -DSOURCE_DIR=\"/mesos\" -DTESTLIBEXECDIR=\"\" -DUSE_CMAKE_BUILD_CONFIG -DUSE_SSL_SOCKET=1 -DUSE_STATIC_LIB -DVERSION=\"1.5.0\" -DZOOKEEPER_VERSION=\"3.4.8\" -D__STDC_FORMAT_MACROS -I/mesos/include -I/mesos/build/include -I/mesos/build/include/mesos -I/mesos/build/src -I/mesos/src -I/mesos/3rdparty/libprocess/src/../include -I/mesos/3rdparty/stout/include -isystem /usr/include/apr-1.0 -isystem /mesos/build/3rdparty/boost-1.53.0/src/boost-1.53.0 -isystem /mesos/build/3rdparty/elfio-3.2/src/elfio-3.2 -isystem /mesos/build/3rdparty/glog-0.3.3/src/glog-0.3.3-build/include -isystem /mesos/build/3rdparty/picojson-1.3.0/src/picojson-1.3.0 -isystem /mesos/build/3rdparty/protobuf-3.3.0/src/protobuf-3.3.0/src -isystem /usr/include/subversion-1 -isystem /mesos/build/3rdparty/http_parser-2.6.2/src/http_parser-2.6.2 -isystem /mesos/build/3rdparty/zookeeper-3.4.8/src/zookeeper-3.4.8/src/c/include -isystem /mesos/build/3rdparty/zookeeper-3.4.8/src/zookeeper-3.4.8/src/c/generated -isystem /mesos/build/3rdparty/nvml-352.79/src/nvml-352.79 -isystem /mesos/build/3rdparty/leveldb-1.19/src/leveldb-1.19/include -isystem /mesos/build/3rdparty/googletest-1.8.0/src/googletest-1.8.0/googlemock/include -isystem /mesos/build/3rdparty/googletest-1.8.0/src/googletest-1.8.0/googletest/include  -std=c++11 -Wformat-security -fstack-protector-strong -fPIE   -o CMakeFiles/mesos-tests.dir/script.cpp.o -c /mesos/src/tests/script.cpp
[ 84%] Building CXX object src/tests/CMakeFiles/mesos-tests.dir/containerizer/memory_test_helper.cpp.o
cd /mesos/build/src/tests && /usr/bin/clang++-3.5  -DBUILD_DIR=\"/mesos/build\" -DBUILD_FLAGS=\"\" -DBUILD_JAVA_JVM_LIBRARY=\"\" -DHAS_AUTHENTICATION=1 -DHAVE_LIBZ -DLIBDIR=\"/usr/local/libmesos\" -DPICOJSON_USE_INT64 -DPKGDATADIR=\"/usr/local/share/mesos\" -DPKGLIBEXECDIR=\"/usr/local/libexec/mesos\" -DPKGMODULEDIR=\"\" -DSBINDIR=\"\" -DSOURCE_DIR=\"/mesos\" -DTESTLIBEXECDIR=\"\" -DUSE_CMAKE_BUILD_CONFIG -DUSE_SSL_SOCKET=1 -DUSE_STATIC_LIB -DVERSION=\"1.5.0\" -DZOOKEEPER_VERSION=\"3.4.8\" -D__STDC_FORMAT_MACROS -I/mesos/include -I/mesos/build/include -I/mesos/build/include/mesos -I/mesos/build/src -I/mesos/src -I/mesos/3rdparty/libprocess/src/../include -I/mesos/3rdparty/stout/include -isystem /usr/include/apr-1.0 -isystem /mesos/build/3rdparty/boost-1.53.0/src/boost-1.53.0 -isystem /mesos/build/3rdparty/elfio-3.2/src/elfio-3.2 -isystem /mesos/build/3rdparty/glog-0.3.3/src/glog-0.3.3-build/include -isystem /mesos/build/3rdparty/picojson-1.3.0/src/picojson-1.3.0 -isystem /mesos/build/3rdparty/protobuf-3.3.0/src/protobuf-3.3.0/src -isystem /usr/include/subversion-1 -isystem /mesos/build/3rdparty/http_parser-2.6.2/src/http_parser-2.6.2 -isystem /mesos/build/3rdparty/zookeeper-3.4.8/src/zookeeper-3.4.8/src/c/include -isystem /mesos/build/3rdparty/zookeeper-3.4.8/src/zookeeper-3.4.8/src/c/generated -isystem /mesos/build/3rdparty/nvml-352.79/src/nvml-352.79 -isystem /mesos/build/3rdparty/leveldb-1.19/src/leveldb-1.19/include -isystem /mesos/build/3rdparty/googletest-1.8.0/src/googletest-1.8.0/googlemock/include -isystem /mesos/build/3rdparty/googletest-1.8.0/src/googletest-1.8.0/googletest/include  -std=c++11 -Wformat-security -fstack-protector-strong -fPIE   -o CMakeFiles/mesos-tests.dir/containerizer/memory_test_helper.cpp.o -c /mesos/src/tests/containerizer/memory_test_helper.cpp
[ 84%] Building CXX object src/tests/CMakeFiles/mesos-tests.dir/containerizer/capabilities_test_helper.cpp.o
cd /mesos/build/src/tests && /usr/bin/clang++-3.5  -DBUILD_DIR=\"/mesos/build\" -DBUILD_FLAGS=\"\" -DBUILD_JAVA_JVM_LIBRARY=\"\" -DHAS_AUTHENTICATION=1 -DHAVE_LIBZ -DLIBDIR=\"/usr/local/libmesos\" -DPICOJSON_USE_INT64 -DPKGDATADIR=\"/usr/local/share/mesos\" -DPKGLIBEXECDIR=\"/usr/local/libexec/mesos\" -DPKGMODULEDIR=\"\" -DSBINDIR=\"\" -DSOURCE_DIR=\"/mesos\" -DTESTLIBEXECDIR=\"\" -DUSE_CMAKE_BUILD_CONFIG -DUSE_SSL_SOCKET=1 -DUSE_STATIC_LIB -DVERSION=\"1.5.0\" -DZOOKEEPER_VERSION=\"3.4.8\" -D__STDC_FORMAT_MACROS -I/mesos/include -I/mesos/build/include -I/mesos/build/include/mesos -I/mesos/build/src -I/mesos/src -I/mesos/3rdparty/libprocess/src/../include -I/mesos/3rdparty/stout/include -isystem /usr/include/apr-1.0 -isystem /mesos/build/3rdparty/boost-1.53.0/src/boost-1.53.0 -isystem /mesos/build/3rdparty/elfio-3.2/src/elfio-3.2 -isystem /mesos/build/3rdparty/glog-0.3.3/src/glog-0.3.3-build/include -isystem /mesos/build/3rdparty/picojson-1.3.0/src/picojson-1.3.0 -isystem /mesos/build/3rdparty/protobuf-3.3.0/src/protobuf-3.3.0/src -isystem /usr/include/subversion-1 -isystem /mesos/build/3rdparty/http_parser-2.6.2/src/http_parser-2.6.2 -isystem /mesos/build/3rdparty/zookeeper-3.4.8/src/zookeeper-3.4.8/src/c/include -isystem /mesos/build/3rdparty/zookeeper-3.4.8/src/zookeeper-3.4.8/src/c/generated -isystem /mesos/build/3rdparty/nvml-352.79/src/nvml-352.79 -isystem /mesos/build/3rdparty/leveldb-1.19/src/leveldb-1.19/include -isystem /mesos/build/3rdparty/googletest-1.8.0/src/googletest-1.8.0/googlemock/include -isystem /mesos/build/3rdparty/googletest-1.8.0/src/googletest-1.8.0/googletest/include  -std=c++11 -Wformat-security -fstack-protector-strong -fPIE   -o CMakeFiles/mesos-tests.dir/containerizer/capabilities_test_helper.cpp.o -c /mesos/src/tests/containerizer/capabilities_test_helper.cpp
[ 84%] Building CXX object src/tests/CMakeFiles/mesos-tests.dir/containerizer/setns_test_helper.cpp.o
cd /mesos/build/src/tests && /usr/bin/clang++-3.5  -DBUILD_DIR=\"/mesos/build\" -DBUILD_FLAGS=\"\" -DBUILD_JAVA_JVM_LIBRARY=\"\" -DHAS_AUTHENTICATION=1 -DHAVE_LIBZ -DLIBDIR=\"/usr/local/libmesos\" -DPICOJSON_USE_INT64 -DPKGDATADIR=\"/usr/local/share/mesos\" -DPKGLIBEXECDIR=\"/usr/local/libexec/mesos\" -DPKGMODULEDIR=\"\" -DSBINDIR=\"\" -DSOURCE_DIR=\"/mesos\" -DTESTLIBEXECDIR=\"\" -DUSE_CMAKE_BUILD_CONFIG -DUSE_SSL_SOCKET=1 -DUSE_STATIC_LIB -DVERSION=\"1.5.0\" -DZOOKEEPER_VERSION=\"3.4.8\" -D__STDC_FORMAT_MACROS -I/mesos/include -I/mesos/build/include -I/mesos/build/include/mesos -I/mesos/build/src -I/mesos/src -I/mesos/3rdparty/libprocess/src/../include -I/mesos/3rdparty/stout/include -isystem /usr/include/apr-1.0 -isystem /mesos/build/3rdparty/boost-1.53.0/src/boost-1.53.0 -isystem /mesos/build/3rdparty/elfio-3.2/src/elfio-3.2 -isystem /mesos/build/3rdparty/glog-0.3.3/src/glog-0.3.3-build/include -isystem /mesos/build/3rdparty/picojson-1.3.0/src/picojson-1.3.0 -isystem /mesos/build/3rdparty/protobuf-3.3.0/src/protobuf-3.3.0/src -isystem /usr/include/subversion-1 -isystem /mesos/build/3rdparty/http_parser-2.6.2/src/http_parser-2.6.2 -isystem /mesos/build/3rdparty/zookeeper-3.4.8/src/zookeeper-3.4.8/src/c/include -isystem /mesos/build/3rdparty/zookeeper-3.4.8/src/zookeeper-3.4.8/src/c/generated -isystem /mesos/build/3rdparty/nvml-352.79/src/nvml-352.79 -isystem /mesos/build/3rdparty/leveldb-1.19/src/leveldb-1.19/include -isystem /mesos/build/3rdparty/googletest-1.8.0/src/googletest-1.8.0/googlemock/include -isystem /mesos/build/3rdparty/googletest-1.8.0/src/googletest-1.8.0/googletest/include  -std=c++11 -Wformat-security -fstack-protector-strong -fPIE   -o CMakeFiles/mesos-tests.dir/containerizer/setns_test_helper.cpp.o -c /mesos/src/tests/containerizer/setns_test_helper.cpp
[ 84%] Building CXX object src/tests/CMakeFiles/mesos-tests.dir/anonymous_tests.cpp.o
cd /mesos/build/src/tests && /usr/bin/clang++-3.5  -DBUILD_DIR=\"/mesos/build\" -DBUILD_FLAGS=\"\" -DBUILD_JAVA_JVM_LIBRARY=\"\" -DHAS_AUTHENTICATION=1 -DHAVE_LIBZ -DLIBDIR=\"/usr/local/libmesos\" -DPICOJSON_USE_INT64 -DPKGDATADIR=\"/usr/local/share/mesos\" -DPKGLIBEXECDIR=\"/usr/local/libexec/mesos\" -DPKGMODULEDIR=\"\" -DSBINDIR=\"\" -DSOURCE_DIR=\"/mesos\" -DTESTLIBEXECDIR=\"\" -DUSE_CMAKE_BUILD_CONFIG -DUSE_SSL_SOCKET=1 -DUSE_STATIC_LIB -DVERSION=\"1.5.0\" -DZOOKEEPER_VERSION=\"3.4.8\" -D__STDC_FORMAT_MACROS -I/mesos/include -I/mesos/build/include -I/mesos/build/include/mesos -I/mesos/build/src -I/mesos/src -I/mesos/3rdparty/libprocess/src/../include -I/mesos/3rdparty/stout/include -isystem /usr/include/apr-1.0 -isystem /mesos/build/3rdparty/boost-1.53.0/src/boost-1.53.0 -isystem /mesos/build/3rdparty/elfio-3.2/src/elfio-3.2 -isystem /mesos/build/3rdparty/glog-0.3.3/src/glog-0.3.3-build/include -isystem /mesos/build/3rdparty/picojson-1.3.0/src/picojson-1.3.0 -isystem /mesos/build/3rdparty/protobuf-3.3.0/src/protobuf-3.3.0/src -isystem /usr/include/subversion-1 -isystem /mesos/build/3rdparty/http_parser-2.6.2/src/http_parser-2.6.2 -isystem /mesos/build/3rdparty/zookeeper-3.4.8/src/zookeeper-3.4.8/src/c/include -isystem /mesos/build/3rdparty/zookeeper-3.4.8/src/zookeeper-3.4.8/src/c/generated -isystem /mesos/build/3rdparty/nvml-352.79/src/nvml-352.79 -isystem /mesos/build/3rdparty/leveldb-1.19/src/leveldb-1.19/include -isystem /mesos/build/3rdparty/googletest-1.8.0/src/googletest-1.8.0/googlemock/include -isystem /mesos/build/3rdparty/googletest-1.8.0/src/googletest-1.8.0/googletest/include  -std=c++11 -Wformat-security -fstack-protector-strong -fPIE   -o CMakeFiles/mesos-tests.dir/anonymous_tests.cpp.o -c /mesos/src/tests/anonymous_tests.cpp
[ 84%] Building CXX object src/tests/CMakeFiles/mesos-tests.dir/api_tests.cpp.o
cd /mesos/build/src/tests && /usr/bin/clang++-3.5  -DBUILD_DIR=\"/mesos/build\" -DBUILD_FLAGS=\"\" -DBUILD_JAVA_JVM_LIBRARY=\"\" -DHAS_AUTHENTICATION=1 -DHAVE_LIBZ -DLIBDIR=\"/usr/local/libmesos\" -DPICOJSON_USE_INT64 -DPKGDATADIR=\"/usr/local/share/mesos\" -DPKGLIBEXECDIR=\"/usr/local/libexec/mesos\" -DPKGMODULEDIR=\"\" -DSBINDIR=\"\" -DSOURCE_DIR=\"/mesos\" -DTESTLIBEXECDIR=\"\" -DUSE_CMAKE_BUILD_CONFIG -DUSE_SSL_SOCKET=1 -DUSE_STATIC_LIB -DVERSION=\"1.5.0\" -DZOOKEEPER_VERSION=\"3.4.8\" -D__STDC_FORMAT_MACROS -I/mesos/include -I/mesos/build/include -I/mesos/build/include/mesos -I/mesos/build/src -I/mesos/src -I/mesos/3rdparty/libprocess/src/../include -I/mesos/3rdparty/stout/include -isystem /usr/include/apr-1.0 -isystem /mesos/build/3rdparty/boost-1.53.0/src/boost-1.53.0 -isystem /mesos/build/3rdparty/elfio-3.2/src/elfio-3.2 -isystem /mesos/build/3rdparty/glog-0.3.3/src/glog-0.3.3-build/include -isystem /mesos/build/3rdparty/picojson-1.3.0/src/picojson-1.3.0 -isystem /mesos/build/3rdparty/protobuf-3.3.0/src/protobuf-3.3.0/src -isystem /usr/include/subversion-1 -isystem /mesos/build/3rdparty/http_parser-2.6.2/src/http_parser-2.6.2 -isystem /mesos/build/3rdparty/zookeeper-3.4.8/src/zookeeper-3.4.8/src/c/include -isystem /mesos/build/3rdparty/zookeeper-3.4.8/src/zookeeper-3.4.8/src/c/generated -isystem /mesos/build/3rdparty/nvml-352.79/src/nvml-352.79 -isystem /mesos/build/3rdparty/leveldb-1.19/src/leveldb-1.19/include -isystem /mesos/build/3rdparty/googletest-1.8.0/src/googletest-1.8.0/googlemock/include -isystem /mesos/build/3rdparty/googletest-1.8.0/src/googletest-1.8.0/googletest/include  -std=c++11 -Wformat-security -fstack-protector-strong -fPIE   -o CMakeFiles/mesos-tests.dir/api_tests.cpp.o -c /mesos/src/tests/api_tests.cpp
[ 84%] Building CXX object src/tests/CMakeFiles/mesos-tests.dir/attributes_tests.cpp.o
cd /mesos/build/src/tests && /usr/bin/clang++-3.5  -DBUILD_DIR=\"/mesos/build\" -DBUILD_FLAGS=\"\" -DBUILD_JAVA_JVM_LIBRARY=\"\" -DHAS_AUTHENTICATION=1 -DHAVE_LIBZ -DLIBDIR=\"/usr/local/libmesos\" -DPICOJSON_USE_INT64 -DPKGDATADIR=\"/usr/local/share/mesos\" -DPKGLIBEXECDIR=\"/usr/local/libexec/mesos\" -DPKGMODULEDIR=\"\" -DSBINDIR=\"\" -DSOURCE_DIR=\"/mesos\" -DTESTLIBEXECDIR=\"\" -DUSE_CMAKE_BUILD_CONFIG -DUSE_SSL_SOCKET=1 -DUSE_STATIC_LIB -DVERSION=\"1.5.0\" -DZOOKEEPER_VERSION=\"3.4.8\" -D__STDC_FORMAT_MACROS -I/mesos/include -I/mesos/build/include -I/mesos/build/include/mesos -I/mesos/build/src -I/mesos/src -I/mesos/3rdparty/libprocess/src/../include -I/mesos/3rdparty/stout/include -isystem /usr/include/apr-1.0 -isystem /mesos/build/3rdparty/boost-1.53.0/src/boost-1.53.0 -isystem /mesos/build/3rdparty/elfio-3.2/src/elfio-3.2 -isystem /mesos/build/3rdparty/glog-0.3.3/src/glog-0.3.3-build/include -isystem /mesos/build/3rdparty/picojson-1.3.0/src/picojson-1.3.0 -isystem /mesos/build/3rdparty/protobuf-3.3.0/src/protobuf-3.3.0/src -isystem /usr/include/subversion-1 -isystem /mesos/build/3rdparty/http_parser-2.6.2/src/http_parser-2.6.2 -isystem /mesos/build/3rdparty/zookeeper-3.4.8/src/zookeeper-3.4.8/src/c/include -isystem /mesos/build/3rdparty/zookeeper-3.4.8/src/zookeeper-3.4.8/src/c/generated -isystem /mesos/build/3rdparty/nvml-352.79/src/nvml-352.79 -isystem /mesos/build/3rdparty/leveldb-1.19/src/leveldb-1.19/include -isystem /mesos/build/3rdparty/googletest-1.8.0/src/googletest-1.8.0/googlemock/include -isystem /mesos/build/3rdparty/googletest-1.8.0/src/googletest-1.8.0/googletest/include  -std=c++11 -Wformat-security -fstack-protector-strong -fPIE   -o CMakeFiles/mesos-tests.dir/attributes_tests.cpp.o -c /mesos/src/tests/attributes_tests.cpp
[ 84%] Building CXX object src/tests/CMakeFiles/mesos-tests.dir/authentication_tests.cpp.o
cd /mesos/build/src/tests && /usr/bin/clang++-3.5  -DBUILD_DIR=\"/mesos/build\" -DBUILD_FLAGS=\"\" -DBUILD_JAVA_JVM_LIBRARY=\"\" -DHAS_AUTHENTICATION=1 -DHAVE_LIBZ -DLIBDIR=\"/usr/local/libmesos\" -DPICOJSON_USE_INT64 -DPKGDATADIR=\"/usr/local/share/mesos\" -DPKGLIBEXECDIR=\"/usr/local/libexec/mesos\" -DPKGMODULEDIR=\"\" -DSBINDIR=\"\" -DSOURCE_DIR=\"/mesos\" -DTESTLIBEXECDIR=\"\" -DUSE_CMAKE_BUILD_CONFIG -DUSE_SSL_SOCKET=1 -DUSE_STATIC_LIB -DVERSION=\"1.5.0\" -DZOOKEEPER_VERSION=\"3.4.8\" -D__STDC_FORMAT_MACROS -I/mesos/include -I/mesos/build/include -I/mesos/build/include/mesos -I/mesos/build/src -I/mesos/src -I/mesos/3rdparty/libprocess/src/../include -I/mesos/3rdparty/stout/include -isystem /usr/include/apr-1.0 -isystem /mesos/build/3rdparty/boost-1.53.0/src/boost-1.53.0 -isystem /mesos/build/3rdparty/elfio-3.2/src/elfio-3.2 -isystem /mesos/build/3rdparty/glog-0.3.3/src/glog-0.3.3-build/include -isystem /mesos/build/3rdparty/picojson-1.3.0/src/picojson-1.3.0 -isystem /mesos/build/3rdparty/protobuf-3.3.0/src/protobuf-3.3.0/src -isystem /usr/include/subversion-1 -isystem /mesos/build/3rdparty/http_parser-2.6.2/src/http_parser-2.6.2 -isystem /mesos/build/3rdparty/zookeeper-3.4.8/src/zookeeper-3.4.8/src/c/include -isystem /mesos/build/3rdparty/zookeeper-3.4.8/src/zookeeper-3.4.8/src/c/generated -isystem /mesos/build/3rdparty/nvml-352.79/src/nvml-352.79 -isystem /mesos/build/3rdparty/leveldb-1.19/src/leveldb-1.19/include -isystem /mesos/build/3rdparty/googletest-1.8.0/src/googletest-1.8.0/googlemock/include -isystem /mesos/build/3rdparty/googletest-1.8.0/src/googletest-1.8.0/googletest/include  -std=c++11 -Wformat-security -fstack-protector-strong -fPIE   -o CMakeFiles/mesos-tests.dir/authentication_tests.cpp.o -c /mesos/src/tests/authentication_tests.cpp
[ 85%] Building CXX object src/tests/CMakeFiles/mesos-tests.dir/check_tests.cpp.o
cd /mesos/build/src/tests && /usr/bin/clang++-3.5  -DBUILD_DIR=\"/mesos/build\" -DBUILD_FLAGS=\"\" -DBUILD_JAVA_JVM_LIBRARY=\"\" -DHAS_AUTHENTICATION=1 -DHAVE_LIBZ -DLIBDIR=\"/usr/local/libmesos\" -DPICOJSON_USE_INT64 -DPKGDATADIR=\"/usr/local/share/mesos\" -DPKGLIBEXECDIR=\"/usr/local/libexec/mesos\" -DPKGMODULEDIR=\"\" -DSBINDIR=\"\" -DSOURCE_DIR=\"/mesos\" -DTESTLIBEXECDIR=\"\" -DUSE_CMAKE_BUILD_CONFIG -DUSE_SSL_SOCKET=1 -DUSE_STATIC_LIB -DVERSION=\"1.5.0\" -DZOOKEEPER_VERSION=\"3.4.8\" -D__STDC_FORMAT_MACROS -I/mesos/include -I/mesos/build/include -I/mesos/build/include/mesos -I/mesos/build/src -I/mesos/src -I/mesos/3rdparty/libprocess/src/../include -I/mesos/3rdparty/stout/include -isystem /usr/include/apr-1.0 -isystem /mesos/build/3rdparty/boost-1.53.0/src/boost-1.53.0 -isystem /mesos/build/3rdparty/elfio-3.2/src/elfio-3.2 -isystem /mesos/build/3rdparty/glog-0.3.3/src/glog-0.3.3-build/include -isystem /mesos/build/3rdparty/picojson-1.3.0/src/picojson-1.3.0 -isystem /mesos/build/3rdparty/protobuf-3.3.0/src/protobuf-3.3.0/src -isystem /usr/include/subversion-1 -isystem /mesos/build/3rdparty/http_parser-2.6.2/src/http_parser-2.6.2 -isystem /mesos/build/3rdparty/zookeeper-3.4.8/src/zookeeper-3.4.8/src/c/include -isystem /mesos/build/3rdparty/zookeeper-3.4.8/src/zookeeper-3.4.8/src/c/generated -isystem /mesos/build/3rdparty/nvml-352.79/src/nvml-352.79 -isystem /mesos/build/3rdparty/leveldb-1.19/src/leveldb-1.19/include -isystem /mesos/build/3rdparty/googletest-1.8.0/src/googletest-1.8.0/googlemock/include -isystem /mesos/build/3rdparty/googletest-1.8.0/src/googletest-1.8.0/googletest/include  -std=c++11 -Wformat-security -fstack-protector-strong -fPIE   -o CMakeFiles/mesos-tests.dir/check_tests.cpp.o -c /mesos/src/tests/check_tests.cpp
[ 85%] Building CXX object src/tests/CMakeFiles/mesos-tests.dir/command_executor_tests.cpp.o
cd /mesos/build/src/tests && /usr/bin/clang++-3.5  -DBUILD_DIR=\"/mesos/build\" -DBUILD_FLAGS=\"\" -DBUILD_JAVA_JVM_LIBRARY=\"\" -DHAS_AUTHENTICATION=1 -DHAVE_LIBZ -DLIBDIR=\"/usr/local/libmesos\" -DPICOJSON_USE_INT64 -DPKGDATADIR=\"/usr/local/share/mesos\" -DPKGLIBEXECDIR=\"/usr/local/libexec/mesos\" -DPKGMODULEDIR=\"\" -DSBINDIR=\"\" -DSOURCE_DIR=\"/mesos\" -DTESTLIBEXECDIR=\"\" -DUSE_CMAKE_BUILD_CONFIG -DUSE_SSL_SOCKET=1 -DUSE_STATIC_LIB -DVERSION=\"1.5.0\" -DZOOKEEPER_VERSION=\"3.4.8\" -D__STDC_FORMAT_MACROS -I/mesos/include -I/mesos/build/include -I/mesos/build/include/mesos -I/mesos/build/src -I/mesos/src -I/mesos/3rdparty/libprocess/src/../include -I/mesos/3rdparty/stout/include -isystem /usr/include/apr-1.0 -isystem /mesos/build/3rdparty/boost-1.53.0/src/boost-1.53.0 -isystem /mesos/build/3rdparty/elfio-3.2/src/elfio-3.2 -isystem /mesos/build/3rdparty/glog-0.3.3/src/glog-0.3.3-build/include -isystem /mesos/build/3rdparty/picojson-1.3.0/src/picojson-1.3.0 -isystem /mesos/build/3rdparty/protobuf-3.3.0/src/protobuf-3.3.0/src -isystem /usr/include/subversion-1 -isystem /mesos/build/3rdparty/http_parser-2.6.2/src/http_parser-2.6.2 -isystem /mesos/build/3rdparty/zookeeper-3.4.8/src/zookeeper-3.4.8/src/c/include -isystem /mesos/build/3rdparty/zookeeper-3.4.8/src/zookeeper-3.4.8/src/c/generated -isystem /mesos/build/3rdparty/nvml-352.79/src/nvml-352.79 -isystem /mesos/build/3rdparty/leveldb-1.19/src/leveldb-1.19/include -isystem /mesos/build/3rdparty/googletest-1.8.0/src/googletest-1.8.0/googlemock/include -isystem /mesos/build/3rdparty/googletest-1.8.0/src/googletest-1.8.0/googletest/include  -std=c++11 -Wformat-security -fstack-protector-strong -fPIE   -o CMakeFiles/mesos-tests.dir/command_executor_tests.cpp.o -c /mesos/src/tests/command_executor_tests.cpp
[ 85%] Building CXX object src/tests/CMakeFiles/mesos-tests.dir/common_validation_tests.cpp.o
cd /mesos/build/src/tests && /usr/bin/clang++-3.5  -DBUILD_DIR=\"/mesos/build\" -DBUILD_FLAGS=\"\" -DBUILD_JAVA_JVM_LIBRARY=\"\" -DHAS_AUTHENTICATION=1 -DHAVE_LIBZ -DLIBDIR=\"/usr/local/libmesos\" -DPICOJSON_USE_INT64 -DPKGDATADIR=\"/usr/local/share/mesos\" -DPKGLIBEXECDIR=\"/usr/local/libexec/mesos\" -DPKGMODULEDIR=\"\" -DSBINDIR=\"\" -DSOURCE_DIR=\"/mesos\" -DTESTLIBEXECDIR=\"\" -DUSE_CMAKE_BUILD_CONFIG -DUSE_SSL_SOCKET=1 -DUSE_STATIC_LIB -DVERSION=\"1.5.0\" -DZOOKEEPER_VERSION=\"3.4.8\" -D__STDC_FORMAT_MACROS -I/mesos/include -I/mesos/build/include -I/mesos/build/include/mesos -I/mesos/build/src -I/mesos/src -I/mesos/3rdparty/libprocess/src/../include -I/mesos/3rdparty/stout/include -isystem /usr/include/apr-1.0 -isystem /mesos/build/3rdparty/boost-1.53.0/src/boost-1.53.0 -isystem /mesos/build/3rdparty/elfio-3.2/src/elfio-3.2 -isystem /mesos/build/3rdparty/glog-0.3.3/src/glog-0.3.3-build/include -isystem /mesos/build/3rdparty/picojson-1.3.0/src/picojson-1.3.0 -isystem /mesos/build/3rdparty/protobuf-3.3.0/src/protobuf-3.3.0/src -isystem /usr/include/subversion-1 -isystem /mesos/build/3rdparty/http_parser-2.6.2/src/http_parser-2.6.2 -isystem /mesos/build/3rdparty/zookeeper-3.4.8/src/zookeeper-3.4.8/src/c/include -isystem /mesos/build/3rdparty/zookeeper-3.4.8/src/zookeeper-3.4.8/src/c/generated -isystem /mesos/build/3rdparty/nvml-352.79/src/nvml-352.79 -isystem /mesos/build/3rdparty/leveldb-1.19/src/leveldb-1.19/include -isystem /mesos/build/3rdparty/googletest-1.8.0/src/googletest-1.8.0/googlemock/include -isystem /mesos/build/3rdparty/googletest-1.8.0/src/googletest-1.8.0/googletest/include  -std=c++11 -Wformat-security -fstack-protector-strong -fPIE   -o CMakeFiles/mesos-tests.dir/common_validation_tests.cpp.o -c /mesos/src/tests/common_validation_tests.cpp
[ 85%] Building CXX object src/tests/CMakeFiles/mesos-tests.dir/credentials_tests.cpp.o
cd /mesos/build/src/tests && /usr/bin/clang++-3.5  -DBUILD_DIR=\"/mesos/build\" -DBUILD_FLAGS=\"\" -DBUILD_JAVA_JVM_LIBRARY=\"\" -DHAS_AUTHENTICATION=1 -DHAVE_LIBZ -DLIBDIR=\"/usr/local/libmesos\" -DPICOJSON_USE_INT64 -DPKGDATADIR=\"/usr/local/share/mesos\" -DPKGLIBEXECDIR=\"/usr/local/libexec/mesos\" -DPKGMODULEDIR=\"\" -DSBINDIR=\"\" -DSOURCE_DIR=\"/mesos\" -DTESTLIBEXECDIR=\"\" -DUSE_CMAKE_BUILD_CONFIG -DUSE_SSL_SOCKET=1 -DUSE_STATIC_LIB -DVERSION=\"1.5.0\" -DZOOKEEPER_VERSION=\"3.4.8\" -D__STDC_FORMAT_MACROS -I/mesos/include -I/mesos/build/include -I/mesos/build/include/mesos -I/mesos/build/src -I/mesos/src -I/mesos/3rdparty/libprocess/src/../include -I/mesos/3rdparty/stout/include -isystem /usr/include/apr-1.0 -isystem /mesos/build/3rdparty/boost-1.53.0/src/boost-1.53.0 -isystem /mesos/build/3rdparty/elfio-3.2/src/elfio-3.2 -isystem /mesos/build/3rdparty/glog-0.3.3/src/glog-0.3.3-build/include -isystem /mesos/build/3rdparty/picojson-1.3.0/src/picojson-1.3.0 -isystem /mesos/build/3rdparty/protobuf-3.3.0/src/protobuf-3.3.0/src -isystem /usr/include/subversion-1 -isystem /mesos/build/3rdparty/http_parser-2.6.2/src/http_parser-2.6.2 -isystem /mesos/build/3rdparty/zookeeper-3.4.8/src/zookeeper-3.4.8/src/c/include -isystem /mesos/build/3rdparty/zookeeper-3.4.8/src/zookeeper-3.4.8/src/c/generated -isystem /mesos/build/3rdparty/nvml-352.79/src/nvml-352.79 -isystem /mesos/build/3rdparty/leveldb-1.19/src/leveldb-1.19/include -isystem /mesos/build/3rdparty/googletest-1.8.0/src/googletest-1.8.0/googlemock/include -isystem /mesos/build/3rdparty/googletest-1.8.0/src/googletest-1.8.0/googletest/include  -std=c++11 -Wformat-security -fstack-protector-strong -fPIE   -o CMakeFiles/mesos-tests.dir/credentials_tests.cpp.o -c /mesos/src/tests/credentials_tests.cpp
[ 85%] Building CXX object src/tests/CMakeFiles/mesos-tests.dir/default_executor_tests.cpp.o
cd /mesos/build/src/tests && /usr/bin/clang++-3.5  -DBUILD_DIR=\"/mesos/build\" -DBUILD_FLAGS=\"\" -DBUILD_JAVA_JVM_LIBRARY=\"\" -DHAS_AUTHENTICATION=1 -DHAVE_LIBZ -DLIBDIR=\"/usr/local/libmesos\" -DPICOJSON_USE_INT64 -DPKGDATADIR=\"/usr/local/share/mesos\" -DPKGLIBEXECDIR=\"/usr/local/libexec/mesos\" -DPKGMODULEDIR=\"\" -DSBINDIR=\"\" -DSOURCE_DIR=\"/mesos\" -DTESTLIBEXECDIR=\"\" -DUSE_CMAKE_BUILD_CONFIG -DUSE_SSL_SOCKET=1 -DUSE_STATIC_LIB -DVERSION=\"1.5.0\" -DZOOKEEPER_VERSION=\"3.4.8\" -D__STDC_FORMAT_MACROS -I/mesos/include -I/mesos/build/include -I/mesos/build/include/mesos -I/mesos/build/src -I/mesos/src -I/mesos/3rdparty/libprocess/src/../include -I/mesos/3rdparty/stout/include -isystem /usr/include/apr-1.0 -isystem /mesos/build/3rdparty/boost-1.53.0/src/boost-1.53.0 -isystem /mesos/build/3rdparty/elfio-3.2/src/elfio-3.2 -isystem /mesos/build/3rdparty/glog-0.3.3/src/glog-0.3.3-build/include -isystem /mesos/build/3rdparty/picojson-1.3.0/src/picojson-1.3.0 -isystem /mesos/build/3rdparty/protobuf-3.3.0/src/protobuf-3.3.0/src -isystem /usr/include/subversion-1 -isystem /mesos/build/3rdparty/http_parser-2.6.2/src/http_parser-2.6.2 -isystem /mesos/build/3rdparty/zookeeper-3.4.8/src/zookeeper-3.4.8/src/c/include -isystem /mesos/build/3rdparty/zookeeper-3.4.8/src/zookeeper-3.4.8/src/c/generated -isystem /mesos/build/3rdparty/nvml-352.79/src/nvml-352.79 -isystem /mesos/build/3rdparty/leveldb-1.19/src/leveldb-1.19/include -isystem /mesos/build/3rdparty/googletest-1.8.0/src/googletest-1.8.0/googlemock/include -isystem /mesos/build/3rdparty/googletest-1.8.0/src/googletest-1.8.0/googletest/include  -std=c++11 -Wformat-security -fstack-protector-strong -fPIE   -o CMakeFiles/mesos-tests.dir/default_executor_tests.cpp.o -c /mesos/src/tests/default_executor_tests.cpp
[ 85%] Building CXX object src/tests/CMakeFiles/mesos-tests.dir/exception_tests.cpp.o
cd /mesos/build/src/tests && /usr/bin/clang++-3.5  -DBUILD_DIR=\"/mesos/build\" -DBUILD_FLAGS=\"\" -DBUILD_JAVA_JVM_LIBRARY=\"\" -DHAS_AUTHENTICATION=1 -DHAVE_LIBZ -DLIBDIR=\"/usr/local/libmesos\" -DPICOJSON_USE_INT64 -DPKGDATADIR=\"/usr/local/share/mesos\" -DPKGLIBEXECDIR=\"/usr/local/libexec/mesos\" -DPKGMODULEDIR=\"\" -DSBINDIR=\"\" -DSOURCE_DIR=\"/mesos\" -DTESTLIBEXECDIR=\"\" -DUSE_CMAKE_BUILD_CONFIG -DUSE_SSL_SOCKET=1 -DUSE_STATIC_LIB -DVERSION=\"1.5.0\" -DZOOKEEPER_VERSION=\"3.4.8\" -D__STDC_FORMAT_MACROS -I/mesos/include -I/mesos/build/include -I/mesos/build/include/mesos -I/mesos/build/src -I/mesos/src -I/mesos/3rdparty/libprocess/src/../include -I/mesos/3rdparty/stout/include -isystem /usr/include/apr-1.0 -isystem /mesos/build/3rdparty/boost-1.53.0/src/boost-1.53.0 -isystem /mesos/build/3rdparty/elfio-3.2/src/elfio-3.2 -isystem /mesos/build/3rdparty/glog-0.3.3/src/glog-0.3.3-build/include -isystem /mesos/build/3rdparty/picojson-1.3.0/src/picojson-1.3.0 -isystem /mesos/build/3rdparty/protobuf-3.3.0/src/protobuf-3.3.0/src -isystem /usr/include/subversion-1 -isystem /mesos/build/3rdparty/http_parser-2.6.2/src/http_parser-2.6.2 -isystem /mesos/build/3rdparty/zookeeper-3.4.8/src/zookeeper-3.4.8/src/c/include -isystem /mesos/build/3rdparty/zookeeper-3.4.8/src/zookeeper-3.4.8/src/c/generated -isystem /mesos/build/3rdparty/nvml-352.79/src/nvml-352.79 -isystem /mesos/build/3rdparty/leveldb-1.19/src/leveldb-1.19/include -isystem /mesos/build/3rdparty/googletest-1.8.0/src/googletest-1.8.0/googlemock/include -isystem /mesos/build/3rdparty/googletest-1.8.0/src/googletest-1.8.0/googletest/include  -std=c++11 -Wformat-security -fstack-protector-strong -fPIE   -o CMakeFiles/mesos-tests.dir/exception_tests.cpp.o -c /mesos/src/tests/exception_tests.cpp
[ 85%] Building CXX object src/tests/CMakeFiles/mesos-tests.dir/executor_http_api_tests.cpp.o
cd /mesos/build/src/tests && /usr/bin/clang++-3.5  -DBUILD_DIR=\"/mesos/build\" -DBUILD_FLAGS=\"\" -DBUILD_JAVA_JVM_LIBRARY=\"\" -DHAS_AUTHENTICATION=1 -DHAVE_LIBZ -DLIBDIR=\"/usr/local/libmesos\" -DPICOJSON_USE_INT64 -DPKGDATADIR=\"/usr/local/share/mesos\" -DPKGLIBEXECDIR=\"/usr/local/libexec/mesos\" -DPKGMODULEDIR=\"\" -DSBINDIR=\"\" -DSOURCE_DIR=\"/mesos\" -DTESTLIBEXECDIR=\"\" -DUSE_CMAKE_BUILD_CONFIG -DUSE_SSL_SOCKET=1 -DUSE_STATIC_LIB -DVERSION=\"1.5.0\" -DZOOKEEPER_VERSION=\"3.4.8\" -D__STDC_FORMAT_MACROS -I/mesos/include -I/mesos/build/include -I/mesos/build/include/mesos -I/mesos/build/src -I/mesos/src -I/mesos/3rdparty/libprocess/src/../include -I/mesos/3rdparty/stout/include -isystem /usr/include/apr-1.0 -isystem /mesos/build/3rdparty/boost-1.53.0/src/boost-1.53.0 -isystem /mesos/build/3rdparty/elfio-3.2/src/elfio-3.2 -isystem /mesos/build/3rdparty/glog-0.3.3/src/glog-0.3.3-build/include -isystem /mesos/build/3rdparty/picojson-1.3.0/src/picojson-1.3.0 -isystem /mesos/build/3rdparty/protobuf-3.3.0/src/protobuf-3.3.0/src -isystem /usr/include/subversion-1 -isystem /mesos/build/3rdparty/http_parser-2.6.2/src/http_parser-2.6.2 -isystem /mesos/build/3rdparty/zookeeper-3.4.8/src/zookeeper-3.4.8/src/c/include -isystem /mesos/build/3rdparty/zookeeper-3.4.8/src/zookeeper-3.4.8/src/c/generated -isystem /mesos/build/3rdparty/nvml-352.79/src/nvml-352.79 -isystem /mesos/build/3rdparty/leveldb-1.19/src/leveldb-1.19/include -isystem /mesos/build/3rdparty/googletest-1.8.0/src/googletest-1.8.0/googlemock/include -isystem /mesos/build/3rdparty/googletest-1.8.0/src/googletest-1.8.0/googletest/include  -std=c++11 -Wformat-security -fstack-protector-strong -fPIE   -o CMakeFiles/mesos-tests.dir/executor_http_api_tests.cpp.o -c /mesos/src/tests/executor_http_api_tests.cpp
[ 85%] Building CXX object src/tests/CMakeFiles/mesos-tests.dir/fault_tolerance_tests.cpp.o
cd /mesos/build/src/tests && /usr/bin/clang++-3.5  -DBUILD_DIR=\"/mesos/build\" -DBUILD_FLAGS=\"\" -DBUILD_JAVA_JVM_LIBRARY=\"\" -DHAS_AUTHENTICATION=1 -DHAVE_LIBZ -DLIBDIR=\"/usr/local/libmesos\" -DPICOJSON_USE_INT64 -DPKGDATADIR=\"/usr/local/share/mesos\" -DPKGLIBEXECDIR=\"/usr/local/libexec/mesos\" -DPKGMODULEDIR=\"\" -DSBINDIR=\"\" -DSOURCE_DIR=\"/mesos\" -DTESTLIBEXECDIR=\"\" -DUSE_CMAKE_BUILD_CONFIG -DUSE_SSL_SOCKET=1 -DUSE_STATIC_LIB -DVERSION=\"1.5.0\" -DZOOKEEPER_VERSION=\"3.4.8\" -D__STDC_FORMAT_MACROS -I/mesos/include -I/mesos/build/include -I/mesos/build/include/mesos -I/mesos/build/src -I/mesos/src -I/mesos/3rdparty/libprocess/src/../include -I/mesos/3rdparty/stout/include -isystem /usr/include/apr-1.0 -isystem /mesos/build/3rdparty/boost-1.53.0/src/boost-1.53.0 -isystem /mesos/build/3rdparty/elfio-3.2/src/elfio-3.2 -isystem /mesos/build/3rdparty/glog-0.3.3/src/glog-0.3.3-build/include -isystem /mesos/build/3rdparty/picojson-1.3.0/src/picojson-1.3.0 -isystem /mesos/build/3rdparty/protobuf-3.3.0/src/protobuf-3.3.0/src -isystem /usr/include/subversion-1 -isystem /mesos/build/3rdparty/http_parser-2.6.2/src/http_parser-2.6.2 -isystem /mesos/build/3rdparty/zookeeper-3.4.8/src/zookeeper-3.4.8/src/c/include -isystem /mesos/build/3rdparty/zookeeper-3.4.8/src/zookeeper-3.4.8/src/c/generated -isystem /mesos/build/3rdparty/nvml-352.79/src/nvml-352.79 -isystem /mesos/build/3rdparty/leveldb-1.19/src/leveldb-1.19/include -isystem /mesos/build/3rdparty/googletest-1.8.0/src/googletest-1.8.0/googlemock/include -isystem /mesos/build/3rdparty/googletest-1.8.0/src/googletest-1.8.0/googletest/include  -std=c++11 -Wformat-security -fstack-protector-strong -fPIE   -o CMakeFiles/mesos-tests.dir/fault_tolerance_tests.cpp.o -c /mesos/src/tests/fault_tolerance_tests.cpp
[ 86%] Building CXX object src/tests/CMakeFiles/mesos-tests.dir/fetcher_tests.cpp.o
cd /mesos/build/src/tests && /usr/bin/clang++-3.5  -DBUILD_DIR=\"/mesos/build\" -DBUILD_FLAGS=\"\" -DBUILD_JAVA_JVM_LIBRARY=\"\" -DHAS_AUTHENTICATION=1 -DHAVE_LIBZ -DLIBDIR=\"/usr/local/libmesos\" -DPICOJSON_USE_INT64 -DPKGDATADIR=\"/usr/local/share/mesos\" -DPKGLIBEXECDIR=\"/usr/local/libexec/mesos\" -DPKGMODULEDIR=\"\" -DSBINDIR=\"\" -DSOURCE_DIR=\"/mesos\" -DTESTLIBEXECDIR=\"\" -DUSE_CMAKE_BUILD_CONFIG -DUSE_SSL_SOCKET=1 -DUSE_STATIC_LIB -DVERSION=\"1.5.0\" -DZOOKEEPER_VERSION=\"3.4.8\" -D__STDC_FORMAT_MACROS -I/mesos/include -I/mesos/build/include -I/mesos/build/include/mesos -I/mesos/build/src -I/mesos/src -I/mesos/3rdparty/libprocess/src/../include -I/mesos/3rdparty/stout/include -isystem /usr/include/apr-1.0 -isystem /mesos/build/3rdparty/boost-1.53.0/src/boost-1.53.0 -isystem /mesos/build/3rdparty/elfio-3.2/src/elfio-3.2 -isystem /mesos/build/3rdparty/glog-0.3.3/src/glog-0.3.3-build/include -isystem /mesos/build/3rdparty/picojson-1.3.0/src/picojson-1.3.0 -isystem /mesos/build/3rdparty/protobuf-3.3.0/src/protobuf-3.3.0/src -isystem /usr/include/subversion-1 -isystem /mesos/build/3rdparty/http_parser-2.6.2/src/http_parser-2.6.2 -isystem /mesos/build/3rdparty/zookeeper-3.4.8/src/zookeeper-3.4.8/src/c/include -isystem /mesos/build/3rdparty/zookeeper-3.4.8/src/zookeeper-3.4.8/src/c/generated -isystem /mesos/build/3rdparty/nvml-352.79/src/nvml-352.79 -isystem /mesos/build/3rdparty/leveldb-1.19/src/leveldb-1.19/include -isystem /mesos/build/3rdparty/googletest-1.8.0/src/googletest-1.8.0/googlemock/include -isystem /mesos/build/3rdparty/googletest-1.8.0/src/googletest-1.8.0/googletest/include  -std=c++11 -Wformat-security -fstack-protector-strong -fPIE   -o CMakeFiles/mesos-tests.dir/fetcher_tests.cpp.o -c /mesos/src/tests/fetcher_tests.cpp
[ 86%] Building CXX object src/tests/CMakeFiles/mesos-tests.dir/files_tests.cpp.o
cd /mesos/build/src/tests && /usr/bin/clang++-3.5  -DBUILD_DIR=\"/mesos/build\" -DBUILD_FLAGS=\"\" -DBUILD_JAVA_JVM_LIBRARY=\"\" -DHAS_AUTHENTICATION=1 -DHAVE_LIBZ -DLIBDIR=\"/usr/local/libmesos\" -DPICOJSON_USE_INT64 -DPKGDATADIR=\"/usr/local/share/mesos\" -DPKGLIBEXECDIR=\"/usr/local/libexec/mesos\" -DPKGMODULEDIR=\"\" -DSBINDIR=\"\" -DSOURCE_DIR=\"/mesos\" -DTESTLIBEXECDIR=\"\" -DUSE_CMAKE_BUILD_CONFIG -DUSE_SSL_SOCKET=1 -DUSE_STATIC_LIB -DVERSION=\"1.5.0\" -DZOOKEEPER_VERSION=\"3.4.8\" -D__STDC_FORMAT_MACROS -I/mesos/include -I/mesos/build/include -I/mesos/build/include/mesos -I/mesos/build/src -I/mesos/src -I/mesos/3rdparty/libprocess/src/../include -I/mesos/3rdparty/stout/include -isystem /usr/include/apr-1.0 -isystem /mesos/build/3rdparty/boost-1.53.0/src/boost-1.53.0 -isystem /mesos/build/3rdparty/elfio-3.2/src/elfio-3.2 -isystem /mesos/build/3rdparty/glog-0.3.3/src/glog-0.3.3-build/include -isystem /mesos/build/3rdparty/picojson-1.3.0/src/picojson-1.3.0 -isystem /mesos/build/3rdparty/protobuf-3.3.0/src/protobuf-3.3.0/src -isystem /usr/include/subversion-1 -isystem /mesos/build/3rdparty/http_parser-2.6.2/src/http_parser-2.6.2 -isystem /mesos/build/3rdparty/zookeeper-3.4.8/src/zookeeper-3.4.8/src/c/include -isystem /mesos/build/3rdparty/zookeeper-3.4.8/src/zookeeper-3.4.8/src/c/generated -isystem /mesos/build/3rdparty/nvml-352.79/src/nvml-352.79 -isystem /mesos/build/3rdparty/leveldb-1.19/src/leveldb-1.19/include -isystem /mesos/build/3rdparty/googletest-1.8.0/src/googletest-1.8.0/googlemock/include -isystem /mesos/build/3rdparty/googletest-1.8.0/src/googletest-1.8.0/googletest/include  -std=c++11 -Wformat-security -fstack-protector-strong -fPIE   -o CMakeFiles/mesos-tests.dir/files_tests.cpp.o -c /mesos/src/tests/files_tests.cpp
[ 86%] Building CXX object src/tests/CMakeFiles/mesos-tests.dir/gc_tests.cpp.o
cd /mesos/build/src/tests && /usr/bin/clang++-3.5  -DBUILD_DIR=\"/mesos/build\" -DBUILD_FLAGS=\"\" -DBUILD_JAVA_JVM_LIBRARY=\"\" -DHAS_AUTHENTICATION=1 -DHAVE_LIBZ -DLIBDIR=\"/usr/local/libmesos\" -DPICOJSON_USE_INT64 -DPKGDATADIR=\"/usr/local/share/mesos\" -DPKGLIBEXECDIR=\"/usr/local/libexec/mesos\" -DPKGMODULEDIR=\"\" -DSBINDIR=\"\" -DSOURCE_DIR=\"/mesos\" -DTESTLIBEXECDIR=\"\" -DUSE_CMAKE_BUILD_CONFIG -DUSE_SSL_SOCKET=1 -DUSE_STATIC_LIB -DVERSION=\"1.5.0\" -DZOOKEEPER_VERSION=\"3.4.8\" -D__STDC_FORMAT_MACROS -I/mesos/include -I/mesos/build/include -I/mesos/build/include/mesos -I/mesos/build/src -I/mesos/src -I/mesos/3rdparty/libprocess/src/../include -I/mesos/3rdparty/stout/include -isystem /usr/include/apr-1.0 -isystem /mesos/build/3rdparty/boost-1.53.0/src/boost-1.53.0 -isystem /mesos/build/3rdparty/elfio-3.2/src/elfio-3.2 -isystem /mesos/build/3rdparty/glog-0.3.3/src/glog-0.3.3-build/include -isystem /mesos/build/3rdparty/picojson-1.3.0/src/picojson-1.3.0 -isystem /mesos/build/3rdparty/protobuf-3.3.0/src/protobuf-3.3.0/src -isystem /usr/include/subversion-1 -isystem /mesos/build/3rdparty/http_parser-2.6.2/src/http_parser-2.6.2 -isystem /mesos/build/3rdparty/zookeeper-3.4.8/src/zookeeper-3.4.8/src/c/include -isystem /mesos/build/3rdparty/zookeeper-3.4.8/src/zookeeper-3.4.8/src/c/generated -isystem /mesos/build/3rdparty/nvml-352.79/src/nvml-352.79 -isystem /mesos/build/3rdparty/leveldb-1.19/src/leveldb-1.19/include -isystem /mesos/build/3rdparty/googletest-1.8.0/src/googletest-1.8.0/googlemock/include -isystem /mesos/build/3rdparty/googletest-1.8.0/src/googletest-1.8.0/googletest/include  -std=c++11 -Wformat-security -fstack-protector-strong -fPIE   -o CMakeFiles/mesos-tests.dir/gc_tests.cpp.o -c /mesos/src/tests/gc_tests.cpp
[ 86%] Building CXX object src/tests/CMakeFiles/mesos-tests.dir/health_check_tests.cpp.o
cd /mesos/build/src/tests && /usr/bin/clang++-3.5  -DBUILD_DIR=\"/mesos/build\" -DBUILD_FLAGS=\"\" -DBUILD_JAVA_JVM_LIBRARY=\"\" -DHAS_AUTHENTICATION=1 -DHAVE_LIBZ -DLIBDIR=\"/usr/local/libmesos\" -DPICOJSON_USE_INT64 -DPKGDATADIR=\"/usr/local/share/mesos\" -DPKGLIBEXECDIR=\"/usr/local/libexec/mesos\" -DPKGMODULEDIR=\"\" -DSBINDIR=\"\" -DSOURCE_DIR=\"/mesos\" -DTESTLIBEXECDIR=\"\" -DUSE_CMAKE_BUILD_CONFIG -DUSE_SSL_SOCKET=1 -DUSE_STATIC_LIB -DVERSION=\"1.5.0\" -DZOOKEEPER_VERSION=\"3.4.8\" -D__STDC_FORMAT_MACROS -I/mesos/include -I/mesos/build/include -I/mesos/build/include/mesos -I/mesos/build/src -I/mesos/src -I/mesos/3rdparty/libprocess/src/../include -I/mesos/3rdparty/stout/include -isystem /usr/include/apr-1.0 -isystem /mesos/build/3rdparty/boost-1.53.0/src/boost-1.53.0 -isystem /mesos/build/3rdparty/elfio-3.2/src/elfio-3.2 -isystem /mesos/build/3rdparty/glog-0.3.3/src/glog-0.3.3-build/include -isystem /mesos/build/3rdparty/picojson-1.3.0/src/picojson-1.3.0 -isystem /mesos/build/3rdparty/protobuf-3.3.0/src/protobuf-3.3.0/src -isystem /usr/include/subversion-1 -isystem /mesos/build/3rdparty/http_parser-2.6.2/src/http_parser-2.6.2 -isystem /mesos/build/3rdparty/zookeeper-3.4.8/src/zookeeper-3.4.8/src/c/include -isystem /mesos/build/3rdparty/zookeeper-3.4.8/src/zookeeper-3.4.8/src/c/generated -isystem /mesos/build/3rdparty/nvml-352.79/src/nvml-352.79 -isystem /mesos/build/3rdparty/leveldb-1.19/src/leveldb-1.19/include -isystem /mesos/build/3rdparty/googletest-1.8.0/src/googletest-1.8.0/googlemock/include -isystem /mesos/build/3rdparty/googletest-1.8.0/src/googletest-1.8.0/googletest/include  -std=c++11 -Wformat-security -fstack-protector-strong -fPIE   -o CMakeFiles/mesos-tests.dir/health_check_tests.cpp.o -c /mesos/src/tests/health_check_tests.cpp
[ 86%] Building CXX object src/tests/CMakeFiles/mesos-tests.dir/hierarchical_allocator_tests.cpp.o
cd /mesos/build/src/tests && /usr/bin/clang++-3.5  -DBUILD_DIR=\"/mesos/build\" -DBUILD_FLAGS=\"\" -DBUILD_JAVA_JVM_LIBRARY=\"\" -DHAS_AUTHENTICATION=1 -DHAVE_LIBZ -DLIBDIR=\"/usr/local/libmesos\" -DPICOJSON_USE_INT64 -DPKGDATADIR=\"/usr/local/share/mesos\" -DPKGLIBEXECDIR=\"/usr/local/libexec/mesos\" -DPKGMODULEDIR=\"\" -DSBINDIR=\"\" -DSOURCE_DIR=\"/mesos\" -DTESTLIBEXECDIR=\"\" -DUSE_CMAKE_BUILD_CONFIG -DUSE_SSL_SOCKET=1 -DUSE_STATIC_LIB -DVERSION=\"1.5.0\" -DZOOKEEPER_VERSION=\"3.4.8\" -D__STDC_FORMAT_MACROS -I/mesos/include -I/mesos/build/include -I/mesos/build/include/mesos -I/mesos/build/src -I/mesos/src -I/mesos/3rdparty/libprocess/src/../include -I/mesos/3rdparty/stout/include -isystem /usr/include/apr-1.0 -isystem /mesos/build/3rdparty/boost-1.53.0/src/boost-1.53.0 -isystem /mesos/build/3rdparty/elfio-3.2/src/elfio-3.2 -isystem /mesos/build/3rdparty/glog-0.3.3/src/glog-0.3.3-build/include -isystem /mesos/build/3rdparty/picojson-1.3.0/src/picojson-1.3.0 -isystem /mesos/build/3rdparty/protobuf-3.3.0/src/protobuf-3.3.0/src -isystem /usr/include/subversion-1 -isystem /mesos/build/3rdparty/http_parser-2.6.2/src/http_parser-2.6.2 -isystem /mesos/build/3rdparty/zookeeper-3.4.8/src/zookeeper-3.4.8/src/c/include -isystem /mesos/build/3rdparty/zookeeper-3.4.8/src/zookeeper-3.4.8/src/c/generated -isystem /mesos/build/3rdparty/nvml-352.79/src/nvml-352.79 -isystem /mesos/build/3rdparty/leveldb-1.19/src/leveldb-1.19/include -isystem /mesos/build/3rdparty/googletest-1.8.0/src/googletest-1.8.0/googlemock/include -isystem /mesos/build/3rdparty/googletest-1.8.0/src/googletest-1.8.0/googletest/include  -std=c++11 -Wformat-security -fstack-protector-strong -fPIE   -o CMakeFiles/mesos-tests.dir/hierarchical_allocator_tests.cpp.o -c /mesos/src/tests/hierarchical_allocator_tests.cpp
[ 86%] Building CXX object src/tests/CMakeFiles/mesos-tests.dir/hook_tests.cpp.o
cd /mesos/build/src/tests && /usr/bin/clang++-3.5  -DBUILD_DIR=\"/mesos/build\" -DBUILD_FLAGS=\"\" -DBUILD_JAVA_JVM_LIBRARY=\"\" -DHAS_AUTHENTICATION=1 -DHAVE_LIBZ -DLIBDIR=\"/usr/local/libmesos\" -DPICOJSON_USE_INT64 -DPKGDATADIR=\"/usr/local/share/mesos\" -DPKGLIBEXECDIR=\"/usr/local/libexec/mesos\" -DPKGMODULEDIR=\"\" -DSBINDIR=\"\" -DSOURCE_DIR=\"/mesos\" -DTESTLIBEXECDIR=\"\" -DUSE_CMAKE_BUILD_CONFIG -DUSE_SSL_SOCKET=1 -DUSE_STATIC_LIB -DVERSION=\"1.5.0\" -DZOOKEEPER_VERSION=\"3.4.8\" -D__STDC_FORMAT_MACROS -I/mesos/include -I/mesos/build/include -I/mesos/build/include/mesos -I/mesos/build/src -I/mesos/src -I/mesos/3rdparty/libprocess/src/../include -I/mesos/3rdparty/stout/include -isystem /usr/include/apr-1.0 -isystem /mesos/build/3rdparty/boost-1.53.0/src/boost-1.53.0 -isystem /mesos/build/3rdparty/elfio-3.2/src/elfio-3.2 -isystem /mesos/build/3rdparty/glog-0.3.3/src/glog-0.3.3-build/include -isystem /mesos/build/3rdparty/picojson-1.3.0/src/picojson-1.3.0 -isystem /mesos/build/3rdparty/protobuf-3.3.0/src/protobuf-3.3.0/src -isystem /usr/include/subversion-1 -isystem /mesos/build/3rdparty/http_parser-2.6.2/src/http_parser-2.6.2 -isystem /mesos/build/3rdparty/zookeeper-3.4.8/src/zookeeper-3.4.8/src/c/include -isystem /mesos/build/3rdparty/zookeeper-3.4.8/src/zookeeper-3.4.8/src/c/generated -isystem /mesos/build/3rdparty/nvml-352.79/src/nvml-352.79 -isystem /mesos/build/3rdparty/leveldb-1.19/src/leveldb-1.19/include -isystem /mesos/build/3rdparty/googletest-1.8.0/src/googletest-1.8.0/googlemock/include -isystem /mesos/build/3rdparty/googletest-1.8.0/src/googletest-1.8.0/googletest/include  -std=c++11 -Wformat-security -fstack-protector-strong -fPIE   -o CMakeFiles/mesos-tests.dir/hook_tests.cpp.o -c /mesos/src/tests/hook_tests.cpp
[ 86%] Building CXX object src/tests/CMakeFiles/mesos-tests.dir/http_authentication_tests.cpp.o
cd /mesos/build/src/tests && /usr/bin/clang++-3.5  -DBUILD_DIR=\"/mesos/build\" -DBUILD_FLAGS=\"\" -DBUILD_JAVA_JVM_LIBRARY=\"\" -DHAS_AUTHENTICATION=1 -DHAVE_LIBZ -DLIBDIR=\"/usr/local/libmesos\" -DPICOJSON_USE_INT64 -DPKGDATADIR=\"/usr/local/share/mesos\" -DPKGLIBEXECDIR=\"/usr/local/libexec/mesos\" -DPKGMODULEDIR=\"\" -DSBINDIR=\"\" -DSOURCE_DIR=\"/mesos\" -DTESTLIBEXECDIR=\"\" -DUSE_CMAKE_BUILD_CONFIG -DUSE_SSL_SOCKET=1 -DUSE_STATIC_LIB -DVERSION=\"1.5.0\" -DZOOKEEPER_VERSION=\"3.4.8\" -D__STDC_FORMAT_MACROS -I/mesos/include -I/mesos/build/include -I/mesos/build/include/mesos -I/mesos/build/src -I/mesos/src -I/mesos/3rdparty/libprocess/src/../include -I/mesos/3rdparty/stout/include -isystem /usr/include/apr-1.0 -isystem /mesos/build/3rdparty/boost-1.53.0/src/boost-1.53.0 -isystem /mesos/build/3rdparty/elfio-3.2/src/elfio-3.2 -isystem /mesos/build/3rdparty/glog-0.3.3/src/glog-0.3.3-build/include -isystem /mesos/build/3rdparty/picojson-1.3.0/src/picojson-1.3.0 -isystem /mesos/build/3rdparty/protobuf-3.3.0/src/protobuf-3.3.0/src -isystem /usr/include/subversion-1 -isystem /mesos/build/3rdparty/http_parser-2.6.2/src/http_parser-2.6.2 -isystem /mesos/build/3rdparty/zookeeper-3.4.8/src/zookeeper-3.4.8/src/c/include -isystem /mesos/build/3rdparty/zookeeper-3.4.8/src/zookeeper-3.4.8/src/c/generated -isystem /mesos/build/3rdparty/nvml-352.79/src/nvml-352.79 -isystem /mesos/build/3rdparty/leveldb-1.19/src/leveldb-1.19/include -isystem /mesos/build/3rdparty/googletest-1.8.0/src/googletest-1.8.0/googlemock/include -isystem /mesos/build/3rdparty/googletest-1.8.0/src/googletest-1.8.0/googletest/include  -std=c++11 -Wformat-security -fstack-protector-strong -fPIE   -o CMakeFiles/mesos-tests.dir/http_authentication_tests.cpp.o -c /mesos/src/tests/http_authentication_tests.cpp
[ 87%] Building CXX object src/tests/CMakeFiles/mesos-tests.dir/http_fault_tolerance_tests.cpp.o
cd /mesos/build/src/tests && /usr/bin/clang++-3.5  -DBUILD_DIR=\"/mesos/build\" -DBUILD_FLAGS=\"\" -DBUILD_JAVA_JVM_LIBRARY=\"\" -DHAS_AUTHENTICATION=1 -DHAVE_LIBZ -DLIBDIR=\"/usr/local/libmesos\" -DPICOJSON_USE_INT64 -DPKGDATADIR=\"/usr/local/share/mesos\" -DPKGLIBEXECDIR=\"/usr/local/libexec/mesos\" -DPKGMODULEDIR=\"\" -DSBINDIR=\"\" -DSOURCE_DIR=\"/mesos\" -DTESTLIBEXECDIR=\"\" -DUSE_CMAKE_BUILD_CONFIG -DUSE_SSL_SOCKET=1 -DUSE_STATIC_LIB -DVERSION=\"1.5.0\" -DZOOKEEPER_VERSION=\"3.4.8\" -D__STDC_FORMAT_MACROS -I/mesos/include -I/mesos/build/include -I/mesos/build/include/mesos -I/mesos/build/src -I/mesos/src -I/mesos/3rdparty/libprocess/src/../include -I/mesos/3rdparty/stout/include -isystem /usr/include/apr-1.0 -isystem /mesos/build/3rdparty/boost-1.53.0/src/boost-1.53.0 -isystem /mesos/build/3rdparty/elfio-3.2/src/elfio-3.2 -isystem /mesos/build/3rdparty/glog-0.3.3/src/glog-0.3.3-build/include -isystem /mesos/build/3rdparty/picojson-1.3.0/src/picojson-1.3.0 -isystem /mesos/build/3rdparty/protobuf-3.3.0/src/protobuf-3.3.0/src -isystem /usr/include/subversion-1 -isystem /mesos/build/3rdparty/http_parser-2.6.2/src/http_parser-2.6.2 -isystem /mesos/build/3rdparty/zookeeper-3.4.8/src/zookeeper-3.4.8/src/c/include -isystem /mesos/build/3rdparty/zookeeper-3.4.8/src/zookeeper-3.4.8/src/c/generated -isystem /mesos/build/3rdparty/nvml-352.79/src/nvml-352.79 -isystem /mesos/build/3rdparty/leveldb-1.19/src/leveldb-1.19/include -isystem /mesos/build/3rdparty/googletest-1.8.0/src/googletest-1.8.0/googlemock/include -isystem /mesos/build/3rdparty/googletest-1.8.0/src/googletest-1.8.0/googletest/include  -std=c++11 -Wformat-security -fstack-protector-strong -fPIE   -o CMakeFiles/mesos-tests.dir/http_fault_tolerance_tests.cpp.o -c /mesos/src/tests/http_fault_tolerance_tests.cpp
[ 87%] Building CXX object src/tests/CMakeFiles/mesos-tests.dir/master_maintenance_tests.cpp.o
cd /mesos/build/src/tests && /usr/bin/clang++-3.5  -DBUILD_DIR=\"/mesos/build\" -DBUILD_FLAGS=\"\" -DBUILD_JAVA_JVM_LIBRARY=\"\" -DHAS_AUTHENTICATION=1 -DHAVE_LIBZ -DLIBDIR=\"/usr/local/libmesos\" -DPICOJSON_USE_INT64 -DPKGDATADIR=\"/usr/local/share/mesos\" -DPKGLIBEXECDIR=\"/usr/local/libexec/mesos\" -DPKGMODULEDIR=\"\" -DSBINDIR=\"\" -DSOURCE_DIR=\"/mesos\" -DTESTLIBEXECDIR=\"\" -DUSE_CMAKE_BUILD_CONFIG -DUSE_SSL_SOCKET=1 -DUSE_STATIC_LIB -DVERSION=\"1.5.0\" -DZOOKEEPER_VERSION=\"3.4.8\" -D__STDC_FORMAT_MACROS -I/mesos/include -I/mesos/build/include -I/mesos/build/include/mesos -I/mesos/build/src -I/mesos/src -I/mesos/3rdparty/libprocess/src/../include -I/mesos/3rdparty/stout/include -isystem /usr/include/apr-1.0 -isystem /mesos/build/3rdparty/boost-1.53.0/src/boost-1.53.0 -isystem /mesos/build/3rdparty/elfio-3.2/src/elfio-3.2 -isystem /mesos/build/3rdparty/glog-0.3.3/src/glog-0.3.3-build/include -isystem /mesos/build/3rdparty/picojson-1.3.0/src/picojson-1.3.0 -isystem /mesos/build/3rdparty/protobuf-3.3.0/src/protobuf-3.3.0/src -isystem /usr/include/subversion-1 -isystem /mesos/build/3rdparty/http_parser-2.6.2/src/http_parser-2.6.2 -isystem /mesos/build/3rdparty/zookeeper-3.4.8/src/zookeeper-3.4.8/src/c/include -isystem /mesos/build/3rdparty/zookeeper-3.4.8/src/zookeeper-3.4.8/src/c/generated -isystem /mesos/build/3rdparty/nvml-352.79/src/nvml-352.79 -isystem /mesos/build/3rdparty/leveldb-1.19/src/leveldb-1.19/include -isystem /mesos/build/3rdparty/googletest-1.8.0/src/googletest-1.8.0/googlemock/include -isystem /mesos/build/3rdparty/googletest-1.8.0/src/googletest-1.8.0/googletest/include  -std=c++11 -Wformat-security -fstack-protector-strong -fPIE   -o CMakeFiles/mesos-tests.dir/master_maintenance_tests.cpp.o -c /mesos/src/tests/master_maintenance_tests.cpp
[ 87%] Building CXX object src/tests/CMakeFiles/mesos-tests.dir/master_slave_reconciliation_tests.cpp.o
cd /mesos/build/src/tests && /usr/bin/clang++-3.5  -DBUILD_DIR=\"/mesos/build\" -DBUILD_FLAGS=\"\" -DBUILD_JAVA_JVM_LIBRARY=\"\" -DHAS_AUTHENTICATION=1 -DHAVE_LIBZ -DLIBDIR=\"/usr/local/libmesos\" -DPICOJSON_USE_INT64 -DPKGDATADIR=\"/usr/local/share/mesos\" -DPKGLIBEXECDIR=\"/usr/local/libexec/mesos\" -DPKGMODULEDIR=\"\" -DSBINDIR=\"\" -DSOURCE_DIR=\"/mesos\" -DTESTLIBEXECDIR=\"\" -DUSE_CMAKE_BUILD_CONFIG -DUSE_SSL_SOCKET=1 -DUSE_STATIC_LIB -DVERSION=\"1.5.0\" -DZOOKEEPER_VERSION=\"3.4.8\" -D__STDC_FORMAT_MACROS -I/mesos/include -I/mesos/build/include -I/mesos/build/include/mesos -I/mesos/build/src -I/mesos/src -I/mesos/3rdparty/libprocess/src/../include -I/mesos/3rdparty/stout/include -isystem /usr/include/apr-1.0 -isystem /mesos/build/3rdparty/boost-1.53.0/src/boost-1.53.0 -isystem /mesos/build/3rdparty/elfio-3.2/src/elfio-3.2 -isystem /mesos/build/3rdparty/glog-0.3.3/src/glog-0.3.3-build/include -isystem /mesos/build/3rdparty/picojson-1.3.0/src/picojson-1.3.0 -isystem /mesos/build/3rdparty/protobuf-3.3.0/src/protobuf-3.3.0/src -isystem /usr/include/subversion-1 -isystem /mesos/build/3rdparty/http_parser-2.6.2/src/http_parser-2.6.2 -isystem /mesos/build/3rdparty/zookeeper-3.4.8/src/zookeeper-3.4.8/src/c/include -isystem /mesos/build/3rdparty/zookeeper-3.4.8/src/zookeeper-3.4.8/src/c/generated -isystem /mesos/build/3rdparty/nvml-352.79/src/nvml-352.79 -isystem /mesos/build/3rdparty/leveldb-1.19/src/leveldb-1.19/include -isystem /mesos/build/3rdparty/googletest-1.8.0/src/googletest-1.8.0/googlemock/include -isystem /mesos/build/3rdparty/googletest-1.8.0/src/googletest-1.8.0/googletest/include  -std=c++11 -Wformat-security -fstack-protector-strong -fPIE   -o CMakeFiles/mesos-tests.dir/master_slave_reconciliation_tests.cpp.o -c /mesos/src/tests/master_slave_reconciliation_tests.cpp
[ 87%] Building CXX object src/tests/CMakeFiles/mesos-tests.dir/partition_tests.cpp.o
cd /mesos/build/src/tests && /usr/bin/clang++-3.5  -DBUILD_DIR=\"/mesos/build\" -DBUILD_FLAGS=\"\" -DBUILD_JAVA_JVM_LIBRARY=\"\" -DHAS_AUTHENTICATION=1 -DHAVE_LIBZ -DLIBDIR=\"/usr/local/libmesos\" -DPICOJSON_USE_INT64 -DPKGDATADIR=\"/usr/local/share/mesos\" -DPKGLIBEXECDIR=\"/usr/local/libexec/mesos\" -DPKGMODULEDIR=\"\" -DSBINDIR=\"\" -DSOURCE_DIR=\"/mesos\" -DTESTLIBEXECDIR=\"\" -DUSE_CMAKE_BUILD_CONFIG -DUSE_SSL_SOCKET=1 -DUSE_STATIC_LIB -DVERSION=\"1.5.0\" -DZOOKEEPER_VERSION=\"3.4.8\" -D__STDC_FORMAT_MACROS -I/mesos/include -I/mesos/build/include -I/mesos/build/include/mesos -I/mesos/build/src -I/mesos/src -I/mesos/3rdparty/libprocess/src/../include -I/mesos/3rdparty/stout/include -isystem /usr/include/apr-1.0 -isystem /mesos/build/3rdparty/boost-1.53.0/src/boost-1.53.0 -isystem /mesos/build/3rdparty/elfio-3.2/src/elfio-3.2 -isystem /mesos/build/3rdparty/glog-0.3.3/src/glog-0.3.3-build/include -isystem /mesos/build/3rdparty/picojson-1.3.0/src/picojson-1.3.0 -isystem /mesos/build/3rdparty/protobuf-3.3.0/src/protobuf-3.3.0/src -isystem /usr/include/subversion-1 -isystem /mesos/build/3rdparty/http_parser-2.6.2/src/http_parser-2.6.2 -isystem /mesos/build/3rdparty/zookeeper-3.4.8/src/zookeeper-3.4.8/src/c/include -isystem /mesos/build/3rdparty/zookeeper-3.4.8/src/zookeeper-3.4.8/src/c/generated -isystem /mesos/build/3rdparty/nvml-352.79/src/nvml-352.79 -isystem /mesos/build/3rdparty/leveldb-1.19/src/leveldb-1.19/include -isystem /mesos/build/3rdparty/googletest-1.8.0/src/googletest-1.8.0/googlemock/include -isystem /mesos/build/3rdparty/googletest-1.8.0/src/googletest-1.8.0/googletest/include  -std=c++11 -Wformat-security -fstack-protector-strong -fPIE   -o CMakeFiles/mesos-tests.dir/partition_tests.cpp.o -c /mesos/src/tests/partition_tests.cpp
[ 87%] Building CXX object src/tests/CMakeFiles/mesos-tests.dir/paths_tests.cpp.o
cd /mesos/build/src/tests && /usr/bin/clang++-3.5  -DBUILD_DIR=\"/mesos/build\" -DBUILD_FLAGS=\"\" -DBUILD_JAVA_JVM_LIBRARY=\"\" -DHAS_AUTHENTICATION=1 -DHAVE_LIBZ -DLIBDIR=\"/usr/local/libmesos\" -DPICOJSON_USE_INT64 -DPKGDATADIR=\"/usr/local/share/mesos\" -DPKGLIBEXECDIR=\"/usr/local/libexec/mesos\" -DPKGMODULEDIR=\"\" -DSBINDIR=\"\" -DSOURCE_DIR=\"/mesos\" -DTESTLIBEXECDIR=\"\" -DUSE_CMAKE_BUILD_CONFIG -DUSE_SSL_SOCKET=1 -DUSE_STATIC_LIB -DVERSION=\"1.5.0\" -DZOOKEEPER_VERSION=\"3.4.8\" -D__STDC_FORMAT_MACROS -I/mesos/include -I/mesos/build/include -I/mesos/build/include/mesos -I/mesos/build/src -I/mesos/src -I/mesos/3rdparty/libprocess/src/../include -I/mesos/3rdparty/stout/include -isystem /usr/include/apr-1.0 -isystem /mesos/build/3rdparty/boost-1.53.0/src/boost-1.53.0 -isystem /mesos/build/3rdparty/elfio-3.2/src/elfio-3.2 -isystem /mesos/build/3rdparty/glog-0.3.3/src/glog-0.3.3-build/include -isystem /mesos/build/3rdparty/picojson-1.3.0/src/picojson-1.3.0 -isystem /mesos/build/3rdparty/protobuf-3.3.0/src/protobuf-3.3.0/src -isystem /usr/include/subversion-1 -isystem /mesos/build/3rdparty/http_parser-2.6.2/src/http_parser-2.6.2 -isystem /mesos/build/3rdparty/zookeeper-3.4.8/src/zookeeper-3.4.8/src/c/include -isystem /mesos/build/3rdparty/zookeeper-3.4.8/src/zookeeper-3.4.8/src/c/generated -isystem /mesos/build/3rdparty/nvml-352.79/src/nvml-352.79 -isystem /mesos/build/3rdparty/leveldb-1.19/src/leveldb-1.19/include -isystem /mesos/build/3rdparty/googletest-1.8.0/src/googletest-1.8.0/googlemock/include -isystem /mesos/build/3rdparty/googletest-1.8.0/src/googletest-1.8.0/googletest/include  -std=c++11 -Wformat-security -fstack-protector-strong -fPIE   -o CMakeFiles/mesos-tests.dir/paths_tests.cpp.o -c /mesos/src/tests/paths_tests.cpp
[ 87%] Building CXX object src/tests/CMakeFiles/mesos-tests.dir/protobuf_io_tests.cpp.o
cd /mesos/build/src/tests && /usr/bin/clang++-3.5  -DBUILD_DIR=\"/mesos/build\" -DBUILD_FLAGS=\"\" -DBUILD_JAVA_JVM_LIBRARY=\"\" -DHAS_AUTHENTICATION=1 -DHAVE_LIBZ -DLIBDIR=\"/usr/local/libmesos\" -DPICOJSON_USE_INT64 -DPKGDATADIR=\"/usr/local/share/mesos\" -DPKGLIBEXECDIR=\"/usr/local/libexec/mesos\" -DPKGMODULEDIR=\"\" -DSBINDIR=\"\" -DSOURCE_DIR=\"/mesos\" -DTESTLIBEXECDIR=\"\" -DUSE_CMAKE_BUILD_CONFIG -DUSE_SSL_SOCKET=1 -DUSE_STATIC_LIB -DVERSION=\"1.5.0\" -DZOOKEEPER_VERSION=\"3.4.8\" -D__STDC_FORMAT_MACROS -I/mesos/include -I/mesos/build/include -I/mesos/build/include/mesos -I/mesos/build/src -I/mesos/src -I/mesos/3rdparty/libprocess/src/../include -I/mesos/3rdparty/stout/include -isystem /usr/include/apr-1.0 -isystem /mesos/build/3rdparty/boost-1.53.0/src/boost-1.53.0 -isystem /mesos/build/3rdparty/elfio-3.2/src/elfio-3.2 -isystem /mesos/build/3rdparty/glog-0.3.3/src/glog-0.3.3-build/include -isystem /mesos/build/3rdparty/picojson-1.3.0/src/picojson-1.3.0 -isystem /mesos/build/3rdparty/protobuf-3.3.0/src/protobuf-3.3.0/src -isystem /usr/include/subversion-1 -isystem /mesos/build/3rdparty/http_parser-2.6.2/src/http_parser-2.6.2 -isystem /mesos/build/3rdparty/zookeeper-3.4.8/src/zookeeper-3.4.8/src/c/include -isystem /mesos/build/3rdparty/zookeeper-3.4.8/src/zookeeper-3.4.8/src/c/generated -isystem /mesos/build/3rdparty/nvml-352.79/src/nvml-352.79 -isystem /mesos/build/3rdparty/leveldb-1.19/src/leveldb-1.19/include -isystem /mesos/build/3rdparty/googletest-1.8.0/src/googletest-1.8.0/googlemock/include -isystem /mesos/build/3rdparty/googletest-1.8.0/src/googletest-1.8.0/googletest/include  -std=c++11 -Wformat-security -fstack-protector-strong -fPIE   -o CMakeFiles/mesos-tests.dir/protobuf_io_tests.cpp.o -c /mesos/src/tests/protobuf_io_tests.cpp
[ 87%] Building CXX object src/tests/CMakeFiles/mesos-tests.dir/rate_limiting_tests.cpp.o
cd /mesos/build/src/tests && /usr/bin/clang++-3.5  -DBUILD_DIR=\"/mesos/build\" -DBUILD_FLAGS=\"\" -DBUILD_JAVA_JVM_LIBRARY=\"\" -DHAS_AUTHENTICATION=1 -DHAVE_LIBZ -DLIBDIR=\"/usr/local/libmesos\" -DPICOJSON_USE_INT64 -DPKGDATADIR=\"/usr/local/share/mesos\" -DPKGLIBEXECDIR=\"/usr/local/libexec/mesos\" -DPKGMODULEDIR=\"\" -DSBINDIR=\"\" -DSOURCE_DIR=\"/mesos\" -DTESTLIBEXECDIR=\"\" -DUSE_CMAKE_BUILD_CONFIG -DUSE_SSL_SOCKET=1 -DUSE_STATIC_LIB -DVERSION=\"1.5.0\" -DZOOKEEPER_VERSION=\"3.4.8\" -D__STDC_FORMAT_MACROS -I/mesos/include -I/mesos/build/include -I/mesos/build/include/mesos -I/mesos/build/src -I/mesos/src -I/mesos/3rdparty/libprocess/src/../include -I/mesos/3rdparty/stout/include -isystem /usr/include/apr-1.0 -isystem /mesos/build/3rdparty/boost-1.53.0/src/boost-1.53.0 -isystem /mesos/build/3rdparty/elfio-3.2/src/elfio-3.2 -isystem /mesos/build/3rdparty/glog-0.3.3/src/glog-0.3.3-build/include -isystem /mesos/build/3rdparty/picojson-1.3.0/src/picojson-1.3.0 -isystem /mesos/build/3rdparty/protobuf-3.3.0/src/protobuf-3.3.0/src -isystem /usr/include/subversion-1 -isystem /mesos/build/3rdparty/http_parser-2.6.2/src/http_parser-2.6.2 -isystem /mesos/build/3rdparty/zookeeper-3.4.8/src/zookeeper-3.4.8/src/c/include -isystem /mesos/build/3rdparty/zookeeper-3.4.8/src/zookeeper-3.4.8/src/c/generated -isystem /mesos/build/3rdparty/nvml-352.79/src/nvml-352.79 -isystem /mesos/build/3rdparty/leveldb-1.19/src/leveldb-1.19/include -isystem /mesos/build/3rdparty/googletest-1.8.0/src/googletest-1.8.0/googlemock/include -isystem /mesos/build/3rdparty/googletest-1.8.0/src/googletest-1.8.0/googletest/include  -std=c++11 -Wformat-security -fstack-protector-strong -fPIE   -o CMakeFiles/mesos-tests.dir/rate_limiting_tests.cpp.o -c /mesos/src/tests/rate_limiting_tests.cpp
[ 88%] Building CXX object src/tests/CMakeFiles/mesos-tests.dir/resource_offers_tests.cpp.o
cd /mesos/build/src/tests && /usr/bin/clang++-3.5  -DBUILD_DIR=\"/mesos/build\" -DBUILD_FLAGS=\"\" -DBUILD_JAVA_JVM_LIBRARY=\"\" -DHAS_AUTHENTICATION=1 -DHAVE_LIBZ -DLIBDIR=\"/usr/local/libmesos\" -DPICOJSON_USE_INT64 -DPKGDATADIR=\"/usr/local/share/mesos\" -DPKGLIBEXECDIR=\"/usr/local/libexec/mesos\" -DPKGMODULEDIR=\"\" -DSBINDIR=\"\" -DSOURCE_DIR=\"/mesos\" -DTESTLIBEXECDIR=\"\" -DUSE_CMAKE_BUILD_CONFIG -DUSE_SSL_SOCKET=1 -DUSE_STATIC_LIB -DVERSION=\"1.5.0\" -DZOOKEEPER_VERSION=\"3.4.8\" -D__STDC_FORMAT_MACROS -I/mesos/include -I/mesos/build/include -I/mesos/build/include/mesos -I/mesos/build/src -I/mesos/src -I/mesos/3rdparty/libprocess/src/../include -I/mesos/3rdparty/stout/include -isystem /usr/include/apr-1.0 -isystem /mesos/build/3rdparty/boost-1.53.0/src/boost-1.53.0 -isystem /mesos/build/3rdparty/elfio-3.2/src/elfio-3.2 -isystem /mesos/build/3rdparty/glog-0.3.3/src/glog-0.3.3-build/include -isystem /mesos/build/3rdparty/picojson-1.3.0/src/picojson-1.3.0 -isystem /mesos/build/3rdparty/protobuf-3.3.0/src/protobuf-3.3.0/src -isystem /usr/include/subversion-1 -isystem /mesos/build/3rdparty/http_parser-2.6.2/src/http_parser-2.6.2 -isystem /mesos/build/3rdparty/zookeeper-3.4.8/src/zookeeper-3.4.8/src/c/include -isystem /mesos/build/3rdparty/zookeeper-3.4.8/src/zookeeper-3.4.8/src/c/generated -isystem /mesos/build/3rdparty/nvml-352.79/src/nvml-352.79 -isystem /mesos/build/3rdparty/leveldb-1.19/src/leveldb-1.19/include -isystem /mesos/build/3rdparty/googletest-1.8.0/src/googletest-1.8.0/googlemock/include -isystem /mesos/build/3rdparty/googletest-1.8.0/src/googletest-1.8.0/googletest/include  -std=c++11 -Wformat-security -fstack-protector-strong -fPIE   -o CMakeFiles/mesos-tests.dir/resource_offers_tests.cpp.o -c /mesos/src/tests/resource_offers_tests.cpp
[ 88%] Building CXX object src/tests/CMakeFiles/mesos-tests.dir/resource_provider_manager_tests.cpp.o
cd /mesos/build/src/tests && /usr/bin/clang++-3.5  -DBUILD_DIR=\"/mesos/build\" -DBUILD_FLAGS=\"\" -DBUILD_JAVA_JVM_LIBRARY=\"\" -DHAS_AUTHENTICATION=1 -DHAVE_LIBZ -DLIBDIR=\"/usr/local/libmesos\" -DPICOJSON_USE_INT64 -DPKGDATADIR=\"/usr/local/share/mesos\" -DPKGLIBEXECDIR=\"/usr/local/libexec/mesos\" -DPKGMODULEDIR=\"\" -DSBINDIR=\"\" -DSOURCE_DIR=\"/mesos\" -DTESTLIBEXECDIR=\"\" -DUSE_CMAKE_BUILD_CONFIG -DUSE_SSL_SOCKET=1 -DUSE_STATIC_LIB -DVERSION=\"1.5.0\" -DZOOKEEPER_VERSION=\"3.4.8\" -D__STDC_FORMAT_MACROS -I/mesos/include -I/mesos/build/include -I/mesos/build/include/mesos -I/mesos/build/src -I/mesos/src -I/mesos/3rdparty/libprocess/src/../include -I/mesos/3rdparty/stout/include -isystem /usr/include/apr-1.0 -isystem /mesos/build/3rdparty/boost-1.53.0/src/boost-1.53.0 -isystem /mesos/build/3rdparty/elfio-3.2/src/elfio-3.2 -isystem /mesos/build/3rdparty/glog-0.3.3/src/glog-0.3.3-build/include -isystem /mesos/build/3rdparty/picojson-1.3.0/src/picojson-1.3.0 -isystem /mesos/build/3rdparty/protobuf-3.3.0/src/protobuf-3.3.0/src -isystem /usr/include/subversion-1 -isystem /mesos/build/3rdparty/http_parser-2.6.2/src/http_parser-2.6.2 -isystem /mesos/build/3rdparty/zookeeper-3.4.8/src/zookeeper-3.4.8/src/c/include -isystem /mesos/build/3rdparty/zookeeper-3.4.8/src/zookeeper-3.4.8/src/c/generated -isystem /mesos/build/3rdparty/nvml-352.79/src/nvml-352.79 -isystem /mesos/build/3rdparty/leveldb-1.19/src/leveldb-1.19/include -isystem /mesos/build/3rdparty/googletest-1.8.0/src/googletest-1.8.0/googlemock/include -isystem /mesos/build/3rdparty/googletest-1.8.0/src/googletest-1.8.0/googletest/include  -std=c++11 -Wformat-security -fstack-protector-strong -fPIE   -o CMakeFiles/mesos-tests.dir/resource_provider_manager_tests.cpp.o -c /mesos/src/tests/resource_provider_manager_tests.cpp
[ 88%] Building CXX object src/tests/CMakeFiles/mesos-tests.dir/resource_provider_validation_tests.cpp.o
cd /mesos/build/src/tests && /usr/bin/clang++-3.5  -DBUILD_DIR=\"/mesos/build\" -DBUILD_FLAGS=\"\" -DBUILD_JAVA_JVM_LIBRARY=\"\" -DHAS_AUTHENTICATION=1 -DHAVE_LIBZ -DLIBDIR=\"/usr/local/libmesos\" -DPICOJSON_USE_INT64 -DPKGDATADIR=\"/usr/local/share/mesos\" -DPKGLIBEXECDIR=\"/usr/local/libexec/mesos\" -DPKGMODULEDIR=\"\" -DSBINDIR=\"\" -DSOURCE_DIR=\"/mesos\" -DTESTLIBEXECDIR=\"\" -DUSE_CMAKE_BUILD_CONFIG -DUSE_SSL_SOCKET=1 -DUSE_STATIC_LIB -DVERSION=\"1.5.0\" -DZOOKEEPER_VERSION=\"3.4.8\" -D__STDC_FORMAT_MACROS -I/mesos/include -I/mesos/build/include -I/mesos/build/include/mesos -I/mesos/build/src -I/mesos/src -I/mesos/3rdparty/libprocess/src/../include -I/mesos/3rdparty/stout/include -isystem /usr/include/apr-1.0 -isystem /mesos/build/3rdparty/boost-1.53.0/src/boost-1.53.0 -isystem /mesos/build/3rdparty/elfio-3.2/src/elfio-3.2 -isystem /mesos/build/3rdparty/glog-0.3.3/src/glog-0.3.3-build/include -isystem /mesos/build/3rdparty/picojson-1.3.0/src/picojson-1.3.0 -isystem /mesos/build/3rdparty/protobuf-3.3.0/src/protobuf-3.3.0/src -isystem /usr/include/subversion-1 -isystem /mesos/build/3rdparty/http_parser-2.6.2/src/http_parser-2.6.2 -isystem /mesos/build/3rdparty/zookeeper-3.4.8/src/zookeeper-3.4.8/src/c/include -isystem /mesos/build/3rdparty/zookeeper-3.4.8/src/zookeeper-3.4.8/src/c/generated -isystem /mesos/build/3rdparty/nvml-352.79/src/nvml-352.79 -isystem /mesos/build/3rdparty/leveldb-1.19/src/leveldb-1.19/include -isystem /mesos/build/3rdparty/googletest-1.8.0/src/googletest-1.8.0/googlemock/include -isystem /mesos/build/3rdparty/googletest-1.8.0/src/googletest-1.8.0/googletest/include  -std=c++11 -Wformat-security -fstack-protector-strong -fPIE   -o CMakeFiles/mesos-tests.dir/resource_provider_validation_tests.cpp.o -c /mesos/src/tests/resource_provider_validation_tests.cpp
[ 88%] Building CXX object src/tests/CMakeFiles/mesos-tests.dir/resources_tests.cpp.o
cd /mesos/build/src/tests && /usr/bin/clang++-3.5  -DBUILD_DIR=\"/mesos/build\" -DBUILD_FLAGS=\"\" -DBUILD_JAVA_JVM_LIBRARY=\"\" -DHAS_AUTHENTICATION=1 -DHAVE_LIBZ -DLIBDIR=\"/usr/local/libmesos\" -DPICOJSON_USE_INT64 -DPKGDATADIR=\"/usr/local/share/mesos\" -DPKGLIBEXECDIR=\"/usr/local/libexec/mesos\" -DPKGMODULEDIR=\"\" -DSBINDIR=\"\" -DSOURCE_DIR=\"/mesos\" -DTESTLIBEXECDIR=\"\" -DUSE_CMAKE_BUILD_CONFIG -DUSE_SSL_SOCKET=1 -DUSE_STATIC_LIB -DVERSION=\"1.5.0\" -DZOOKEEPER_VERSION=\"3.4.8\" -D__STDC_FORMAT_MACROS -I/mesos/include -I/mesos/build/include -I/mesos/build/include/mesos -I/mesos/build/src -I/mesos/src -I/mesos/3rdparty/libprocess/src/../include -I/mesos/3rdparty/stout/include -isystem /usr/include/apr-1.0 -isystem /mesos/build/3rdparty/boost-1.53.0/src/boost-1.53.0 -isystem /mesos/build/3rdparty/elfio-3.2/src/elfio-3.2 -isystem /mesos/build/3rdparty/glog-0.3.3/src/glog-0.3.3-build/include -isystem /mesos/build/3rdparty/picojson-1.3.0/src/picojson-1.3.0 -isystem /mesos/build/3rdparty/protobuf-3.3.0/src/protobuf-3.3.0/src -isystem /usr/include/subversion-1 -isystem /mesos/build/3rdparty/http_parser-2.6.2/src/http_parser-2.6.2 -isystem /mesos/build/3rdparty/zookeeper-3.4.8/src/zookeeper-3.4.8/src/c/include -isystem /mesos/build/3rdparty/zookeeper-3.4.8/src/zookeeper-3.4.8/src/c/generated -isystem /mesos/build/3rdparty/nvml-352.79/src/nvml-352.79 -isystem /mesos/build/3rdparty/leveldb-1.19/src/leveldb-1.19/include -isystem /mesos/build/3rdparty/googletest-1.8.0/src/googletest-1.8.0/googlemock/include -isystem /mesos/build/3rdparty/googletest-1.8.0/src/googletest-1.8.0/googletest/include  -std=c++11 -Wformat-security -fstack-protector-strong -fPIE   -o CMakeFiles/mesos-tests.dir/resources_tests.cpp.o -c /mesos/src/tests/resources_tests.cpp
[ 88%] Building CXX object src/tests/CMakeFiles/mesos-tests.dir/role_tests.cpp.o
cd /mesos/build/src/tests && /usr/bin/clang++-3.5  -DBUILD_DIR=\"/mesos/build\" -DBUILD_FLAGS=\"\" -DBUILD_JAVA_JVM_LIBRARY=\"\" -DHAS_AUTHENTICATION=1 -DHAVE_LIBZ -DLIBDIR=\"/usr/local/libmesos\" -DPICOJSON_USE_INT64 -DPKGDATADIR=\"/usr/local/share/mesos\" -DPKGLIBEXECDIR=\"/usr/local/libexec/mesos\" -DPKGMODULEDIR=\"\" -DSBINDIR=\"\" -DSOURCE_DIR=\"/mesos\" -DTESTLIBEXECDIR=\"\" -DUSE_CMAKE_BUILD_CONFIG -DUSE_SSL_SOCKET=1 -DUSE_STATIC_LIB -DVERSION=\"1.5.0\" -DZOOKEEPER_VERSION=\"3.4.8\" -D__STDC_FORMAT_MACROS -I/mesos/include -I/mesos/build/include -I/mesos/build/include/mesos -I/mesos/build/src -I/mesos/src -I/mesos/3rdparty/libprocess/src/../include -I/mesos/3rdparty/stout/include -isystem /usr/include/apr-1.0 -isystem /mesos/build/3rdparty/boost-1.53.0/src/boost-1.53.0 -isystem /mesos/build/3rdparty/elfio-3.2/src/elfio-3.2 -isystem /mesos/build/3rdparty/glog-0.3.3/src/glog-0.3.3-build/include -isystem /mesos/build/3rdparty/picojson-1.3.0/src/picojson-1.3.0 -isystem /mesos/build/3rdparty/protobuf-3.3.0/src/protobuf-3.3.0/src -isystem /usr/include/subversion-1 -isystem /mesos/build/3rdparty/http_parser-2.6.2/src/http_parser-2.6.2 -isystem /mesos/build/3rdparty/zookeeper-3.4.8/src/zookeeper-3.4.8/src/c/include -isystem /mesos/build/3rdparty/zookeeper-3.4.8/src/zookeeper-3.4.8/src/c/generated -isystem /mesos/build/3rdparty/nvml-352.79/src/nvml-352.79 -isystem /mesos/build/3rdparty/leveldb-1.19/src/leveldb-1.19/include -isystem /mesos/build/3rdparty/googletest-1.8.0/src/googletest-1.8.0/googlemock/include -isystem /mesos/build/3rdparty/googletest-1.8.0/src/googletest-1.8.0/googletest/include  -std=c++11 -Wformat-security -fstack-protector-strong -fPIE   -o CMakeFiles/mesos-tests.dir/role_tests.cpp.o -c /mesos/src/tests/role_tests.cpp
[ 88%] Building CXX object src/tests/CMakeFiles/mesos-tests.dir/scheduler_driver_tests.cpp.o
cd /mesos/build/src/tests && /usr/bin/clang++-3.5  -DBUILD_DIR=\"/mesos/build\" -DBUILD_FLAGS=\"\" -DBUILD_JAVA_JVM_LIBRARY=\"\" -DHAS_AUTHENTICATION=1 -DHAVE_LIBZ -DLIBDIR=\"/usr/local/libmesos\" -DPICOJSON_USE_INT64 -DPKGDATADIR=\"/usr/local/share/mesos\" -DPKGLIBEXECDIR=\"/usr/local/libexec/mesos\" -DPKGMODULEDIR=\"\" -DSBINDIR=\"\" -DSOURCE_DIR=\"/mesos\" -DTESTLIBEXECDIR=\"\" -DUSE_CMAKE_BUILD_CONFIG -DUSE_SSL_SOCKET=1 -DUSE_STATIC_LIB -DVERSION=\"1.5.0\" -DZOOKEEPER_VERSION=\"3.4.8\" -D__STDC_FORMAT_MACROS -I/mesos/include -I/mesos/build/include -I/mesos/build/include/mesos -I/mesos/build/src -I/mesos/src -I/mesos/3rdparty/libprocess/src/../include -I/mesos/3rdparty/stout/include -isystem /usr/include/apr-1.0 -isystem /mesos/build/3rdparty/boost-1.53.0/src/boost-1.53.0 -isystem /mesos/build/3rdparty/elfio-3.2/src/elfio-3.2 -isystem /mesos/build/3rdparty/glog-0.3.3/src/glog-0.3.3-build/include -isystem /mesos/build/3rdparty/picojson-1.3.0/src/picojson-1.3.0 -isystem /mesos/build/3rdparty/protobuf-3.3.0/src/protobuf-3.3.0/src -isystem /usr/include/subversion-1 -isystem /mesos/build/3rdparty/http_parser-2.6.2/src/http_parser-2.6.2 -isystem /mesos/build/3rdparty/zookeeper-3.4.8/src/zookeeper-3.4.8/src/c/include -isystem /mesos/build/3rdparty/zookeeper-3.4.8/src/zookeeper-3.4.8/src/c/generated -isystem /mesos/build/3rdparty/nvml-352.79/src/nvml-352.79 -isystem /mesos/build/3rdparty/leveldb-1.19/src/leveldb-1.19/include -isystem /mesos/build/3rdparty/googletest-1.8.0/src/googletest-1.8.0/googlemock/include -isystem /mesos/build/3rdparty/googletest-1.8.0/src/googletest-1.8.0/googletest/include  -std=c++11 -Wformat-security -fstack-protector-strong -fPIE   -o CMakeFiles/mesos-tests.dir/scheduler_driver_tests.cpp.o -c /mesos/src/tests/scheduler_driver_tests.cpp
[ 88%] Building CXX object src/tests/CMakeFiles/mesos-tests.dir/scheduler_event_call_tests.cpp.o
cd /mesos/build/src/tests && /usr/bin/clang++-3.5  -DBUILD_DIR=\"/mesos/build\" -DBUILD_FLAGS=\"\" -DBUILD_JAVA_JVM_LIBRARY=\"\" -DHAS_AUTHENTICATION=1 -DHAVE_LIBZ -DLIBDIR=\"/usr/local/libmesos\" -DPICOJSON_USE_INT64 -DPKGDATADIR=\"/usr/local/share/mesos\" -DPKGLIBEXECDIR=\"/usr/local/libexec/mesos\" -DPKGMODULEDIR=\"\" -DSBINDIR=\"\" -DSOURCE_DIR=\"/mesos\" -DTESTLIBEXECDIR=\"\" -DUSE_CMAKE_BUILD_CONFIG -DUSE_SSL_SOCKET=1 -DUSE_STATIC_LIB -DVERSION=\"1.5.0\" -DZOOKEEPER_VERSION=\"3.4.8\" -D__STDC_FORMAT_MACROS -I/mesos/include -I/mesos/build/include -I/mesos/build/include/mesos -I/mesos/build/src -I/mesos/src -I/mesos/3rdparty/libprocess/src/../include -I/mesos/3rdparty/stout/include -isystem /usr/include/apr-1.0 -isystem /mesos/build/3rdparty/boost-1.53.0/src/boost-1.53.0 -isystem /mesos/build/3rdparty/elfio-3.2/src/elfio-3.2 -isystem /mesos/build/3rdparty/glog-0.3.3/src/glog-0.3.3-build/include -isystem /mesos/build/3rdparty/picojson-1.3.0/src/picojson-1.3.0 -isystem /mesos/build/3rdparty/protobuf-3.3.0/src/protobuf-3.3.0/src -isystem /usr/include/subversion-1 -isystem /mesos/build/3rdparty/http_parser-2.6.2/src/http_parser-2.6.2 -isystem /mesos/build/3rdparty/zookeeper-3.4.8/src/zookeeper-3.4.8/src/c/include -isystem /mesos/build/3rdparty/zookeeper-3.4.8/src/zookeeper-3.4.8/src/c/generated -isystem /mesos/build/3rdparty/nvml-352.79/src/nvml-352.79 -isystem /mesos/build/3rdparty/leveldb-1.19/src/leveldb-1.19/include -isystem /mesos/build/3rdparty/googletest-1.8.0/src/googletest-1.8.0/googlemock/include -isystem /mesos/build/3rdparty/googletest-1.8.0/src/googletest-1.8.0/googletest/include  -std=c++11 -Wformat-security -fstack-protector-strong -fPIE   -o CMakeFiles/mesos-tests.dir/scheduler_event_call_tests.cpp.o -c /mesos/src/tests/scheduler_event_call_tests.cpp
[ 88%] Building CXX object src/tests/CMakeFiles/mesos-tests.dir/scheduler_http_api_tests.cpp.o
cd /mesos/build/src/tests && /usr/bin/clang++-3.5  -DBUILD_DIR=\"/mesos/build\" -DBUILD_FLAGS=\"\" -DBUILD_JAVA_JVM_LIBRARY=\"\" -DHAS_AUTHENTICATION=1 -DHAVE_LIBZ -DLIBDIR=\"/usr/local/libmesos\" -DPICOJSON_USE_INT64 -DPKGDATADIR=\"/usr/local/share/mesos\" -DPKGLIBEXECDIR=\"/usr/local/libexec/mesos\" -DPKGMODULEDIR=\"\" -DSBINDIR=\"\" -DSOURCE_DIR=\"/mesos\" -DTESTLIBEXECDIR=\"\" -DUSE_CMAKE_BUILD_CONFIG -DUSE_SSL_SOCKET=1 -DUSE_STATIC_LIB -DVERSION=\"1.5.0\" -DZOOKEEPER_VERSION=\"3.4.8\" -D__STDC_FORMAT_MACROS -I/mesos/include -I/mesos/build/include -I/mesos/build/include/mesos -I/mesos/build/src -I/mesos/src -I/mesos/3rdparty/libprocess/src/../include -I/mesos/3rdparty/stout/include -isystem /usr/include/apr-1.0 -isystem /mesos/build/3rdparty/boost-1.53.0/src/boost-1.53.0 -isystem /mesos/build/3rdparty/elfio-3.2/src/elfio-3.2 -isystem /mesos/build/3rdparty/glog-0.3.3/src/glog-0.3.3-build/include -isystem /mesos/build/3rdparty/picojson-1.3.0/src/picojson-1.3.0 -isystem /mesos/build/3rdparty/protobuf-3.3.0/src/protobuf-3.3.0/src -isystem /usr/include/subversion-1 -isystem /mesos/build/3rdparty/http_parser-2.6.2/src/http_parser-2.6.2 -isystem /mesos/build/3rdparty/zookeeper-3.4.8/src/zookeeper-3.4.8/src/c/include -isystem /mesos/build/3rdparty/zookeeper-3.4.8/src/zookeeper-3.4.8/src/c/generated -isystem /mesos/build/3rdparty/nvml-352.79/src/nvml-352.79 -isystem /mesos/build/3rdparty/leveldb-1.19/src/leveldb-1.19/include -isystem /mesos/build/3rdparty/googletest-1.8.0/src/googletest-1.8.0/googlemock/include -isystem /mesos/build/3rdparty/googletest-1.8.0/src/googletest-1.8.0/googletest/include  -std=c++11 -Wformat-security -fstack-protector-strong -fPIE   -o CMakeFiles/mesos-tests.dir/scheduler_http_api_tests.cpp.o -c /mesos/src/tests/scheduler_http_api_tests.cpp
[ 89%] Building CXX object src/tests/CMakeFiles/mesos-tests.dir/scheduler_tests.cpp.o
cd /mesos/build/src/tests && /usr/bin/clang++-3.5  -DBUILD_DIR=\"/mesos/build\" -DBUILD_FLAGS=\"\" -DBUILD_JAVA_JVM_LIBRARY=\"\" -DHAS_AUTHENTICATION=1 -DHAVE_LIBZ -DLIBDIR=\"/usr/local/libmesos\" -DPICOJSON_USE_INT64 -DPKGDATADIR=\"/usr/local/share/mesos\" -DPKGLIBEXECDIR=\"/usr/local/libexec/mesos\" -DPKGMODULEDIR=\"\" -DSBINDIR=\"\" -DSOURCE_DIR=\"/mesos\" -DTESTLIBEXECDIR=\"\" -DUSE_CMAKE_BUILD_CONFIG -DUSE_SSL_SOCKET=1 -DUSE_STATIC_LIB -DVERSION=\"1.5.0\" -DZOOKEEPER_VERSION=\"3.4.8\" -D__STDC_FORMAT_MACROS -I/mesos/include -I/mesos/build/include -I/mesos/build/include/mesos -I/mesos/build/src -I/mesos/src -I/mesos/3rdparty/libprocess/src/../include -I/mesos/3rdparty/stout/include -isystem /usr/include/apr-1.0 -isystem /mesos/build/3rdparty/boost-1.53.0/src/boost-1.53.0 -isystem /mesos/build/3rdparty/elfio-3.2/src/elfio-3.2 -isystem /mesos/build/3rdparty/glog-0.3.3/src/glog-0.3.3-build/include -isystem /mesos/build/3rdparty/picojson-1.3.0/src/picojson-1.3.0 -isystem /mesos/build/3rdparty/protobuf-3.3.0/src/protobuf-3.3.0/src -isystem /usr/include/subversion-1 -isystem /mesos/build/3rdparty/http_parser-2.6.2/src/http_parser-2.6.2 -isystem /mesos/build/3rdparty/zookeeper-3.4.8/src/zookeeper-3.4.8/src/c/include -isystem /mesos/build/3rdparty/zookeeper-3.4.8/src/zookeeper-3.4.8/src/c/generated -isystem /mesos/build/3rdparty/nvml-352.79/src/nvml-352.79 -isystem /mesos/build/3rdparty/leveldb-1.19/src/leveldb-1.19/include -isystem /mesos/build/3rdparty/googletest-1.8.0/src/googletest-1.8.0/googlemock/include -isystem /mesos/build/3rdparty/googletest-1.8.0/src/googletest-1.8.0/googletest/include  -std=c++11 -Wformat-security -fstack-protector-strong -fPIE   -o CMakeFiles/mesos-tests.dir/scheduler_tests.cpp.o -c /mesos/src/tests/scheduler_tests.cpp
[ 89%] Building CXX object src/tests/CMakeFiles/mesos-tests.dir/slave_tests.cpp.o
cd /mesos/build/src/tests && /usr/bin/clang++-3.5  -DBUILD_DIR=\"/mesos/build\" -DBUILD_FLAGS=\"\" -DBUILD_JAVA_JVM_LIBRARY=\"\" -DHAS_AUTHENTICATION=1 -DHAVE_LIBZ -DLIBDIR=\"/usr/local/libmesos\" -DPICOJSON_USE_INT64 -DPKGDATADIR=\"/usr/local/share/mesos\" -DPKGLIBEXECDIR=\"/usr/local/libexec/mesos\" -DPKGMODULEDIR=\"\" -DSBINDIR=\"\" -DSOURCE_DIR=\"/mesos\" -DTESTLIBEXECDIR=\"\" -DUSE_CMAKE_BUILD_CONFIG -DUSE_SSL_SOCKET=1 -DUSE_STATIC_LIB -DVERSION=\"1.5.0\" -DZOOKEEPER_VERSION=\"3.4.8\" -D__STDC_FORMAT_MACROS -I/mesos/include -I/mesos/build/include -I/mesos/build/include/mesos -I/mesos/build/src -I/mesos/src -I/mesos/3rdparty/libprocess/src/../include -I/mesos/3rdparty/stout/include -isystem /usr/include/apr-1.0 -isystem /mesos/build/3rdparty/boost-1.53.0/src/boost-1.53.0 -isystem /mesos/build/3rdparty/elfio-3.2/src/elfio-3.2 -isystem /mesos/build/3rdparty/glog-0.3.3/src/glog-0.3.3-build/include -isystem /mesos/build/3rdparty/picojson-1.3.0/src/picojson-1.3.0 -isystem /mesos/build/3rdparty/protobuf-3.3.0/src/protobuf-3.3.0/src -isystem /usr/include/subversion-1 -isystem /mesos/build/3rdparty/http_parser-2.6.2/src/http_parser-2.6.2 -isystem /mesos/build/3rdparty/zookeeper-3.4.8/src/zookeeper-3.4.8/src/c/include -isystem /mesos/build/3rdparty/zookeeper-3.4.8/src/zookeeper-3.4.8/src/c/generated -isystem /mesos/build/3rdparty/nvml-352.79/src/nvml-352.79 -isystem /mesos/build/3rdparty/leveldb-1.19/src/leveldb-1.19/include -isystem /mesos/build/3rdparty/googletest-1.8.0/src/googletest-1.8.0/googlemock/include -isystem /mesos/build/3rdparty/googletest-1.8.0/src/googletest-1.8.0/googletest/include  -std=c++11 -Wformat-security -fstack-protector-strong -fPIE   -o CMakeFiles/mesos-tests.dir/slave_tests.cpp.o -c /mesos/src/tests/slave_tests.cpp
[ 89%] Building CXX object src/tests/CMakeFiles/mesos-tests.dir/slave_validation_tests.cpp.o
cd /mesos/build/src/tests && /usr/bin/clang++-3.5  -DBUILD_DIR=\"/mesos/build\" -DBUILD_FLAGS=\"\" -DBUILD_JAVA_JVM_LIBRARY=\"\" -DHAS_AUTHENTICATION=1 -DHAVE_LIBZ -DLIBDIR=\"/usr/local/libmesos\" -DPICOJSON_USE_INT64 -DPKGDATADIR=\"/usr/local/share/mesos\" -DPKGLIBEXECDIR=\"/usr/local/libexec/mesos\" -DPKGMODULEDIR=\"\" -DSBINDIR=\"\" -DSOURCE_DIR=\"/mesos\" -DTESTLIBEXECDIR=\"\" -DUSE_CMAKE_BUILD_CONFIG -DUSE_SSL_SOCKET=1 -DUSE_STATIC_LIB -DVERSION=\"1.5.0\" -DZOOKEEPER_VERSION=\"3.4.8\" -D__STDC_FORMAT_MACROS -I/mesos/include -I/mesos/build/include -I/mesos/build/include/mesos -I/mesos/build/src -I/mesos/src -I/mesos/3rdparty/libprocess/src/../include -I/mesos/3rdparty/stout/include -isystem /usr/include/apr-1.0 -isystem /mesos/build/3rdparty/boost-1.53.0/src/boost-1.53.0 -isystem /mesos/build/3rdparty/elfio-3.2/src/elfio-3.2 -isystem /mesos/build/3rdparty/glog-0.3.3/src/glog-0.3.3-build/include -isystem /mesos/build/3rdparty/picojson-1.3.0/src/picojson-1.3.0 -isystem /mesos/build/3rdparty/protobuf-3.3.0/src/protobuf-3.3.0/src -isystem /usr/include/subversion-1 -isystem /mesos/build/3rdparty/http_parser-2.6.2/src/http_parser-2.6.2 -isystem /mesos/build/3rdparty/zookeeper-3.4.8/src/zookeeper-3.4.8/src/c/include -isystem /mesos/build/3rdparty/zookeeper-3.4.8/src/zookeeper-3.4.8/src/c/generated -isystem /mesos/build/3rdparty/nvml-352.79/src/nvml-352.79 -isystem /mesos/build/3rdparty/leveldb-1.19/src/leveldb-1.19/include -isystem /mesos/build/3rdparty/googletest-1.8.0/src/googletest-1.8.0/googlemock/include -isystem /mesos/build/3rdparty/googletest-1.8.0/src/googletest-1.8.0/googletest/include  -std=c++11 -Wformat-security -fstack-protector-strong -fPIE   -o CMakeFiles/mesos-tests.dir/slave_validation_tests.cpp.o -c /mesos/src/tests/slave_validation_tests.cpp
[ 89%] Building CXX object src/tests/CMakeFiles/mesos-tests.dir/sorter_tests.cpp.o
cd /mesos/build/src/tests && /usr/bin/clang++-3.5  -DBUILD_DIR=\"/mesos/build\" -DBUILD_FLAGS=\"\" -DBUILD_JAVA_JVM_LIBRARY=\"\" -DHAS_AUTHENTICATION=1 -DHAVE_LIBZ -DLIBDIR=\"/usr/local/libmesos\" -DPICOJSON_USE_INT64 -DPKGDATADIR=\"/usr/local/share/mesos\" -DPKGLIBEXECDIR=\"/usr/local/libexec/mesos\" -DPKGMODULEDIR=\"\" -DSBINDIR=\"\" -DSOURCE_DIR=\"/mesos\" -DTESTLIBEXECDIR=\"\" -DUSE_CMAKE_BUILD_CONFIG -DUSE_SSL_SOCKET=1 -DUSE_STATIC_LIB -DVERSION=\"1.5.0\" -DZOOKEEPER_VERSION=\"3.4.8\" -D__STDC_FORMAT_MACROS -I/mesos/include -I/mesos/build/include -I/mesos/build/include/mesos -I/mesos/build/src -I/mesos/src -I/mesos/3rdparty/libprocess/src/../include -I/mesos/3rdparty/stout/include -isystem /usr/include/apr-1.0 -isystem /mesos/build/3rdparty/boost-1.53.0/src/boost-1.53.0 -isystem /mesos/build/3rdparty/elfio-3.2/src/elfio-3.2 -isystem /mesos/build/3rdparty/glog-0.3.3/src/glog-0.3.3-build/include -isystem /mesos/build/3rdparty/picojson-1.3.0/src/picojson-1.3.0 -isystem /mesos/build/3rdparty/protobuf-3.3.0/src/protobuf-3.3.0/src -isystem /usr/include/subversion-1 -isystem /mesos/build/3rdparty/http_parser-2.6.2/src/http_parser-2.6.2 -isystem /mesos/build/3rdparty/zookeeper-3.4.8/src/zookeeper-3.4.8/src/c/include -isystem /mesos/build/3rdparty/zookeeper-3.4.8/src/zookeeper-3.4.8/src/c/generated -isystem /mesos/build/3rdparty/nvml-352.79/src/nvml-352.79 -isystem /mesos/build/3rdparty/leveldb-1.19/src/leveldb-1.19/include -isystem /mesos/build/3rdparty/googletest-1.8.0/src/googletest-1.8.0/googlemock/include -isystem /mesos/build/3rdparty/googletest-1.8.0/src/googletest-1.8.0/googletest/include  -std=c++11 -Wformat-security -fstack-protector-strong -fPIE   -o CMakeFiles/mesos-tests.dir/sorter_tests.cpp.o -c /mesos/src/tests/sorter_tests.cpp
[ 89%] Building CXX object src/tests/CMakeFiles/mesos-tests.dir/status_update_manager_tests.cpp.o
cd /mesos/build/src/tests && /usr/bin/clang++-3.5  -DBUILD_DIR=\"/mesos/build\" -DBUILD_FLAGS=\"\" -DBUILD_JAVA_JVM_LIBRARY=\"\" -DHAS_AUTHENTICATION=1 -DHAVE_LIBZ -DLIBDIR=\"/usr/local/libmesos\" -DPICOJSON_USE_INT64 -DPKGDATADIR=\"/usr/local/share/mesos\" -DPKGLIBEXECDIR=\"/usr/local/libexec/mesos\" -DPKGMODULEDIR=\"\" -DSBINDIR=\"\" -DSOURCE_DIR=\"/mesos\" -DTESTLIBEXECDIR=\"\" -DUSE_CMAKE_BUILD_CONFIG -DUSE_SSL_SOCKET=1 -DUSE_STATIC_LIB -DVERSION=\"1.5.0\" -DZOOKEEPER_VERSION=\"3.4.8\" -D__STDC_FORMAT_MACROS -I/mesos/include -I/mesos/build/include -I/mesos/build/include/mesos -I/mesos/build/src -I/mesos/src -I/mesos/3rdparty/libprocess/src/../include -I/mesos/3rdparty/stout/include -isystem /usr/include/apr-1.0 -isystem /mesos/build/3rdparty/boost-1.53.0/src/boost-1.53.0 -isystem /mesos/build/3rdparty/elfio-3.2/src/elfio-3.2 -isystem /mesos/build/3rdparty/glog-0.3.3/src/glog-0.3.3-build/include -isystem /mesos/build/3rdparty/picojson-1.3.0/src/picojson-1.3.0 -isystem /mesos/build/3rdparty/protobuf-3.3.0/src/protobuf-3.3.0/src -isystem /usr/include/subversion-1 -isystem /mesos/build/3rdparty/http_parser-2.6.2/src/http_parser-2.6.2 -isystem /mesos/build/3rdparty/zookeeper-3.4.8/src/zookeeper-3.4.8/src/c/include -isystem /mesos/build/3rdparty/zookeeper-3.4.8/src/zookeeper-3.4.8/src/c/generated -isystem /mesos/build/3rdparty/nvml-352.79/src/nvml-352.79 -isystem /mesos/build/3rdparty/leveldb-1.19/src/leveldb-1.19/include -isystem /mesos/build/3rdparty/googletest-1.8.0/src/googletest-1.8.0/googlemock/include -isystem /mesos/build/3rdparty/googletest-1.8.0/src/googletest-1.8.0/googletest/include  -std=c++11 -Wformat-security -fstack-protector-strong -fPIE   -o CMakeFiles/mesos-tests.dir/status_update_manager_tests.cpp.o -c /mesos/src/tests/status_update_manager_tests.cpp
[ 89%] Building CXX object src/tests/CMakeFiles/mesos-tests.dir/uri_tests.cpp.o
cd /mesos/build/src/tests && /usr/bin/clang++-3.5  -DBUILD_DIR=\"/mesos/build\" -DBUILD_FLAGS=\"\" -DBUILD_JAVA_JVM_LIBRARY=\"\" -DHAS_AUTHENTICATION=1 -DHAVE_LIBZ -DLIBDIR=\"/usr/local/libmesos\" -DPICOJSON_USE_INT64 -DPKGDATADIR=\"/usr/local/share/mesos\" -DPKGLIBEXECDIR=\"/usr/local/libexec/mesos\" -DPKGMODULEDIR=\"\" -DSBINDIR=\"\" -DSOURCE_DIR=\"/mesos\" -DTESTLIBEXECDIR=\"\" -DUSE_CMAKE_BUILD_CONFIG -DUSE_SSL_SOCKET=1 -DUSE_STATIC_LIB -DVERSION=\"1.5.0\" -DZOOKEEPER_VERSION=\"3.4.8\" -D__STDC_FORMAT_MACROS -I/mesos/include -I/mesos/build/include -I/mesos/build/include/mesos -I/mesos/build/src -I/mesos/src -I/mesos/3rdparty/libprocess/src/../include -I/mesos/3rdparty/stout/include -isystem /usr/include/apr-1.0 -isystem /mesos/build/3rdparty/boost-1.53.0/src/boost-1.53.0 -isystem /mesos/build/3rdparty/elfio-3.2/src/elfio-3.2 -isystem /mesos/build/3rdparty/glog-0.3.3/src/glog-0.3.3-build/include -isystem /mesos/build/3rdparty/picojson-1.3.0/src/picojson-1.3.0 -isystem /mesos/build/3rdparty/protobuf-3.3.0/src/protobuf-3.3.0/src -isystem /usr/include/subversion-1 -isystem /mesos/build/3rdparty/http_parser-2.6.2/src/http_parser-2.6.2 -isystem /mesos/build/3rdparty/zookeeper-3.4.8/src/zookeeper-3.4.8/src/c/include -isystem /mesos/build/3rdparty/zookeeper-3.4.8/src/zookeeper-3.4.8/src/c/generated -isystem /mesos/build/3rdparty/nvml-352.79/src/nvml-352.79 -isystem /mesos/build/3rdparty/leveldb-1.19/src/leveldb-1.19/include -isystem /mesos/build/3rdparty/googletest-1.8.0/src/googletest-1.8.0/googlemock/include -isystem /mesos/build/3rdparty/googletest-1.8.0/src/googletest-1.8.0/googletest/include  -std=c++11 -Wformat-security -fstack-protector-strong -fPIE   -o CMakeFiles/mesos-tests.dir/uri_tests.cpp.o -c /mesos/src/tests/uri_tests.cpp
[ 89%] Building CXX object src/tests/CMakeFiles/mesos-tests.dir/uri_fetcher_tests.cpp.o
cd /mesos/build/src/tests && /usr/bin/clang++-3.5  -DBUILD_DIR=\"/mesos/build\" -DBUILD_FLAGS=\"\" -DBUILD_JAVA_JVM_LIBRARY=\"\" -DHAS_AUTHENTICATION=1 -DHAVE_LIBZ -DLIBDIR=\"/usr/local/libmesos\" -DPICOJSON_USE_INT64 -DPKGDATADIR=\"/usr/local/share/mesos\" -DPKGLIBEXECDIR=\"/usr/local/libexec/mesos\" -DPKGMODULEDIR=\"\" -DSBINDIR=\"\" -DSOURCE_DIR=\"/mesos\" -DTESTLIBEXECDIR=\"\" -DUSE_CMAKE_BUILD_CONFIG -DUSE_SSL_SOCKET=1 -DUSE_STATIC_LIB -DVERSION=\"1.5.0\" -DZOOKEEPER_VERSION=\"3.4.8\" -D__STDC_FORMAT_MACROS -I/mesos/include -I/mesos/build/include -I/mesos/build/include/mesos -I/mesos/build/src -I/mesos/src -I/mesos/3rdparty/libprocess/src/../include -I/mesos/3rdparty/stout/include -isystem /usr/include/apr-1.0 -isystem /mesos/build/3rdparty/boost-1.53.0/src/boost-1.53.0 -isystem /mesos/build/3rdparty/elfio-3.2/src/elfio-3.2 -isystem /mesos/build/3rdparty/glog-0.3.3/src/glog-0.3.3-build/include -isystem /mesos/build/3rdparty/picojson-1.3.0/src/picojson-1.3.0 -isystem /mesos/build/3rdparty/protobuf-3.3.0/src/protobuf-3.3.0/src -isystem /usr/include/subversion-1 -isystem /mesos/build/3rdparty/http_parser-2.6.2/src/http_parser-2.6.2 -isystem /mesos/build/3rdparty/zookeeper-3.4.8/src/zookeeper-3.4.8/src/c/include -isystem /mesos/build/3rdparty/zookeeper-3.4.8/src/zookeeper-3.4.8/src/c/generated -isystem /mesos/build/3rdparty/nvml-352.79/src/nvml-352.79 -isystem /mesos/build/3rdparty/leveldb-1.19/src/leveldb-1.19/include -isystem /mesos/build/3rdparty/googletest-1.8.0/src/googletest-1.8.0/googlemock/include -isystem /mesos/build/3rdparty/googletest-1.8.0/src/googletest-1.8.0/googletest/include  -std=c++11 -Wformat-security -fstack-protector-strong -fPIE   -o CMakeFiles/mesos-tests.dir/uri_fetcher_tests.cpp.o -c /mesos/src/tests/uri_fetcher_tests.cpp
[ 90%] Building CXX object src/tests/CMakeFiles/mesos-tests.dir/values_tests.cpp.o
cd /mesos/build/src/tests && /usr/bin/clang++-3.5  -DBUILD_DIR=\"/mesos/build\" -DBUILD_FLAGS=\"\" -DBUILD_JAVA_JVM_LIBRARY=\"\" -DHAS_AUTHENTICATION=1 -DHAVE_LIBZ -DLIBDIR=\"/usr/local/libmesos\" -DPICOJSON_USE_INT64 -DPKGDATADIR=\"/usr/local/share/mesos\" -DPKGLIBEXECDIR=\"/usr/local/libexec/mesos\" -DPKGMODULEDIR=\"\" -DSBINDIR=\"\" -DSOURCE_DIR=\"/mesos\" -DTESTLIBEXECDIR=\"\" -DUSE_CMAKE_BUILD_CONFIG -DUSE_SSL_SOCKET=1 -DUSE_STATIC_LIB -DVERSION=\"1.5.0\" -DZOOKEEPER_VERSION=\"3.4.8\" -D__STDC_FORMAT_MACROS -I/mesos/include -I/mesos/build/include -I/mesos/build/include/mesos -I/mesos/build/src -I/mesos/src -I/mesos/3rdparty/libprocess/src/../include -I/mesos/3rdparty/stout/include -isystem /usr/include/apr-1.0 -isystem /mesos/build/3rdparty/boost-1.53.0/src/boost-1.53.0 -isystem /mesos/build/3rdparty/elfio-3.2/src/elfio-3.2 -isystem /mesos/build/3rdparty/glog-0.3.3/src/glog-0.3.3-build/include -isystem /mesos/build/3rdparty/picojson-1.3.0/src/picojson-1.3.0 -isystem /mesos/build/3rdparty/protobuf-3.3.0/src/protobuf-3.3.0/src -isystem /usr/include/subversion-1 -isystem /mesos/build/3rdparty/http_parser-2.6.2/src/http_parser-2.6.2 -isystem /mesos/build/3rdparty/zookeeper-3.4.8/src/zookeeper-3.4.8/src/c/include -isystem /mesos/build/3rdparty/zookeeper-3.4.8/src/zookeeper-3.4.8/src/c/generated -isystem /mesos/build/3rdparty/nvml-352.79/src/nvml-352.79 -isystem /mesos/build/3rdparty/leveldb-1.19/src/leveldb-1.19/include -isystem /mesos/build/3rdparty/googletest-1.8.0/src/googletest-1.8.0/googlemock/include -isystem /mesos/build/3rdparty/googletest-1.8.0/src/googletest-1.8.0/googletest/include  -std=c++11 -Wformat-security -fstack-protector-strong -fPIE   -o CMakeFiles/mesos-tests.dir/values_tests.cpp.o -c /mesos/src/tests/values_tests.cpp
[ 90%] Building CXX object src/tests/CMakeFiles/mesos-tests.dir/zookeeper_url_tests.cpp.o
cd /mesos/build/src/tests && /usr/bin/clang++-3.5  -DBUILD_DIR=\"/mesos/build\" -DBUILD_FLAGS=\"\" -DBUILD_JAVA_JVM_LIBRARY=\"\" -DHAS_AUTHENTICATION=1 -DHAVE_LIBZ -DLIBDIR=\"/usr/local/libmesos\" -DPICOJSON_USE_INT64 -DPKGDATADIR=\"/usr/local/share/mesos\" -DPKGLIBEXECDIR=\"/usr/local/libexec/mesos\" -DPKGMODULEDIR=\"\" -DSBINDIR=\"\" -DSOURCE_DIR=\"/mesos\" -DTESTLIBEXECDIR=\"\" -DUSE_CMAKE_BUILD_CONFIG -DUSE_SSL_SOCKET=1 -DUSE_STATIC_LIB -DVERSION=\"1.5.0\" -DZOOKEEPER_VERSION=\"3.4.8\" -D__STDC_FORMAT_MACROS -I/mesos/include -I/mesos/build/include -I/mesos/build/include/mesos -I/mesos/build/src -I/mesos/src -I/mesos/3rdparty/libprocess/src/../include -I/mesos/3rdparty/stout/include -isystem /usr/include/apr-1.0 -isystem /mesos/build/3rdparty/boost-1.53.0/src/boost-1.53.0 -isystem /mesos/build/3rdparty/elfio-3.2/src/elfio-3.2 -isystem /mesos/build/3rdparty/glog-0.3.3/src/glog-0.3.3-build/include -isystem /mesos/build/3rdparty/picojson-1.3.0/src/picojson-1.3.0 -isystem /mesos/build/3rdparty/protobuf-3.3.0/src/protobuf-3.3.0/src -isystem /usr/include/subversion-1 -isystem /mesos/build/3rdparty/http_parser-2.6.2/src/http_parser-2.6.2 -isystem /mesos/build/3rdparty/zookeeper-3.4.8/src/zookeeper-3.4.8/src/c/include -isystem /mesos/build/3rdparty/zookeeper-3.4.8/src/zookeeper-3.4.8/src/c/generated -isystem /mesos/build/3rdparty/nvml-352.79/src/nvml-352.79 -isystem /mesos/build/3rdparty/leveldb-1.19/src/leveldb-1.19/include -isystem /mesos/build/3rdparty/googletest-1.8.0/src/googletest-1.8.0/googlemock/include -isystem /mesos/build/3rdparty/googletest-1.8.0/src/googletest-1.8.0/googletest/include  -std=c++11 -Wformat-security -fstack-protector-strong -fPIE   -o CMakeFiles/mesos-tests.dir/zookeeper_url_tests.cpp.o -c /mesos/src/tests/zookeeper_url_tests.cpp
[ 90%] Building CXX object src/tests/CMakeFiles/mesos-tests.dir/secret_generator_tests.cpp.o
cd /mesos/build/src/tests && /usr/bin/clang++-3.5  -DBUILD_DIR=\"/mesos/build\" -DBUILD_FLAGS=\"\" -DBUILD_JAVA_JVM_LIBRARY=\"\" -DHAS_AUTHENTICATION=1 -DHAVE_LIBZ -DLIBDIR=\"/usr/local/libmesos\" -DPICOJSON_USE_INT64 -DPKGDATADIR=\"/usr/local/share/mesos\" -DPKGLIBEXECDIR=\"/usr/local/libexec/mesos\" -DPKGMODULEDIR=\"\" -DSBINDIR=\"\" -DSOURCE_DIR=\"/mesos\" -DTESTLIBEXECDIR=\"\" -DUSE_CMAKE_BUILD_CONFIG -DUSE_SSL_SOCKET=1 -DUSE_STATIC_LIB -DVERSION=\"1.5.0\" -DZOOKEEPER_VERSION=\"3.4.8\" -D__STDC_FORMAT_MACROS -I/mesos/include -I/mesos/build/include -I/mesos/build/include/mesos -I/mesos/build/src -I/mesos/src -I/mesos/3rdparty/libprocess/src/../include -I/mesos/3rdparty/stout/include -isystem /usr/include/apr-1.0 -isystem /mesos/build/3rdparty/boost-1.53.0/src/boost-1.53.0 -isystem /mesos/build/3rdparty/elfio-3.2/src/elfio-3.2 -isystem /mesos/build/3rdparty/glog-0.3.3/src/glog-0.3.3-build/include -isystem /mesos/build/3rdparty/picojson-1.3.0/src/picojson-1.3.0 -isystem /mesos/build/3rdparty/protobuf-3.3.0/src/protobuf-3.3.0/src -isystem /usr/include/subversion-1 -isystem /mesos/build/3rdparty/http_parser-2.6.2/src/http_parser-2.6.2 -isystem /mesos/build/3rdparty/zookeeper-3.4.8/src/zookeeper-3.4.8/src/c/include -isystem /mesos/build/3rdparty/zookeeper-3.4.8/src/zookeeper-3.4.8/src/c/generated -isystem /mesos/build/3rdparty/nvml-352.79/src/nvml-352.79 -isystem /mesos/build/3rdparty/leveldb-1.19/src/leveldb-1.19/include -isystem /mesos/build/3rdparty/googletest-1.8.0/src/googletest-1.8.0/googlemock/include -isystem /mesos/build/3rdparty/googletest-1.8.0/src/googletest-1.8.0/googletest/include  -std=c++11 -Wformat-security -fstack-protector-strong -fPIE   -o CMakeFiles/mesos-tests.dir/secret_generator_tests.cpp.o -c /mesos/src/tests/secret_generator_tests.cpp
[ 90%] Building CXX object src/tests/CMakeFiles/mesos-tests.dir/common/http_tests.cpp.o
cd /mesos/build/src/tests && /usr/bin/clang++-3.5  -DBUILD_DIR=\"/mesos/build\" -DBUILD_FLAGS=\"\" -DBUILD_JAVA_JVM_LIBRARY=\"\" -DHAS_AUTHENTICATION=1 -DHAVE_LIBZ -DLIBDIR=\"/usr/local/libmesos\" -DPICOJSON_USE_INT64 -DPKGDATADIR=\"/usr/local/share/mesos\" -DPKGLIBEXECDIR=\"/usr/local/libexec/mesos\" -DPKGMODULEDIR=\"\" -DSBINDIR=\"\" -DSOURCE_DIR=\"/mesos\" -DTESTLIBEXECDIR=\"\" -DUSE_CMAKE_BUILD_CONFIG -DUSE_SSL_SOCKET=1 -DUSE_STATIC_LIB -DVERSION=\"1.5.0\" -DZOOKEEPER_VERSION=\"3.4.8\" -D__STDC_FORMAT_MACROS -I/mesos/include -I/mesos/build/include -I/mesos/build/include/mesos -I/mesos/build/src -I/mesos/src -I/mesos/3rdparty/libprocess/src/../include -I/mesos/3rdparty/stout/include -isystem /usr/include/apr-1.0 -isystem /mesos/build/3rdparty/boost-1.53.0/src/boost-1.53.0 -isystem /mesos/build/3rdparty/elfio-3.2/src/elfio-3.2 -isystem /mesos/build/3rdparty/glog-0.3.3/src/glog-0.3.3-build/include -isystem /mesos/build/3rdparty/picojson-1.3.0/src/picojson-1.3.0 -isystem /mesos/build/3rdparty/protobuf-3.3.0/src/protobuf-3.3.0/src -isystem /usr/include/subversion-1 -isystem /mesos/build/3rdparty/http_parser-2.6.2/src/http_parser-2.6.2 -isystem /mesos/build/3rdparty/zookeeper-3.4.8/src/zookeeper-3.4.8/src/c/include -isystem /mesos/build/3rdparty/zookeeper-3.4.8/src/zookeeper-3.4.8/src/c/generated -isystem /mesos/build/3rdparty/nvml-352.79/src/nvml-352.79 -isystem /mesos/build/3rdparty/leveldb-1.19/src/leveldb-1.19/include -isystem /mesos/build/3rdparty/googletest-1.8.0/src/googletest-1.8.0/googlemock/include -isystem /mesos/build/3rdparty/googletest-1.8.0/src/googletest-1.8.0/googletest/include  -std=c++11 -Wformat-security -fstack-protector-strong -fPIE   -o CMakeFiles/mesos-tests.dir/common/http_tests.cpp.o -c /mesos/src/tests/common/http_tests.cpp
[ 90%] Building CXX object src/tests/CMakeFiles/mesos-tests.dir/common/recordio_tests.cpp.o
cd /mesos/build/src/tests && /usr/bin/clang++-3.5  -DBUILD_DIR=\"/mesos/build\" -DBUILD_FLAGS=\"\" -DBUILD_JAVA_JVM_LIBRARY=\"\" -DHAS_AUTHENTICATION=1 -DHAVE_LIBZ -DLIBDIR=\"/usr/local/libmesos\" -DPICOJSON_USE_INT64 -DPKGDATADIR=\"/usr/local/share/mesos\" -DPKGLIBEXECDIR=\"/usr/local/libexec/mesos\" -DPKGMODULEDIR=\"\" -DSBINDIR=\"\" -DSOURCE_DIR=\"/mesos\" -DTESTLIBEXECDIR=\"\" -DUSE_CMAKE_BUILD_CONFIG -DUSE_SSL_SOCKET=1 -DUSE_STATIC_LIB -DVERSION=\"1.5.0\" -DZOOKEEPER_VERSION=\"3.4.8\" -D__STDC_FORMAT_MACROS -I/mesos/include -I/mesos/build/include -I/mesos/build/include/mesos -I/mesos/build/src -I/mesos/src -I/mesos/3rdparty/libprocess/src/../include -I/mesos/3rdparty/stout/include -isystem /usr/include/apr-1.0 -isystem /mesos/build/3rdparty/boost-1.53.0/src/boost-1.53.0 -isystem /mesos/build/3rdparty/elfio-3.2/src/elfio-3.2 -isystem /mesos/build/3rdparty/glog-0.3.3/src/glog-0.3.3-build/include -isystem /mesos/build/3rdparty/picojson-1.3.0/src/picojson-1.3.0 -isystem /mesos/build/3rdparty/protobuf-3.3.0/src/protobuf-3.3.0/src -isystem /usr/include/subversion-1 -isystem /mesos/build/3rdparty/http_parser-2.6.2/src/http_parser-2.6.2 -isystem /mesos/build/3rdparty/zookeeper-3.4.8/src/zookeeper-3.4.8/src/c/include -isystem /mesos/build/3rdparty/zookeeper-3.4.8/src/zookeeper-3.4.8/src/c/generated -isystem /mesos/build/3rdparty/nvml-352.79/src/nvml-352.79 -isystem /mesos/build/3rdparty/leveldb-1.19/src/leveldb-1.19/include -isystem /mesos/build/3rdparty/googletest-1.8.0/src/googletest-1.8.0/googlemock/include -isystem /mesos/build/3rdparty/googletest-1.8.0/src/googletest-1.8.0/googletest/include  -std=c++11 -Wformat-security -fstack-protector-strong -fPIE   -o CMakeFiles/mesos-tests.dir/common/recordio_tests.cpp.o -c /mesos/src/tests/common/recordio_tests.cpp
[ 90%] Building CXX object src/tests/CMakeFiles/mesos-tests.dir/common/type_utils_tests.cpp.o
cd /mesos/build/src/tests && /usr/bin/clang++-3.5  -DBUILD_DIR=\"/mesos/build\" -DBUILD_FLAGS=\"\" -DBUILD_JAVA_JVM_LIBRARY=\"\" -DHAS_AUTHENTICATION=1 -DHAVE_LIBZ -DLIBDIR=\"/usr/local/libmesos\" -DPICOJSON_USE_INT64 -DPKGDATADIR=\"/usr/local/share/mesos\" -DPKGLIBEXECDIR=\"/usr/local/libexec/mesos\" -DPKGMODULEDIR=\"\" -DSBINDIR=\"\" -DSOURCE_DIR=\"/mesos\" -DTESTLIBEXECDIR=\"\" -DUSE_CMAKE_BUILD_CONFIG -DUSE_SSL_SOCKET=1 -DUSE_STATIC_LIB -DVERSION=\"1.5.0\" -DZOOKEEPER_VERSION=\"3.4.8\" -D__STDC_FORMAT_MACROS -I/mesos/include -I/mesos/build/include -I/mesos/build/include/mesos -I/mesos/build/src -I/mesos/src -I/mesos/3rdparty/libprocess/src/../include -I/mesos/3rdparty/stout/include -isystem /usr/include/apr-1.0 -isystem /mesos/build/3rdparty/boost-1.53.0/src/boost-1.53.0 -isystem /mesos/build/3rdparty/elfio-3.2/src/elfio-3.2 -isystem /mesos/build/3rdparty/glog-0.3.3/src/glog-0.3.3-build/include -isystem /mesos/build/3rdparty/picojson-1.3.0/src/picojson-1.3.0 -isystem /mesos/build/3rdparty/protobuf-3.3.0/src/protobuf-3.3.0/src -isystem /usr/include/subversion-1 -isystem /mesos/build/3rdparty/http_parser-2.6.2/src/http_parser-2.6.2 -isystem /mesos/build/3rdparty/zookeeper-3.4.8/src/zookeeper-3.4.8/src/c/include -isystem /mesos/build/3rdparty/zookeeper-3.4.8/src/zookeeper-3.4.8/src/c/generated -isystem /mesos/build/3rdparty/nvml-352.79/src/nvml-352.79 -isystem /mesos/build/3rdparty/leveldb-1.19/src/leveldb-1.19/include -isystem /mesos/build/3rdparty/googletest-1.8.0/src/googletest-1.8.0/googlemock/include -isystem /mesos/build/3rdparty/googletest-1.8.0/src/googletest-1.8.0/googletest/include  -std=c++11 -Wformat-security -fstack-protector-strong -fPIE   -o CMakeFiles/mesos-tests.dir/common/type_utils_tests.cpp.o -c /mesos/src/tests/common/type_utils_tests.cpp
[ 90%] Building CXX object src/tests/CMakeFiles/mesos-tests.dir/containerizer/containerizer_tests.cpp.o
cd /mesos/build/src/tests && /usr/bin/clang++-3.5  -DBUILD_DIR=\"/mesos/build\" -DBUILD_FLAGS=\"\" -DBUILD_JAVA_JVM_LIBRARY=\"\" -DHAS_AUTHENTICATION=1 -DHAVE_LIBZ -DLIBDIR=\"/usr/local/libmesos\" -DPICOJSON_USE_INT64 -DPKGDATADIR=\"/usr/local/share/mesos\" -DPKGLIBEXECDIR=\"/usr/local/libexec/mesos\" -DPKGMODULEDIR=\"\" -DSBINDIR=\"\" -DSOURCE_DIR=\"/mesos\" -DTESTLIBEXECDIR=\"\" -DUSE_CMAKE_BUILD_CONFIG -DUSE_SSL_SOCKET=1 -DUSE_STATIC_LIB -DVERSION=\"1.5.0\" -DZOOKEEPER_VERSION=\"3.4.8\" -D__STDC_FORMAT_MACROS -I/mesos/include -I/mesos/build/include -I/mesos/build/include/mesos -I/mesos/build/src -I/mesos/src -I/mesos/3rdparty/libprocess/src/../include -I/mesos/3rdparty/stout/include -isystem /usr/include/apr-1.0 -isystem /mesos/build/3rdparty/boost-1.53.0/src/boost-1.53.0 -isystem /mesos/build/3rdparty/elfio-3.2/src/elfio-3.2 -isystem /mesos/build/3rdparty/glog-0.3.3/src/glog-0.3.3-build/include -isystem /mesos/build/3rdparty/picojson-1.3.0/src/picojson-1.3.0 -isystem /mesos/build/3rdparty/protobuf-3.3.0/src/protobuf-3.3.0/src -isystem /usr/include/subversion-1 -isystem /mesos/build/3rdparty/http_parser-2.6.2/src/http_parser-2.6.2 -isystem /mesos/build/3rdparty/zookeeper-3.4.8/src/zookeeper-3.4.8/src/c/include -isystem /mesos/build/3rdparty/zookeeper-3.4.8/src/zookeeper-3.4.8/src/c/generated -isystem /mesos/build/3rdparty/nvml-352.79/src/nvml-352.79 -isystem /mesos/build/3rdparty/leveldb-1.19/src/leveldb-1.19/include -isystem /mesos/build/3rdparty/googletest-1.8.0/src/googletest-1.8.0/googlemock/include -isystem /mesos/build/3rdparty/googletest-1.8.0/src/googletest-1.8.0/googletest/include  -std=c++11 -Wformat-security -fstack-protector-strong -fPIE   -o CMakeFiles/mesos-tests.dir/containerizer/containerizer_tests.cpp.o -c /mesos/src/tests/containerizer/containerizer_tests.cpp
[ 91%] Building CXX object src/tests/CMakeFiles/mesos-tests.dir/containerizer/docker_tests.cpp.o
cd /mesos/build/src/tests && /usr/bin/clang++-3.5  -DBUILD_DIR=\"/mesos/build\" -DBUILD_FLAGS=\"\" -DBUILD_JAVA_JVM_LIBRARY=\"\" -DHAS_AUTHENTICATION=1 -DHAVE_LIBZ -DLIBDIR=\"/usr/local/libmesos\" -DPICOJSON_USE_INT64 -DPKGDATADIR=\"/usr/local/share/mesos\" -DPKGLIBEXECDIR=\"/usr/local/libexec/mesos\" -DPKGMODULEDIR=\"\" -DSBINDIR=\"\" -DSOURCE_DIR=\"/mesos\" -DTESTLIBEXECDIR=\"\" -DUSE_CMAKE_BUILD_CONFIG -DUSE_SSL_SOCKET=1 -DUSE_STATIC_LIB -DVERSION=\"1.5.0\" -DZOOKEEPER_VERSION=\"3.4.8\" -D__STDC_FORMAT_MACROS -I/mesos/include -I/mesos/build/include -I/mesos/build/include/mesos -I/mesos/build/src -I/mesos/src -I/mesos/3rdparty/libprocess/src/../include -I/mesos/3rdparty/stout/include -isystem /usr/include/apr-1.0 -isystem /mesos/build/3rdparty/boost-1.53.0/src/boost-1.53.0 -isystem /mesos/build/3rdparty/elfio-3.2/src/elfio-3.2 -isystem /mesos/build/3rdparty/glog-0.3.3/src/glog-0.3.3-build/include -isystem /mesos/build/3rdparty/picojson-1.3.0/src/picojson-1.3.0 -isystem /mesos/build/3rdparty/protobuf-3.3.0/src/protobuf-3.3.0/src -isystem /usr/include/subversion-1 -isystem /mesos/build/3rdparty/http_parser-2.6.2/src/http_parser-2.6.2 -isystem /mesos/build/3rdparty/zookeeper-3.4.8/src/zookeeper-3.4.8/src/c/include -isystem /mesos/build/3rdparty/zookeeper-3.4.8/src/zookeeper-3.4.8/src/c/generated -isystem /mesos/build/3rdparty/nvml-352.79/src/nvml-352.79 -isystem /mesos/build/3rdparty/leveldb-1.19/src/leveldb-1.19/include -isystem /mesos/build/3rdparty/googletest-1.8.0/src/googletest-1.8.0/googlemock/include -isystem /mesos/build/3rdparty/googletest-1.8.0/src/googletest-1.8.0/googletest/include  -std=c++11 -Wformat-security -fstack-protector-strong -fPIE   -o CMakeFiles/mesos-tests.dir/containerizer/docker_tests.cpp.o -c /mesos/src/tests/containerizer/docker_tests.cpp
[ 91%] Building CXX object src/tests/CMakeFiles/mesos-tests.dir/authorization_tests.cpp.o
cd /mesos/build/src/tests && /usr/bin/clang++-3.5  -DBUILD_DIR=\"/mesos/build\" -DBUILD_FLAGS=\"\" -DBUILD_JAVA_JVM_LIBRARY=\"\" -DHAS_AUTHENTICATION=1 -DHAVE_LIBZ -DLIBDIR=\"/usr/local/libmesos\" -DPICOJSON_USE_INT64 -DPKGDATADIR=\"/usr/local/share/mesos\" -DPKGLIBEXECDIR=\"/usr/local/libexec/mesos\" -DPKGMODULEDIR=\"\" -DSBINDIR=\"\" -DSOURCE_DIR=\"/mesos\" -DTESTLIBEXECDIR=\"\" -DUSE_CMAKE_BUILD_CONFIG -DUSE_SSL_SOCKET=1 -DUSE_STATIC_LIB -DVERSION=\"1.5.0\" -DZOOKEEPER_VERSION=\"3.4.8\" -D__STDC_FORMAT_MACROS -I/mesos/include -I/mesos/build/include -I/mesos/build/include/mesos -I/mesos/build/src -I/mesos/src -I/mesos/3rdparty/libprocess/src/../include -I/mesos/3rdparty/stout/include -isystem /usr/include/apr-1.0 -isystem /mesos/build/3rdparty/boost-1.53.0/src/boost-1.53.0 -isystem /mesos/build/3rdparty/elfio-3.2/src/elfio-3.2 -isystem /mesos/build/3rdparty/glog-0.3.3/src/glog-0.3.3-build/include -isystem /mesos/build/3rdparty/picojson-1.3.0/src/picojson-1.3.0 -isystem /mesos/build/3rdparty/protobuf-3.3.0/src/protobuf-3.3.0/src -isystem /usr/include/subversion-1 -isystem /mesos/build/3rdparty/http_parser-2.6.2/src/http_parser-2.6.2 -isystem /mesos/build/3rdparty/zookeeper-3.4.8/src/zookeeper-3.4.8/src/c/include -isystem /mesos/build/3rdparty/zookeeper-3.4.8/src/zookeeper-3.4.8/src/c/generated -isystem /mesos/build/3rdparty/nvml-352.79/src/nvml-352.79 -isystem /mesos/build/3rdparty/leveldb-1.19/src/leveldb-1.19/include -isystem /mesos/build/3rdparty/googletest-1.8.0/src/googletest-1.8.0/googlemock/include -isystem /mesos/build/3rdparty/googletest-1.8.0/src/googletest-1.8.0/googletest/include  -std=c++11 -Wformat-security -fstack-protector-strong -fPIE   -o CMakeFiles/mesos-tests.dir/authorization_tests.cpp.o -c /mesos/src/tests/authorization_tests.cpp
[ 91%] Building CXX object src/tests/CMakeFiles/mesos-tests.dir/container_logger_tests.cpp.o
cd /mesos/build/src/tests && /usr/bin/clang++-3.5  -DBUILD_DIR=\"/mesos/build\" -DBUILD_FLAGS=\"\" -DBUILD_JAVA_JVM_LIBRARY=\"\" -DHAS_AUTHENTICATION=1 -DHAVE_LIBZ -DLIBDIR=\"/usr/local/libmesos\" -DPICOJSON_USE_INT64 -DPKGDATADIR=\"/usr/local/share/mesos\" -DPKGLIBEXECDIR=\"/usr/local/libexec/mesos\" -DPKGMODULEDIR=\"\" -DSBINDIR=\"\" -DSOURCE_DIR=\"/mesos\" -DTESTLIBEXECDIR=\"\" -DUSE_CMAKE_BUILD_CONFIG -DUSE_SSL_SOCKET=1 -DUSE_STATIC_LIB -DVERSION=\"1.5.0\" -DZOOKEEPER_VERSION=\"3.4.8\" -D__STDC_FORMAT_MACROS -I/mesos/include -I/mesos/build/include -I/mesos/build/include/mesos -I/mesos/build/src -I/mesos/src -I/mesos/3rdparty/libprocess/src/../include -I/mesos/3rdparty/stout/include -isystem /usr/include/apr-1.0 -isystem /mesos/build/3rdparty/boost-1.53.0/src/boost-1.53.0 -isystem /mesos/build/3rdparty/elfio-3.2/src/elfio-3.2 -isystem /mesos/build/3rdparty/glog-0.3.3/src/glog-0.3.3-build/include -isystem /mesos/build/3rdparty/picojson-1.3.0/src/picojson-1.3.0 -isystem /mesos/build/3rdparty/protobuf-3.3.0/src/protobuf-3.3.0/src -isystem /usr/include/subversion-1 -isystem /mesos/build/3rdparty/http_parser-2.6.2/src/http_parser-2.6.2 -isystem /mesos/build/3rdparty/zookeeper-3.4.8/src/zookeeper-3.4.8/src/c/include -isystem /mesos/build/3rdparty/zookeeper-3.4.8/src/zookeeper-3.4.8/src/c/generated -isystem /mesos/build/3rdparty/nvml-352.79/src/nvml-352.79 -isystem /mesos/build/3rdparty/leveldb-1.19/src/leveldb-1.19/include -isystem /mesos/build/3rdparty/googletest-1.8.0/src/googletest-1.8.0/googlemock/include -isystem /mesos/build/3rdparty/googletest-1.8.0/src/googletest-1.8.0/googletest/include  -std=c++11 -Wformat-security -fstack-protector-strong -fPIE   -o CMakeFiles/mesos-tests.dir/container_logger_tests.cpp.o -c /mesos/src/tests/container_logger_tests.cpp
[ 91%] Building CXX object src/tests/CMakeFiles/mesos-tests.dir/cram_md5_authentication_tests.cpp.o
cd /mesos/build/src/tests && /usr/bin/clang++-3.5  -DBUILD_DIR=\"/mesos/build\" -DBUILD_FLAGS=\"\" -DBUILD_JAVA_JVM_LIBRARY=\"\" -DHAS_AUTHENTICATION=1 -DHAVE_LIBZ -DLIBDIR=\"/usr/local/libmesos\" -DPICOJSON_USE_INT64 -DPKGDATADIR=\"/usr/local/share/mesos\" -DPKGLIBEXECDIR=\"/usr/local/libexec/mesos\" -DPKGMODULEDIR=\"\" -DSBINDIR=\"\" -DSOURCE_DIR=\"/mesos\" -DTESTLIBEXECDIR=\"\" -DUSE_CMAKE_BUILD_CONFIG -DUSE_SSL_SOCKET=1 -DUSE_STATIC_LIB -DVERSION=\"1.5.0\" -DZOOKEEPER_VERSION=\"3.4.8\" -D__STDC_FORMAT_MACROS -I/mesos/include -I/mesos/build/include -I/mesos/build/include/mesos -I/mesos/build/src -I/mesos/src -I/mesos/3rdparty/libprocess/src/../include -I/mesos/3rdparty/stout/include -isystem /usr/include/apr-1.0 -isystem /mesos/build/3rdparty/boost-1.53.0/src/boost-1.53.0 -isystem /mesos/build/3rdparty/elfio-3.2/src/elfio-3.2 -isystem /mesos/build/3rdparty/glog-0.3.3/src/glog-0.3.3-build/include -isystem /mesos/build/3rdparty/picojson-1.3.0/src/picojson-1.3.0 -isystem /mesos/build/3rdparty/protobuf-3.3.0/src/protobuf-3.3.0/src -isystem /usr/include/subversion-1 -isystem /mesos/build/3rdparty/http_parser-2.6.2/src/http_parser-2.6.2 -isystem /mesos/build/3rdparty/zookeeper-3.4.8/src/zookeeper-3.4.8/src/c/include -isystem /mesos/build/3rdparty/zookeeper-3.4.8/src/zookeeper-3.4.8/src/c/generated -isystem /mesos/build/3rdparty/nvml-352.79/src/nvml-352.79 -isystem /mesos/build/3rdparty/leveldb-1.19/src/leveldb-1.19/include -isystem /mesos/build/3rdparty/googletest-1.8.0/src/googletest-1.8.0/googlemock/include -isystem /mesos/build/3rdparty/googletest-1.8.0/src/googletest-1.8.0/googletest/include  -std=c++11 -Wformat-security -fstack-protector-strong -fPIE   -o CMakeFiles/mesos-tests.dir/cram_md5_authentication_tests.cpp.o -c /mesos/src/tests/cram_md5_authentication_tests.cpp
[ 91%] Building CXX object src/tests/CMakeFiles/mesos-tests.dir/disk_quota_tests.cpp.o
cd /mesos/build/src/tests && /usr/bin/clang++-3.5  -DBUILD_DIR=\"/mesos/build\" -DBUILD_FLAGS=\"\" -DBUILD_JAVA_JVM_LIBRARY=\"\" -DHAS_AUTHENTICATION=1 -DHAVE_LIBZ -DLIBDIR=\"/usr/local/libmesos\" -DPICOJSON_USE_INT64 -DPKGDATADIR=\"/usr/local/share/mesos\" -DPKGLIBEXECDIR=\"/usr/local/libexec/mesos\" -DPKGMODULEDIR=\"\" -DSBINDIR=\"\" -DSOURCE_DIR=\"/mesos\" -DTESTLIBEXECDIR=\"\" -DUSE_CMAKE_BUILD_CONFIG -DUSE_SSL_SOCKET=1 -DUSE_STATIC_LIB -DVERSION=\"1.5.0\" -DZOOKEEPER_VERSION=\"3.4.8\" -D__STDC_FORMAT_MACROS -I/mesos/include -I/mesos/build/include -I/mesos/build/include/mesos -I/mesos/build/src -I/mesos/src -I/mesos/3rdparty/libprocess/src/../include -I/mesos/3rdparty/stout/include -isystem /usr/include/apr-1.0 -isystem /mesos/build/3rdparty/boost-1.53.0/src/boost-1.53.0 -isystem /mesos/build/3rdparty/elfio-3.2/src/elfio-3.2 -isystem /mesos/build/3rdparty/glog-0.3.3/src/glog-0.3.3-build/include -isystem /mesos/build/3rdparty/picojson-1.3.0/src/picojson-1.3.0 -isystem /mesos/build/3rdparty/protobuf-3.3.0/src/protobuf-3.3.0/src -isystem /usr/include/subversion-1 -isystem /mesos/build/3rdparty/http_parser-2.6.2/src/http_parser-2.6.2 -isystem /mesos/build/3rdparty/zookeeper-3.4.8/src/zookeeper-3.4.8/src/c/include -isystem /mesos/build/3rdparty/zookeeper-3.4.8/src/zookeeper-3.4.8/src/c/generated -isystem /mesos/build/3rdparty/nvml-352.79/src/nvml-352.79 -isystem /mesos/build/3rdparty/leveldb-1.19/src/leveldb-1.19/include -isystem /mesos/build/3rdparty/googletest-1.8.0/src/googletest-1.8.0/googlemock/include -isystem /mesos/build/3rdparty/googletest-1.8.0/src/googletest-1.8.0/googletest/include  -std=c++11 -Wformat-security -fstack-protector-strong -fPIE   -o CMakeFiles/mesos-tests.dir/disk_quota_tests.cpp.o -c /mesos/src/tests/disk_quota_tests.cpp
[ 91%] Building CXX object src/tests/CMakeFiles/mesos-tests.dir/dynamic_weights_tests.cpp.o
cd /mesos/build/src/tests && /usr/bin/clang++-3.5  -DBUILD_DIR=\"/mesos/build\" -DBUILD_FLAGS=\"\" -DBUILD_JAVA_JVM_LIBRARY=\"\" -DHAS_AUTHENTICATION=1 -DHAVE_LIBZ -DLIBDIR=\"/usr/local/libmesos\" -DPICOJSON_USE_INT64 -DPKGDATADIR=\"/usr/local/share/mesos\" -DPKGLIBEXECDIR=\"/usr/local/libexec/mesos\" -DPKGMODULEDIR=\"\" -DSBINDIR=\"\" -DSOURCE_DIR=\"/mesos\" -DTESTLIBEXECDIR=\"\" -DUSE_CMAKE_BUILD_CONFIG -DUSE_SSL_SOCKET=1 -DUSE_STATIC_LIB -DVERSION=\"1.5.0\" -DZOOKEEPER_VERSION=\"3.4.8\" -D__STDC_FORMAT_MACROS -I/mesos/include -I/mesos/build/include -I/mesos/build/include/mesos -I/mesos/build/src -I/mesos/src -I/mesos/3rdparty/libprocess/src/../include -I/mesos/3rdparty/stout/include -isystem /usr/include/apr-1.0 -isystem /mesos/build/3rdparty/boost-1.53.0/src/boost-1.53.0 -isystem /mesos/build/3rdparty/elfio-3.2/src/elfio-3.2 -isystem /mesos/build/3rdparty/glog-0.3.3/src/glog-0.3.3-build/include -isystem /mesos/build/3rdparty/picojson-1.3.0/src/picojson-1.3.0 -isystem /mesos/build/3rdparty/protobuf-3.3.0/src/protobuf-3.3.0/src -isystem /usr/include/subversion-1 -isystem /mesos/build/3rdparty/http_parser-2.6.2/src/http_parser-2.6.2 -isystem /mesos/build/3rdparty/zookeeper-3.4.8/src/zookeeper-3.4.8/src/c/include -isystem /mesos/build/3rdparty/zookeeper-3.4.8/src/zookeeper-3.4.8/src/c/generated -isystem /mesos/build/3rdparty/nvml-352.79/src/nvml-352.79 -isystem /mesos/build/3rdparty/leveldb-1.19/src/leveldb-1.19/include -isystem /mesos/build/3rdparty/googletest-1.8.0/src/googletest-1.8.0/googlemock/include -isystem /mesos/build/3rdparty/googletest-1.8.0/src/googletest-1.8.0/googletest/include  -std=c++11 -Wformat-security -fstack-protector-strong -fPIE   -o CMakeFiles/mesos-tests.dir/dynamic_weights_tests.cpp.o -c /mesos/src/tests/dynamic_weights_tests.cpp
[ 91%] Building CXX object src/tests/CMakeFiles/mesos-tests.dir/examples_tests.cpp.o
cd /mesos/build/src/tests && /usr/bin/clang++-3.5  -DBUILD_DIR=\"/mesos/build\" -DBUILD_FLAGS=\"\" -DBUILD_JAVA_JVM_LIBRARY=\"\" -DHAS_AUTHENTICATION=1 -DHAVE_LIBZ -DLIBDIR=\"/usr/local/libmesos\" -DPICOJSON_USE_INT64 -DPKGDATADIR=\"/usr/local/share/mesos\" -DPKGLIBEXECDIR=\"/usr/local/libexec/mesos\" -DPKGMODULEDIR=\"\" -DSBINDIR=\"\" -DSOURCE_DIR=\"/mesos\" -DTESTLIBEXECDIR=\"\" -DUSE_CMAKE_BUILD_CONFIG -DUSE_SSL_SOCKET=1 -DUSE_STATIC_LIB -DVERSION=\"1.5.0\" -DZOOKEEPER_VERSION=\"3.4.8\" -D__STDC_FORMAT_MACROS -I/mesos/include -I/mesos/build/include -I/mesos/build/include/mesos -I/mesos/build/src -I/mesos/src -I/mesos/3rdparty/libprocess/src/../include -I/mesos/3rdparty/stout/include -isystem /usr/include/apr-1.0 -isystem /mesos/build/3rdparty/boost-1.53.0/src/boost-1.53.0 -isystem /mesos/build/3rdparty/elfio-3.2/src/elfio-3.2 -isystem /mesos/build/3rdparty/glog-0.3.3/src/glog-0.3.3-build/include -isystem /mesos/build/3rdparty/picojson-1.3.0/src/picojson-1.3.0 -isystem /mesos/build/3rdparty/protobuf-3.3.0/src/protobuf-3.3.0/src -isystem /usr/include/subversion-1 -isystem /mesos/build/3rdparty/http_parser-2.6.2/src/http_parser-2.6.2 -isystem /mesos/build/3rdparty/zookeeper-3.4.8/src/zookeeper-3.4.8/src/c/include -isystem /mesos/build/3rdparty/zookeeper-3.4.8/src/zookeeper-3.4.8/src/c/generated -isystem /mesos/build/3rdparty/nvml-352.79/src/nvml-352.79 -isystem /mesos/build/3rdparty/leveldb-1.19/src/leveldb-1.19/include -isystem /mesos/build/3rdparty/googletest-1.8.0/src/googletest-1.8.0/googlemock/include -isystem /mesos/build/3rdparty/googletest-1.8.0/src/googletest-1.8.0/googletest/include  -std=c++11 -Wformat-security -fstack-protector-strong -fPIE   -o CMakeFiles/mesos-tests.dir/examples_tests.cpp.o -c /mesos/src/tests/examples_tests.cpp
[ 91%] Building CXX object src/tests/CMakeFiles/mesos-tests.dir/fetcher_cache_tests.cpp.o
cd /mesos/build/src/tests && /usr/bin/clang++-3.5  -DBUILD_DIR=\"/mesos/build\" -DBUILD_FLAGS=\"\" -DBUILD_JAVA_JVM_LIBRARY=\"\" -DHAS_AUTHENTICATION=1 -DHAVE_LIBZ -DLIBDIR=\"/usr/local/libmesos\" -DPICOJSON_USE_INT64 -DPKGDATADIR=\"/usr/local/share/mesos\" -DPKGLIBEXECDIR=\"/usr/local/libexec/mesos\" -DPKGMODULEDIR=\"\" -DSBINDIR=\"\" -DSOURCE_DIR=\"/mesos\" -DTESTLIBEXECDIR=\"\" -DUSE_CMAKE_BUILD_CONFIG -DUSE_SSL_SOCKET=1 -DUSE_STATIC_LIB -DVERSION=\"1.5.0\" -DZOOKEEPER_VERSION=\"3.4.8\" -D__STDC_FORMAT_MACROS -I/mesos/include -I/mesos/build/include -I/mesos/build/include/mesos -I/mesos/build/src -I/mesos/src -I/mesos/3rdparty/libprocess/src/../include -I/mesos/3rdparty/stout/include -isystem /usr/include/apr-1.0 -isystem /mesos/build/3rdparty/boost-1.53.0/src/boost-1.53.0 -isystem /mesos/build/3rdparty/elfio-3.2/src/elfio-3.2 -isystem /mesos/build/3rdparty/glog-0.3.3/src/glog-0.3.3-build/include -isystem /mesos/build/3rdparty/picojson-1.3.0/src/picojson-1.3.0 -isystem /mesos/build/3rdparty/protobuf-3.3.0/src/protobuf-3.3.0/src -isystem /usr/include/subversion-1 -isystem /mesos/build/3rdparty/http_parser-2.6.2/src/http_parser-2.6.2 -isystem /mesos/build/3rdparty/zookeeper-3.4.8/src/zookeeper-3.4.8/src/c/include -isystem /mesos/build/3rdparty/zookeeper-3.4.8/src/zookeeper-3.4.8/src/c/generated -isystem /mesos/build/3rdparty/nvml-352.79/src/nvml-352.79 -isystem /mesos/build/3rdparty/leveldb-1.19/src/leveldb-1.19/include -isystem /mesos/build/3rdparty/googletest-1.8.0/src/googletest-1.8.0/googlemock/include -isystem /mesos/build/3rdparty/googletest-1.8.0/src/googletest-1.8.0/googletest/include  -std=c++11 -Wformat-security -fstack-protector-strong -fPIE   -o CMakeFiles/mesos-tests.dir/fetcher_cache_tests.cpp.o -c /mesos/src/tests/fetcher_cache_tests.cpp
[ 92%] Building CXX object src/tests/CMakeFiles/mesos-tests.dir/hdfs_tests.cpp.o
cd /mesos/build/src/tests && /usr/bin/clang++-3.5  -DBUILD_DIR=\"/mesos/build\" -DBUILD_FLAGS=\"\" -DBUILD_JAVA_JVM_LIBRARY=\"\" -DHAS_AUTHENTICATION=1 -DHAVE_LIBZ -DLIBDIR=\"/usr/local/libmesos\" -DPICOJSON_USE_INT64 -DPKGDATADIR=\"/usr/local/share/mesos\" -DPKGLIBEXECDIR=\"/usr/local/libexec/mesos\" -DPKGMODULEDIR=\"\" -DSBINDIR=\"\" -DSOURCE_DIR=\"/mesos\" -DTESTLIBEXECDIR=\"\" -DUSE_CMAKE_BUILD_CONFIG -DUSE_SSL_SOCKET=1 -DUSE_STATIC_LIB -DVERSION=\"1.5.0\" -DZOOKEEPER_VERSION=\"3.4.8\" -D__STDC_FORMAT_MACROS -I/mesos/include -I/mesos/build/include -I/mesos/build/include/mesos -I/mesos/build/src -I/mesos/src -I/mesos/3rdparty/libprocess/src/../include -I/mesos/3rdparty/stout/include -isystem /usr/include/apr-1.0 -isystem /mesos/build/3rdparty/boost-1.53.0/src/boost-1.53.0 -isystem /mesos/build/3rdparty/elfio-3.2/src/elfio-3.2 -isystem /mesos/build/3rdparty/glog-0.3.3/src/glog-0.3.3-build/include -isystem /mesos/build/3rdparty/picojson-1.3.0/src/picojson-1.3.0 -isystem /mesos/build/3rdparty/protobuf-3.3.0/src/protobuf-3.3.0/src -isystem /usr/include/subversion-1 -isystem /mesos/build/3rdparty/http_parser-2.6.2/src/http_parser-2.6.2 -isystem /mesos/build/3rdparty/zookeeper-3.4.8/src/zookeeper-3.4.8/src/c/include -isystem /mesos/build/3rdparty/zookeeper-3.4.8/src/zookeeper-3.4.8/src/c/generated -isystem /mesos/build/3rdparty/nvml-352.79/src/nvml-352.79 -isystem /mesos/build/3rdparty/leveldb-1.19/src/leveldb-1.19/include -isystem /mesos/build/3rdparty/googletest-1.8.0/src/googletest-1.8.0/googlemock/include -isystem /mesos/build/3rdparty/googletest-1.8.0/src/googletest-1.8.0/googletest/include  -std=c++11 -Wformat-security -fstack-protector-strong -fPIE   -o CMakeFiles/mesos-tests.dir/hdfs_tests.cpp.o -c /mesos/src/tests/hdfs_tests.cpp
[ 92%] Building CXX object src/tests/CMakeFiles/mesos-tests.dir/log_tests.cpp.o
cd /mesos/build/src/tests && /usr/bin/clang++-3.5  -DBUILD_DIR=\"/mesos/build\" -DBUILD_FLAGS=\"\" -DBUILD_JAVA_JVM_LIBRARY=\"\" -DHAS_AUTHENTICATION=1 -DHAVE_LIBZ -DLIBDIR=\"/usr/local/libmesos\" -DPICOJSON_USE_INT64 -DPKGDATADIR=\"/usr/local/share/mesos\" -DPKGLIBEXECDIR=\"/usr/local/libexec/mesos\" -DPKGMODULEDIR=\"\" -DSBINDIR=\"\" -DSOURCE_DIR=\"/mesos\" -DTESTLIBEXECDIR=\"\" -DUSE_CMAKE_BUILD_CONFIG -DUSE_SSL_SOCKET=1 -DUSE_STATIC_LIB -DVERSION=\"1.5.0\" -DZOOKEEPER_VERSION=\"3.4.8\" -D__STDC_FORMAT_MACROS -I/mesos/include -I/mesos/build/include -I/mesos/build/include/mesos -I/mesos/build/src -I/mesos/src -I/mesos/3rdparty/libprocess/src/../include -I/mesos/3rdparty/stout/include -isystem /usr/include/apr-1.0 -isystem /mesos/build/3rdparty/boost-1.53.0/src/boost-1.53.0 -isystem /mesos/build/3rdparty/elfio-3.2/src/elfio-3.2 -isystem /mesos/build/3rdparty/glog-0.3.3/src/glog-0.3.3-build/include -isystem /mesos/build/3rdparty/picojson-1.3.0/src/picojson-1.3.0 -isystem /mesos/build/3rdparty/protobuf-3.3.0/src/protobuf-3.3.0/src -isystem /usr/include/subversion-1 -isystem /mesos/build/3rdparty/http_parser-2.6.2/src/http_parser-2.6.2 -isystem /mesos/build/3rdparty/zookeeper-3.4.8/src/zookeeper-3.4.8/src/c/include -isystem /mesos/build/3rdparty/zookeeper-3.4.8/src/zookeeper-3.4.8/src/c/generated -isystem /mesos/build/3rdparty/nvml-352.79/src/nvml-352.79 -isystem /mesos/build/3rdparty/leveldb-1.19/src/leveldb-1.19/include -isystem /mesos/build/3rdparty/googletest-1.8.0/src/googletest-1.8.0/googlemock/include -isystem /mesos/build/3rdparty/googletest-1.8.0/src/googletest-1.8.0/googletest/include  -std=c++11 -Wformat-security -fstack-protector-strong -fPIE   -o CMakeFiles/mesos-tests.dir/log_tests.cpp.o -c /mesos/src/tests/log_tests.cpp
[ 92%] Building CXX object src/tests/CMakeFiles/mesos-tests.dir/logging_tests.cpp.o
cd /mesos/build/src/tests && /usr/bin/clang++-3.5  -DBUILD_DIR=\"/mesos/build\" -DBUILD_FLAGS=\"\" -DBUILD_JAVA_JVM_LIBRARY=\"\" -DHAS_AUTHENTICATION=1 -DHAVE_LIBZ -DLIBDIR=\"/usr/local/libmesos\" -DPICOJSON_USE_INT64 -DPKGDATADIR=\"/usr/local/share/mesos\" -DPKGLIBEXECDIR=\"/usr/local/libexec/mesos\" -DPKGMODULEDIR=\"\" -DSBINDIR=\"\" -DSOURCE_DIR=\"/mesos\" -DTESTLIBEXECDIR=\"\" -DUSE_CMAKE_BUILD_CONFIG -DUSE_SSL_SOCKET=1 -DUSE_STATIC_LIB -DVERSION=\"1.5.0\" -DZOOKEEPER_VERSION=\"3.4.8\" -D__STDC_FORMAT_MACROS -I/mesos/include -I/mesos/build/include -I/mesos/build/include/mesos -I/mesos/build/src -I/mesos/src -I/mesos/3rdparty/libprocess/src/../include -I/mesos/3rdparty/stout/include -isystem /usr/include/apr-1.0 -isystem /mesos/build/3rdparty/boost-1.53.0/src/boost-1.53.0 -isystem /mesos/build/3rdparty/elfio-3.2/src/elfio-3.2 -isystem /mesos/build/3rdparty/glog-0.3.3/src/glog-0.3.3-build/include -isystem /mesos/build/3rdparty/picojson-1.3.0/src/picojson-1.3.0 -isystem /mesos/build/3rdparty/protobuf-3.3.0/src/protobuf-3.3.0/src -isystem /usr/include/subversion-1 -isystem /mesos/build/3rdparty/http_parser-2.6.2/src/http_parser-2.6.2 -isystem /mesos/build/3rdparty/zookeeper-3.4.8/src/zookeeper-3.4.8/src/c/include -isystem /mesos/build/3rdparty/zookeeper-3.4.8/src/zookeeper-3.4.8/src/c/generated -isystem /mesos/build/3rdparty/nvml-352.79/src/nvml-352.79 -isystem /mesos/build/3rdparty/leveldb-1.19/src/leveldb-1.19/include -isystem /mesos/build/3rdparty/googletest-1.8.0/src/googletest-1.8.0/googlemock/include -isystem /mesos/build/3rdparty/googletest-1.8.0/src/googletest-1.8.0/googletest/include  -std=c++11 -Wformat-security -fstack-protector-strong -fPIE   -o CMakeFiles/mesos-tests.dir/logging_tests.cpp.o -c /mesos/src/tests/logging_tests.cpp
[ 92%] Building CXX object src/tests/CMakeFiles/mesos-tests.dir/master_allocator_tests.cpp.o
cd /mesos/build/src/tests && /usr/bin/clang++-3.5  -DBUILD_DIR=\"/mesos/build\" -DBUILD_FLAGS=\"\" -DBUILD_JAVA_JVM_LIBRARY=\"\" -DHAS_AUTHENTICATION=1 -DHAVE_LIBZ -DLIBDIR=\"/usr/local/libmesos\" -DPICOJSON_USE_INT64 -DPKGDATADIR=\"/usr/local/share/mesos\" -DPKGLIBEXECDIR=\"/usr/local/libexec/mesos\" -DPKGMODULEDIR=\"\" -DSBINDIR=\"\" -DSOURCE_DIR=\"/mesos\" -DTESTLIBEXECDIR=\"\" -DUSE_CMAKE_BUILD_CONFIG -DUSE_SSL_SOCKET=1 -DUSE_STATIC_LIB -DVERSION=\"1.5.0\" -DZOOKEEPER_VERSION=\"3.4.8\" -D__STDC_FORMAT_MACROS -I/mesos/include -I/mesos/build/include -I/mesos/build/include/mesos -I/mesos/build/src -I/mesos/src -I/mesos/3rdparty/libprocess/src/../include -I/mesos/3rdparty/stout/include -isystem /usr/include/apr-1.0 -isystem /mesos/build/3rdparty/boost-1.53.0/src/boost-1.53.0 -isystem /mesos/build/3rdparty/elfio-3.2/src/elfio-3.2 -isystem /mesos/build/3rdparty/glog-0.3.3/src/glog-0.3.3-build/include -isystem /mesos/build/3rdparty/picojson-1.3.0/src/picojson-1.3.0 -isystem /mesos/build/3rdparty/protobuf-3.3.0/src/protobuf-3.3.0/src -isystem /usr/include/subversion-1 -isystem /mesos/build/3rdparty/http_parser-2.6.2/src/http_parser-2.6.2 -isystem /mesos/build/3rdparty/zookeeper-3.4.8/src/zookeeper-3.4.8/src/c/include -isystem /mesos/build/3rdparty/zookeeper-3.4.8/src/zookeeper-3.4.8/src/c/generated -isystem /mesos/build/3rdparty/nvml-352.79/src/nvml-352.79 -isystem /mesos/build/3rdparty/leveldb-1.19/src/leveldb-1.19/include -isystem /mesos/build/3rdparty/googletest-1.8.0/src/googletest-1.8.0/googlemock/include -isystem /mesos/build/3rdparty/googletest-1.8.0/src/googletest-1.8.0/googletest/include  -std=c++11 -Wformat-security -fstack-protector-strong -fPIE   -o CMakeFiles/mesos-tests.dir/master_allocator_tests.cpp.o -c /mesos/src/tests/master_allocator_tests.cpp
[ 92%] Building CXX object src/tests/CMakeFiles/mesos-tests.dir/master_authorization_tests.cpp.o
cd /mesos/build/src/tests && /usr/bin/clang++-3.5  -DBUILD_DIR=\"/mesos/build\" -DBUILD_FLAGS=\"\" -DBUILD_JAVA_JVM_LIBRARY=\"\" -DHAS_AUTHENTICATION=1 -DHAVE_LIBZ -DLIBDIR=\"/usr/local/libmesos\" -DPICOJSON_USE_INT64 -DPKGDATADIR=\"/usr/local/share/mesos\" -DPKGLIBEXECDIR=\"/usr/local/libexec/mesos\" -DPKGMODULEDIR=\"\" -DSBINDIR=\"\" -DSOURCE_DIR=\"/mesos\" -DTESTLIBEXECDIR=\"\" -DUSE_CMAKE_BUILD_CONFIG -DUSE_SSL_SOCKET=1 -DUSE_STATIC_LIB -DVERSION=\"1.5.0\" -DZOOKEEPER_VERSION=\"3.4.8\" -D__STDC_FORMAT_MACROS -I/mesos/include -I/mesos/build/include -I/mesos/build/include/mesos -I/mesos/build/src -I/mesos/src -I/mesos/3rdparty/libprocess/src/../include -I/mesos/3rdparty/stout/include -isystem /usr/include/apr-1.0 -isystem /mesos/build/3rdparty/boost-1.53.0/src/boost-1.53.0 -isystem /mesos/build/3rdparty/elfio-3.2/src/elfio-3.2 -isystem /mesos/build/3rdparty/glog-0.3.3/src/glog-0.3.3-build/include -isystem /mesos/build/3rdparty/picojson-1.3.0/src/picojson-1.3.0 -isystem /mesos/build/3rdparty/protobuf-3.3.0/src/protobuf-3.3.0/src -isystem /usr/include/subversion-1 -isystem /mesos/build/3rdparty/http_parser-2.6.2/src/http_parser-2.6.2 -isystem /mesos/build/3rdparty/zookeeper-3.4.8/src/zookeeper-3.4.8/src/c/include -isystem /mesos/build/3rdparty/zookeeper-3.4.8/src/zookeeper-3.4.8/src/c/generated -isystem /mesos/build/3rdparty/nvml-352.79/src/nvml-352.79 -isystem /mesos/build/3rdparty/leveldb-1.19/src/leveldb-1.19/include -isystem /mesos/build/3rdparty/googletest-1.8.0/src/googletest-1.8.0/googlemock/include -isystem /mesos/build/3rdparty/googletest-1.8.0/src/googletest-1.8.0/googletest/include  -std=c++11 -Wformat-security -fstack-protector-strong -fPIE   -o CMakeFiles/mesos-tests.dir/master_authorization_tests.cpp.o -c /mesos/src/tests/master_authorization_tests.cpp
[ 92%] Building CXX object src/tests/CMakeFiles/mesos-tests.dir/master_contender_detector_tests.cpp.o
cd /mesos/build/src/tests && /usr/bin/clang++-3.5  -DBUILD_DIR=\"/mesos/build\" -DBUILD_FLAGS=\"\" -DBUILD_JAVA_JVM_LIBRARY=\"\" -DHAS_AUTHENTICATION=1 -DHAVE_LIBZ -DLIBDIR=\"/usr/local/libmesos\" -DPICOJSON_USE_INT64 -DPKGDATADIR=\"/usr/local/share/mesos\" -DPKGLIBEXECDIR=\"/usr/local/libexec/mesos\" -DPKGMODULEDIR=\"\" -DSBINDIR=\"\" -DSOURCE_DIR=\"/mesos\" -DTESTLIBEXECDIR=\"\" -DUSE_CMAKE_BUILD_CONFIG -DUSE_SSL_SOCKET=1 -DUSE_STATIC_LIB -DVERSION=\"1.5.0\" -DZOOKEEPER_VERSION=\"3.4.8\" -D__STDC_FORMAT_MACROS -I/mesos/include -I/mesos/build/include -I/mesos/build/include/mesos -I/mesos/build/src -I/mesos/src -I/mesos/3rdparty/libprocess/src/../include -I/mesos/3rdparty/stout/include -isystem /usr/include/apr-1.0 -isystem /mesos/build/3rdparty/boost-1.53.0/src/boost-1.53.0 -isystem /mesos/build/3rdparty/elfio-3.2/src/elfio-3.2 -isystem /mesos/build/3rdparty/glog-0.3.3/src/glog-0.3.3-build/include -isystem /mesos/build/3rdparty/picojson-1.3.0/src/picojson-1.3.0 -isystem /mesos/build/3rdparty/protobuf-3.3.0/src/protobuf-3.3.0/src -isystem /usr/include/subversion-1 -isystem /mesos/build/3rdparty/http_parser-2.6.2/src/http_parser-2.6.2 -isystem /mesos/build/3rdparty/zookeeper-3.4.8/src/zookeeper-3.4.8/src/c/include -isystem /mesos/build/3rdparty/zookeeper-3.4.8/src/zookeeper-3.4.8/src/c/generated -isystem /mesos/build/3rdparty/nvml-352.79/src/nvml-352.79 -isystem /mesos/build/3rdparty/leveldb-1.19/src/leveldb-1.19/include -isystem /mesos/build/3rdparty/googletest-1.8.0/src/googletest-1.8.0/googlemock/include -isystem /mesos/build/3rdparty/googletest-1.8.0/src/googletest-1.8.0/googletest/include  -std=c++11 -Wformat-security -fstack-protector-strong -fPIE   -o CMakeFiles/mesos-tests.dir/master_contender_detector_tests.cpp.o -c /mesos/src/tests/master_contender_detector_tests.cpp
[ 92%] Building CXX object src/tests/CMakeFiles/mesos-tests.dir/master_quota_tests.cpp.o
cd /mesos/build/src/tests && /usr/bin/clang++-3.5  -DBUILD_DIR=\"/mesos/build\" -DBUILD_FLAGS=\"\" -DBUILD_JAVA_JVM_LIBRARY=\"\" -DHAS_AUTHENTICATION=1 -DHAVE_LIBZ -DLIBDIR=\"/usr/local/libmesos\" -DPICOJSON_USE_INT64 -DPKGDATADIR=\"/usr/local/share/mesos\" -DPKGLIBEXECDIR=\"/usr/local/libexec/mesos\" -DPKGMODULEDIR=\"\" -DSBINDIR=\"\" -DSOURCE_DIR=\"/mesos\" -DTESTLIBEXECDIR=\"\" -DUSE_CMAKE_BUILD_CONFIG -DUSE_SSL_SOCKET=1 -DUSE_STATIC_LIB -DVERSION=\"1.5.0\" -DZOOKEEPER_VERSION=\"3.4.8\" -D__STDC_FORMAT_MACROS -I/mesos/include -I/mesos/build/include -I/mesos/build/include/mesos -I/mesos/build/src -I/mesos/src -I/mesos/3rdparty/libprocess/src/../include -I/mesos/3rdparty/stout/include -isystem /usr/include/apr-1.0 -isystem /mesos/build/3rdparty/boost-1.53.0/src/boost-1.53.0 -isystem /mesos/build/3rdparty/elfio-3.2/src/elfio-3.2 -isystem /mesos/build/3rdparty/glog-0.3.3/src/glog-0.3.3-build/include -isystem /mesos/build/3rdparty/picojson-1.3.0/src/picojson-1.3.0 -isystem /mesos/build/3rdparty/protobuf-3.3.0/src/protobuf-3.3.0/src -isystem /usr/include/subversion-1 -isystem /mesos/build/3rdparty/http_parser-2.6.2/src/http_parser-2.6.2 -isystem /mesos/build/3rdparty/zookeeper-3.4.8/src/zookeeper-3.4.8/src/c/include -isystem /mesos/build/3rdparty/zookeeper-3.4.8/src/zookeeper-3.4.8/src/c/generated -isystem /mesos/build/3rdparty/nvml-352.79/src/nvml-352.79 -isystem /mesos/build/3rdparty/leveldb-1.19/src/leveldb-1.19/include -isystem /mesos/build/3rdparty/googletest-1.8.0/src/googletest-1.8.0/googlemock/include -isystem /mesos/build/3rdparty/googletest-1.8.0/src/googletest-1.8.0/googletest/include  -std=c++11 -Wformat-security -fstack-protector-strong -fPIE   -o CMakeFiles/mesos-tests.dir/master_quota_tests.cpp.o -c /mesos/src/tests/master_quota_tests.cpp
[ 93%] Building CXX object src/tests/CMakeFiles/mesos-tests.dir/master_tests.cpp.o
cd /mesos/build/src/tests && /usr/bin/clang++-3.5  -DBUILD_DIR=\"/mesos/build\" -DBUILD_FLAGS=\"\" -DBUILD_JAVA_JVM_LIBRARY=\"\" -DHAS_AUTHENTICATION=1 -DHAVE_LIBZ -DLIBDIR=\"/usr/local/libmesos\" -DPICOJSON_USE_INT64 -DPKGDATADIR=\"/usr/local/share/mesos\" -DPKGLIBEXECDIR=\"/usr/local/libexec/mesos\" -DPKGMODULEDIR=\"\" -DSBINDIR=\"\" -DSOURCE_DIR=\"/mesos\" -DTESTLIBEXECDIR=\"\" -DUSE_CMAKE_BUILD_CONFIG -DUSE_SSL_SOCKET=1 -DUSE_STATIC_LIB -DVERSION=\"1.5.0\" -DZOOKEEPER_VERSION=\"3.4.8\" -D__STDC_FORMAT_MACROS -I/mesos/include -I/mesos/build/include -I/mesos/build/include/mesos -I/mesos/build/src -I/mesos/src -I/mesos/3rdparty/libprocess/src/../include -I/mesos/3rdparty/stout/include -isystem /usr/include/apr-1.0 -isystem /mesos/build/3rdparty/boost-1.53.0/src/boost-1.53.0 -isystem /mesos/build/3rdparty/elfio-3.2/src/elfio-3.2 -isystem /mesos/build/3rdparty/glog-0.3.3/src/glog-0.3.3-build/include -isystem /mesos/build/3rdparty/picojson-1.3.0/src/picojson-1.3.0 -isystem /mesos/build/3rdparty/protobuf-3.3.0/src/protobuf-3.3.0/src -isystem /usr/include/subversion-1 -isystem /mesos/build/3rdparty/http_parser-2.6.2/src/http_parser-2.6.2 -isystem /mesos/build/3rdparty/zookeeper-3.4.8/src/zookeeper-3.4.8/src/c/include -isystem /mesos/build/3rdparty/zookeeper-3.4.8/src/zookeeper-3.4.8/src/c/generated -isystem /mesos/build/3rdparty/nvml-352.79/src/nvml-352.79 -isystem /mesos/build/3rdparty/leveldb-1.19/src/leveldb-1.19/include -isystem /mesos/build/3rdparty/googletest-1.8.0/src/googletest-1.8.0/googlemock/include -isystem /mesos/build/3rdparty/googletest-1.8.0/src/googletest-1.8.0/googletest/include  -std=c++11 -Wformat-security -fstack-protector-strong -fPIE   -o CMakeFiles/mesos-tests.dir/master_tests.cpp.o -c /mesos/src/tests/master_tests.cpp
[ 93%] Building CXX object src/tests/CMakeFiles/mesos-tests.dir/master_validation_tests.cpp.o
cd /mesos/build/src/tests && /usr/bin/clang++-3.5  -DBUILD_DIR=\"/mesos/build\" -DBUILD_FLAGS=\"\" -DBUILD_JAVA_JVM_LIBRARY=\"\" -DHAS_AUTHENTICATION=1 -DHAVE_LIBZ -DLIBDIR=\"/usr/local/libmesos\" -DPICOJSON_USE_INT64 -DPKGDATADIR=\"/usr/local/share/mesos\" -DPKGLIBEXECDIR=\"/usr/local/libexec/mesos\" -DPKGMODULEDIR=\"\" -DSBINDIR=\"\" -DSOURCE_DIR=\"/mesos\" -DTESTLIBEXECDIR=\"\" -DUSE_CMAKE_BUILD_CONFIG -DUSE_SSL_SOCKET=1 -DUSE_STATIC_LIB -DVERSION=\"1.5.0\" -DZOOKEEPER_VERSION=\"3.4.8\" -D__STDC_FORMAT_MACROS -I/mesos/include -I/mesos/build/include -I/mesos/build/include/mesos -I/mesos/build/src -I/mesos/src -I/mesos/3rdparty/libprocess/src/../include -I/mesos/3rdparty/stout/include -isystem /usr/include/apr-1.0 -isystem /mesos/build/3rdparty/boost-1.53.0/src/boost-1.53.0 -isystem /mesos/build/3rdparty/elfio-3.2/src/elfio-3.2 -isystem /mesos/build/3rdparty/glog-0.3.3/src/glog-0.3.3-build/include -isystem /mesos/build/3rdparty/picojson-1.3.0/src/picojson-1.3.0 -isystem /mesos/build/3rdparty/protobuf-3.3.0/src/protobuf-3.3.0/src -isystem /usr/include/subversion-1 -isystem /mesos/build/3rdparty/http_parser-2.6.2/src/http_parser-2.6.2 -isystem /mesos/build/3rdparty/zookeeper-3.4.8/src/zookeeper-3.4.8/src/c/include -isystem /mesos/build/3rdparty/zookeeper-3.4.8/src/zookeeper-3.4.8/src/c/generated -isystem /mesos/build/3rdparty/nvml-352.79/src/nvml-352.79 -isystem /mesos/build/3rdparty/leveldb-1.19/src/leveldb-1.19/include -isystem /mesos/build/3rdparty/googletest-1.8.0/src/googletest-1.8.0/googlemock/include -isystem /mesos/build/3rdparty/googletest-1.8.0/src/googletest-1.8.0/googletest/include  -std=c++11 -Wformat-security -fstack-protector-strong -fPIE   -o CMakeFiles/mesos-tests.dir/master_validation_tests.cpp.o -c /mesos/src/tests/master_validation_tests.cpp
[ 93%] Building CXX object src/tests/CMakeFiles/mesos-tests.dir/metrics_tests.cpp.o
cd /mesos/build/src/tests && /usr/bin/clang++-3.5  -DBUILD_DIR=\"/mesos/build\" -DBUILD_FLAGS=\"\" -DBUILD_JAVA_JVM_LIBRARY=\"\" -DHAS_AUTHENTICATION=1 -DHAVE_LIBZ -DLIBDIR=\"/usr/local/libmesos\" -DPICOJSON_USE_INT64 -DPKGDATADIR=\"/usr/local/share/mesos\" -DPKGLIBEXECDIR=\"/usr/local/libexec/mesos\" -DPKGMODULEDIR=\"\" -DSBINDIR=\"\" -DSOURCE_DIR=\"/mesos\" -DTESTLIBEXECDIR=\"\" -DUSE_CMAKE_BUILD_CONFIG -DUSE_SSL_SOCKET=1 -DUSE_STATIC_LIB -DVERSION=\"1.5.0\" -DZOOKEEPER_VERSION=\"3.4.8\" -D__STDC_FORMAT_MACROS -I/mesos/include -I/mesos/build/include -I/mesos/build/include/mesos -I/mesos/build/src -I/mesos/src -I/mesos/3rdparty/libprocess/src/../include -I/mesos/3rdparty/stout/include -isystem /usr/include/apr-1.0 -isystem /mesos/build/3rdparty/boost-1.53.0/src/boost-1.53.0 -isystem /mesos/build/3rdparty/elfio-3.2/src/elfio-3.2 -isystem /mesos/build/3rdparty/glog-0.3.3/src/glog-0.3.3-build/include -isystem /mesos/build/3rdparty/picojson-1.3.0/src/picojson-1.3.0 -isystem /mesos/build/3rdparty/protobuf-3.3.0/src/protobuf-3.3.0/src -isystem /usr/include/subversion-1 -isystem /mesos/build/3rdparty/http_parser-2.6.2/src/http_parser-2.6.2 -isystem /mesos/build/3rdparty/zookeeper-3.4.8/src/zookeeper-3.4.8/src/c/include -isystem /mesos/build/3rdparty/zookeeper-3.4.8/src/zookeeper-3.4.8/src/c/generated -isystem /mesos/build/3rdparty/nvml-352.79/src/nvml-352.79 -isystem /mesos/build/3rdparty/leveldb-1.19/src/leveldb-1.19/include -isystem /mesos/build/3rdparty/googletest-1.8.0/src/googletest-1.8.0/googlemock/include -isystem /mesos/build/3rdparty/googletest-1.8.0/src/googletest-1.8.0/googletest/include  -std=c++11 -Wformat-security -fstack-protector-strong -fPIE   -o CMakeFiles/mesos-tests.dir/metrics_tests.cpp.o -c /mesos/src/tests/metrics_tests.cpp
[ 93%] Building CXX object src/tests/CMakeFiles/mesos-tests.dir/module_tests.cpp.o
cd /mesos/build/src/tests && /usr/bin/clang++-3.5  -DBUILD_DIR=\"/mesos/build\" -DBUILD_FLAGS=\"\" -DBUILD_JAVA_JVM_LIBRARY=\"\" -DHAS_AUTHENTICATION=1 -DHAVE_LIBZ -DLIBDIR=\"/usr/local/libmesos\" -DPICOJSON_USE_INT64 -DPKGDATADIR=\"/usr/local/share/mesos\" -DPKGLIBEXECDIR=\"/usr/local/libexec/mesos\" -DPKGMODULEDIR=\"\" -DSBINDIR=\"\" -DSOURCE_DIR=\"/mesos\" -DTESTLIBEXECDIR=\"\" -DUSE_CMAKE_BUILD_CONFIG -DUSE_SSL_SOCKET=1 -DUSE_STATIC_LIB -DVERSION=\"1.5.0\" -DZOOKEEPER_VERSION=\"3.4.8\" -D__STDC_FORMAT_MACROS -I/mesos/include -I/mesos/build/include -I/mesos/build/include/mesos -I/mesos/build/src -I/mesos/src -I/mesos/3rdparty/libprocess/src/../include -I/mesos/3rdparty/stout/include -isystem /usr/include/apr-1.0 -isystem /mesos/build/3rdparty/boost-1.53.0/src/boost-1.53.0 -isystem /mesos/build/3rdparty/elfio-3.2/src/elfio-3.2 -isystem /mesos/build/3rdparty/glog-0.3.3/src/glog-0.3.3-build/include -isystem /mesos/build/3rdparty/picojson-1.3.0/src/picojson-1.3.0 -isystem /mesos/build/3rdparty/protobuf-3.3.0/src/protobuf-3.3.0/src -isystem /usr/include/subversion-1 -isystem /mesos/build/3rdparty/http_parser-2.6.2/src/http_parser-2.6.2 -isystem /mesos/build/3rdparty/zookeeper-3.4.8/src/zookeeper-3.4.8/src/c/include -isystem /mesos/build/3rdparty/zookeeper-3.4.8/src/zookeeper-3.4.8/src/c/generated -isystem /mesos/build/3rdparty/nvml-352.79/src/nvml-352.79 -isystem /mesos/build/3rdparty/leveldb-1.19/src/leveldb-1.19/include -isystem /mesos/build/3rdparty/googletest-1.8.0/src/googletest-1.8.0/googlemock/include -isystem /mesos/build/3rdparty/googletest-1.8.0/src/googletest-1.8.0/googletest/include  -std=c++11 -Wformat-security -fstack-protector-strong -fPIE   -o CMakeFiles/mesos-tests.dir/module_tests.cpp.o -c /mesos/src/tests/module_tests.cpp
[ 93%] Building CXX object src/tests/CMakeFiles/mesos-tests.dir/oversubscription_tests.cpp.o
cd /mesos/build/src/tests && /usr/bin/clang++-3.5  -DBUILD_DIR=\"/mesos/build\" -DBUILD_FLAGS=\"\" -DBUILD_JAVA_JVM_LIBRARY=\"\" -DHAS_AUTHENTICATION=1 -DHAVE_LIBZ -DLIBDIR=\"/usr/local/libmesos\" -DPICOJSON_USE_INT64 -DPKGDATADIR=\"/usr/local/share/mesos\" -DPKGLIBEXECDIR=\"/usr/local/libexec/mesos\" -DPKGMODULEDIR=\"\" -DSBINDIR=\"\" -DSOURCE_DIR=\"/mesos\" -DTESTLIBEXECDIR=\"\" -DUSE_CMAKE_BUILD_CONFIG -DUSE_SSL_SOCKET=1 -DUSE_STATIC_LIB -DVERSION=\"1.5.0\" -DZOOKEEPER_VERSION=\"3.4.8\" -D__STDC_FORMAT_MACROS -I/mesos/include -I/mesos/build/include -I/mesos/build/include/mesos -I/mesos/build/src -I/mesos/src -I/mesos/3rdparty/libprocess/src/../include -I/mesos/3rdparty/stout/include -isystem /usr/include/apr-1.0 -isystem /mesos/build/3rdparty/boost-1.53.0/src/boost-1.53.0 -isystem /mesos/build/3rdparty/elfio-3.2/src/elfio-3.2 -isystem /mesos/build/3rdparty/glog-0.3.3/src/glog-0.3.3-build/include -isystem /mesos/build/3rdparty/picojson-1.3.0/src/picojson-1.3.0 -isystem /mesos/build/3rdparty/protobuf-3.3.0/src/protobuf-3.3.0/src -isystem /usr/include/subversion-1 -isystem /mesos/build/3rdparty/http_parser-2.6.2/src/http_parser-2.6.2 -isystem /mesos/build/3rdparty/zookeeper-3.4.8/src/zookeeper-3.4.8/src/c/include -isystem /mesos/build/3rdparty/zookeeper-3.4.8/src/zookeeper-3.4.8/src/c/generated -isystem /mesos/build/3rdparty/nvml-352.79/src/nvml-352.79 -isystem /mesos/build/3rdparty/leveldb-1.19/src/leveldb-1.19/include -isystem /mesos/build/3rdparty/googletest-1.8.0/src/googletest-1.8.0/googlemock/include -isystem /mesos/build/3rdparty/googletest-1.8.0/src/googletest-1.8.0/googletest/include  -std=c++11 -Wformat-security -fstack-protector-strong -fPIE   -o CMakeFiles/mesos-tests.dir/oversubscription_tests.cpp.o -c /mesos/src/tests/oversubscription_tests.cpp
fatal error: error in backend: IO failure on output stream.
make[3]: *** [src/tests/CMakeFiles/mesos-tests.dir/master_quota_tests.cpp.o] Error 1
make[3]: *** Waiting for unfinished jobs....
fatal error: error in backend: IO failure on output stream.
make[3]: *** [src/tests/CMakeFiles/mesos-tests.dir/metrics_tests.cpp.o] Error 1
fatal error: error in backend: IO failure on output stream.
make[3]: *** [src/tests/CMakeFiles/mesos-tests.dir/master_validation_tests.cpp.o] Error 1
fatal error: error in backend: IO failure on output stream.
make[3]: *** [src/tests/CMakeFiles/mesos-tests.dir/oversubscription_tests.cpp.o] Error 1
fatal error: error in backend: IO failure on output stream.
make[3]: *** [src/tests/CMakeFiles/mesos-tests.dir/master_tests.cpp.o] Error 1
make[3]: Leaving directory `/mesos/build'
make[2]: *** [src/tests/CMakeFiles/mesos-tests.dir/all] Error 2
make[2]: Leaving directory `/mesos/build'
make[1]: Leaving directory `/mesos/build'
make[1]: *** [CMakeFiles/check.dir/rule] Error 2
make: *** [check] Error 2
+ docker rmi mesos-1505844591-26164
Untagged: mesos-1505844591-26164:latest
Deleted: sha256:5fdb60ef026d3052a2d6c49a99f4e7d27e2e7b9febdfee48c53efea54c25e0e6
Deleted: sha256:4edbcbd0d6b0038d4e17a346817f3aa48f707d9601784af34456b8d1a93d8bba
Deleted: sha256:28a58ffd5fbc76473eb53ba469cb4b3077b4ac1048d03bf05134eac1ba2748c5
Deleted: sha256:0414221684380ed4bd51ad4dc0df22f4b507cd1c632a6e800770b53f05fb5f10
Deleted: sha256:50da0b3ebb89ea40fd4128d79a006bf90e495ae9bcd431d8bb7e6076554f2db0
Deleted: sha256:f0bb9a054efbb210aa9ece0d6c4a36083eafed50787a3dc9835fde0615ebc675
Deleted: sha256:9e85182d55ccea4855b4c1feac23bf119d6c0e90989b1e8433b17f33451327d4
Deleted: sha256:67cf930ef1a75452abd1647daf463300cef247d917ec7b5ad59b22125506585e
Deleted: sha256:465d09986c7ae62de727aabdae768bcef9a80efb16bd101d6ffa53b6b23980cf
Deleted: sha256:9005f2304f39d8a7e6d6995fd54aba17ae5d4920f6dfb33a8084117c804da2ec
Deleted: sha256:bf7522ba8e4bf1e70e0f4a19cd843712d5a9984c12a0769ce35ed32a6a55bdf3
Deleted: sha256:d0e990bf3faa49cf05a946561902aaa263132839fa7a4d3b5d926571647191b3
Deleted: sha256:227e07c0e41925f415a13fc3d2c0c2c56be1ffe46324fd9292297ddef91eb6e7
Deleted: sha256:c82b6cea61bf35701c781dbadce3d1b34fa2cf4c336e14f667bce0b8c09b3392
Deleted: sha256:b9dab7f2362e45baa5358174ddb9786e5ca7faca66a5a053993b7747f59b9539
Deleted: sha256:d0618e4273cf2fda356bfb9ecd063639d9eef336d067bb088cce5009ddcde9f0
Deleted: sha256:a02dc2b828331418f1fe1bd84c7e418ea6578047de852ec435acaef374e3c936
Deleted: sha256:69745ca12effbc8ce2b266c4bf70a76dfcd6336bb3c563c1d124f93e73ee9330
Deleted: sha256:5832b486b0aeacb8c8533b5f5b5e5d305885781c1f2fcfb811fcb2d6c1dd90ab
Deleted: sha256:15b5c836da23aee77227140defc1c0f60298a4ebbb51df7e5e2fd9c9527102f5
Deleted: sha256:63ae7c2024f7e52030f69e09817d1519f8d8ff75b50f491f294800a0a67d75ca
Deleted: sha256:7c92df73911e26a3351b07ab3726b95e0f5c66d8e52426f295b889703d7df048
Deleted: sha256:067cc1693d2f559da71c82a1f790fe9abc7549f03f1983ec26685e0dc00c944e
Deleted: sha256:070b3f93f3cd2977a15911db7adf918ea5d25872339adb33aac50745cbd08f0a
Deleted: sha256:abc5925dcc251d9ee1ccc6a6835bb5288884a7340baf1e1349f441302b0721e3
Deleted: sha256:a55ce04ec8ffbf8a5f2a2cf49dcf523ee6b4bab644a5dd10927494ecc423bf68
Deleted: sha256:c7452960f164f734d5c6a0323f1bae1f716c51e73231a3f0384a766b55d6a3c2
Deleted: sha256:b4745e7772103ad39188c097bb8bf5f8c4dc15953f18a4c748d7b6b2e20c3800
Build step 'Execute shell' marked build as failure
Not sending mail to unregistered user yujie.jay@gmail.com

Mime
View raw message