mesos-builds mailing list archives

Site index · List index
Message view « Date » · « Thread »
Top « Date » · « Thread »
From Apache Jenkins Server <jenk...@builds.apache.org>
Subject Build failed in Jenkins: Mesos-Buildbot » autotools,gcc,--verbose,GLOG_v=1 MESOS_VERBOSE=1,centos:7,(ubuntu)&&(!ubuntu-us1)&&(!ubuntu-eu2) #4186
Date Fri, 01 Sep 2017 23:10:03 GMT
See <https://builds.apache.org/job/Mesos-Buildbot/BUILDTOOL=autotools,COMPILER=gcc,CONFIGURATION=--verbose,ENVIRONMENT=GLOG_v=1%20MESOS_VERBOSE=1,OS=centos%3A7,label_exp=(ubuntu)&&(!ubuntu-us1)&&(!ubuntu-eu2)/4186/display/redirect>

------------------------------------------
[...truncated 31.13 MB...]
I0901 23:09:33.115789  6801 slave.cpp:589] Agent attributes: [  ]
I0901 23:09:33.115811  6801 slave.cpp:598] Agent hostname: b3f09f52f4d0
I0901 23:09:33.115937  6802 status_update_manager.cpp:177] Pausing sending status updates
I0901 23:09:33.117512  6818 state.cpp:64] Recovering state from '/tmp/Endpoint_SlaveEndpointTest_AuthorizedRequest_2_Ot1ldY/meta'
I0901 23:09:33.118029  6817 status_update_manager.cpp:203] Recovering status update manager
I0901 23:09:33.118227  6817 containerizer.cpp:646] Recovering containerizer
I0901 23:09:33.119735  6802 provisioner.cpp:416] Provisioner recovery complete
I0901 23:09:33.120288  6801 slave.cpp:6296] Finished recovery
I0901 23:09:33.120957  6801 slave.cpp:6478] Querying resource estimator for oversubscribable
resources
I0901 23:09:33.121223  6803 slave.cpp:6492] Received oversubscribable resources {} from the
resource estimator
I0901 23:09:33.124227  6812 process.cpp:3956] Handling HTTP event for process 'slave(807)'
with path: '/slave(807)/containers'
I0901 23:09:33.125707  6824 http.cpp:1185] HTTP GET for /slave(807)/containers from 172.17.0.11:54150
I0901 23:09:33.125797  6824 http.cpp:976] Authorizing principal 'test-principal' to GET the
'/containers' endpoint
I0901 23:09:33.130008  6804 slave.cpp:859] Agent terminating
[       OK ] Endpoint/SlaveEndpointTest.AuthorizedRequest/2 (33 ms)
[ RUN      ] Endpoint/SlaveEndpointTest.UnauthorizedRequest/0
I0901 23:09:33.143348  6782 containerizer.cpp:290] Using isolation { environment_secret, posix/cpu,
posix/mem, filesystem/posix, network/cni }
W0901 23:09:33.143882  6782 backend.cpp:76] Failed to create 'aufs' backend: AufsBackend requires
root privileges
W0901 23:09:33.144002  6782 backend.cpp:76] Failed to create 'bind' backend: BindBackend requires
root privileges
I0901 23:09:33.144038  6782 provisioner.cpp:255] Using default backend 'copy'
I0901 23:09:33.147780  6820 slave.cpp:252] Mesos agent started on (808)@172.17.0.11:42575
I0901 23:09:33.147816  6820 slave.cpp:253] Flags at startup: --acls="" --appc_simple_discovery_uri_prefix="http://"
--appc_store_dir="/tmp/Endpoint_SlaveEndpointTest_UnauthorizedRequest_0_3jMJyx/store/appc"
--authenticate_http_readonly="true" --authenticate_http_readwrite="true" --authenticatee="crammd5"
--authentication_backoff_factor="1secs" --authorizer="local" --cgroups_cpu_enable_pids_and_tids_count="false"
--cgroups_enable_cfs="false" --cgroups_hierarchy="/sys/fs/cgroup" --cgroups_limit_swap="false"
--cgroups_root="mesos" --container_disk_watch_interval="15secs" --containerizers="mesos" --credential="/tmp/Endpoint_SlaveEndpointTest_UnauthorizedRequest_0_3jMJyx/credential"
--default_role="*" --disallow_sharing_agent_pid_namespace="false" --disk_watch_interval="1mins"
--docker="docker" --docker_kill_orphans="true" --docker_registry="https://registry-1.docker.io"
--docker_remove_delay="6hrs" --docker_socket="/var/run/docker.sock" --docker_stop_timeout="0ns"
--docker_store_dir="/tmp/Endpoint_SlaveEndpointTest_UnauthorizedRequest_0_3jMJyx/store/docker"
--docker_volume_checkpoint_dir="/var/run/mesos/isolators/docker/volume" --enforce_container_disk_quota="false"
--executor_registration_timeout="1mins" --executor_reregistration_timeout="2secs" --executor_shutdown_grace_period="5secs"
--fetcher_cache_dir="/tmp/Endpoint_SlaveEndpointTest_UnauthorizedRequest_0_3jMJyx/fetch" --fetcher_cache_size="2GB"
--frameworks_home="" --gc_delay="1weeks" --gc_disk_headroom="0.1" --hadoop_home="" --help="false"
--hostname_lookup="true" --http_command_executor="false" --http_credentials="/tmp/Endpoint_SlaveEndpointTest_UnauthorizedRequest_0_3jMJyx/http_credentials"
--http_heartbeat_interval="30secs" --initialize_driver_logging="true" --isolation="posix/cpu,posix/mem"
--launcher="posix" --launcher_dir="/mesos/mesos-1.5.0/_build/src" --logbufsecs="0" --logging_level="INFO"
--max_completed_executors_per_framework="150" --oversubscribed_resources_interval="15secs"
--perf_duration="10secs" --perf_interval="1mins" --port="5051" --qos_correction_interval_min="0ns"
--quiet="false" --recover="reconnect" --recovery_timeout="15mins" --registration_backoff_factor="10ms"
--resources="cpus:2;gpus:0;mem:1024;disk:1024;ports:[31000-32000]" --revocable_cpu_low_priority="true"
--runtime_dir="/tmp/Endpoint_SlaveEndpointTest_UnauthorizedRequest_0_3jMJyx" --sandbox_directory="/mnt/mesos/sandbox"
--strict="true" --switch_user="true" --systemd_enable_support="true" --systemd_runtime_directory="/run/systemd/system"
--version="false" --work_dir="/tmp/Endpoint_SlaveEndpointTest_UnauthorizedRequest_0_ZTv03d"
--zk_session_timeout="10secs"
I0901 23:09:33.148290  6820 credentials.hpp:86] Loading credential for authentication from
'/tmp/Endpoint_SlaveEndpointTest_UnauthorizedRequest_0_3jMJyx/credential'
I0901 23:09:33.148488  6820 slave.cpp:285] Agent using credential for: test-principal
I0901 23:09:33.148510  6820 credentials.hpp:37] Loading credentials for authentication from
'/tmp/Endpoint_SlaveEndpointTest_UnauthorizedRequest_0_3jMJyx/http_credentials'
I0901 23:09:33.148759  6820 http.cpp:1045] Creating default 'basic' HTTP authenticator for
realm 'mesos-agent-readonly'
I0901 23:09:33.148959  6820 http.cpp:1045] Creating default 'basic' HTTP authenticator for
realm 'mesos-agent-readwrite'
I0901 23:09:33.150377  6820 slave.cpp:581] Agent resources: [{"name":"cpus","scalar":{"value":2.0},"type":"SCALAR"},{"name":"mem","scalar":{"value":1024.0},"type":"SCALAR"},{"name":"disk","scalar":{"value":1024.0},"type":"SCALAR"},{"name":"ports","ranges":{"range":[{"begin":31000,"end":32000}]},"type":"RANGES"}]
I0901 23:09:33.150676  6820 slave.cpp:589] Agent attributes: [  ]
I0901 23:09:33.150694  6820 slave.cpp:598] Agent hostname: b3f09f52f4d0
I0901 23:09:33.150877  6802 status_update_manager.cpp:177] Pausing sending status updates
I0901 23:09:33.152830  6824 state.cpp:64] Recovering state from '/tmp/Endpoint_SlaveEndpointTest_UnauthorizedRequest_0_ZTv03d/meta'
I0901 23:09:33.153254  6801 status_update_manager.cpp:203] Recovering status update manager
I0901 23:09:33.153486  6822 containerizer.cpp:646] Recovering containerizer
I0901 23:09:33.154958  6816 provisioner.cpp:416] Provisioner recovery complete
I0901 23:09:33.155369  6821 slave.cpp:6296] Finished recovery
I0901 23:09:33.155956  6821 slave.cpp:6478] Querying resource estimator for oversubscribable
resources
I0901 23:09:33.156245  6811 slave.cpp:6492] Received oversubscribable resources {} from the
resource estimator
I0901 23:09:33.159351  6804 process.cpp:3956] Handling HTTP event for process 'slave(808)'
with path: '/slave(808)/monitor/statistics'
I0901 23:09:33.160802  6824 http.cpp:1185] HTTP GET for /slave(808)/monitor/statistics from
172.17.0.11:54160
I0901 23:09:33.160884  6824 http.cpp:976] Authorizing principal 'test-principal' to GET the
'/monitor/statistics' endpoint
I0901 23:09:33.163286  6782 slave.cpp:859] Agent terminating
[       OK ] Endpoint/SlaveEndpointTest.UnauthorizedRequest/0 (32 ms)
[ RUN      ] Endpoint/SlaveEndpointTest.UnauthorizedRequest/1
I0901 23:09:33.175947  6782 containerizer.cpp:290] Using isolation { environment_secret, posix/cpu,
posix/mem, filesystem/posix, network/cni }
W0901 23:09:33.176517  6782 backend.cpp:76] Failed to create 'aufs' backend: AufsBackend requires
root privileges
W0901 23:09:33.176645  6782 backend.cpp:76] Failed to create 'bind' backend: BindBackend requires
root privileges
I0901 23:09:33.176682  6782 provisioner.cpp:255] Using default backend 'copy'
I0901 23:09:33.180737  6802 slave.cpp:252] Mesos agent started on (809)@172.17.0.11:42575
I0901 23:09:33.180771  6802 slave.cpp:253] Flags at startup: --acls="" --appc_simple_discovery_uri_prefix="http://"
--appc_store_dir="/tmp/Endpoint_SlaveEndpointTest_UnauthorizedRequest_1_FHT5NN/store/appc"
--authenticate_http_readonly="true" --authenticate_http_readwrite="true" --authenticatee="crammd5"
--authentication_backoff_factor="1secs" --authorizer="local" --cgroups_cpu_enable_pids_and_tids_count="false"
--cgroups_enable_cfs="false" --cgroups_hierarchy="/sys/fs/cgroup" --cgroups_limit_swap="false"
--cgroups_root="mesos" --container_disk_watch_interval="15secs" --containerizers="mesos" --credential="/tmp/Endpoint_SlaveEndpointTest_UnauthorizedRequest_1_FHT5NN/credential"
--default_role="*" --disallow_sharing_agent_pid_namespace="false" --disk_watch_interval="1mins"
--docker="docker" --docker_kill_orphans="true" --docker_registry="https://registry-1.docker.io"
--docker_remove_delay="6hrs" --docker_socket="/var/run/docker.sock" --docker_stop_timeout="0ns"
--docker_store_dir="/tmp/Endpoint_SlaveEndpointTest_UnauthorizedRequest_1_FHT5NN/store/docker"
--docker_volume_checkpoint_dir="/var/run/mesos/isolators/docker/volume" --enforce_container_disk_quota="false"
--executor_registration_timeout="1mins" --executor_reregistration_timeout="2secs" --executor_shutdown_grace_period="5secs"
--fetcher_cache_dir="/tmp/Endpoint_SlaveEndpointTest_UnauthorizedRequest_1_FHT5NN/fetch" --fetcher_cache_size="2GB"
--frameworks_home="" --gc_delay="1weeks" --gc_disk_headroom="0.1" --hadoop_home="" --help="false"
--hostname_lookup="true" --http_command_executor="false" --http_credentials="/tmp/Endpoint_SlaveEndpointTest_UnauthorizedRequest_1_FHT5NN/http_credentials"
--http_heartbeat_interval="30secs" --initialize_driver_logging="true" --isolation="posix/cpu,posix/mem"
--launcher="posix" --launcher_dir="/mesos/mesos-1.5.0/_build/src" --logbufsecs="0" --logging_level="INFO"
--max_completed_executors_per_framework="150" --oversubscribed_resources_interval="15secs"
--perf_duration="10secs" --perf_interval="1mins" --port="5051" --qos_correction_interval_min="0ns"
--quiet="false" --recover="reconnect" --recovery_timeout="15mins" --registration_backoff_factor="10ms"
--resources="cpus:2;gpus:0;mem:1024;disk:1024;ports:[31000-32000]" --revocable_cpu_low_priority="true"
--runtime_dir="/tmp/Endpoint_SlaveEndpointTest_UnauthorizedRequest_1_FHT5NN" --sandbox_directory="/mnt/mesos/sandbox"
--strict="true" --switch_user="true" --systemd_enable_support="true" --systemd_runtime_directory="/run/systemd/system"
--version="false" --work_dir="/tmp/Endpoint_SlaveEndpointTest_UnauthorizedRequest_1_Pxtweu"
--zk_session_timeout="10secs"
I0901 23:09:33.181267  6802 credentials.hpp:86] Loading credential for authentication from
'/tmp/Endpoint_SlaveEndpointTest_UnauthorizedRequest_1_FHT5NN/credential'
I0901 23:09:33.181473  6802 slave.cpp:285] Agent using credential for: test-principal
I0901 23:09:33.181493  6802 credentials.hpp:37] Loading credentials for authentication from
'/tmp/Endpoint_SlaveEndpointTest_UnauthorizedRequest_1_FHT5NN/http_credentials'
I0901 23:09:33.181735  6802 http.cpp:1045] Creating default 'basic' HTTP authenticator for
realm 'mesos-agent-readonly'
I0901 23:09:33.181955  6802 http.cpp:1045] Creating default 'basic' HTTP authenticator for
realm 'mesos-agent-readwrite'
I0901 23:09:33.183295  6802 slave.cpp:581] Agent resources: [{"name":"cpus","scalar":{"value":2.0},"type":"SCALAR"},{"name":"mem","scalar":{"value":1024.0},"type":"SCALAR"},{"name":"disk","scalar":{"value":1024.0},"type":"SCALAR"},{"name":"ports","ranges":{"range":[{"begin":31000,"end":32000}]},"type":"RANGES"}]
I0901 23:09:33.183517  6802 slave.cpp:589] Agent attributes: [  ]
I0901 23:09:33.183531  6802 slave.cpp:598] Agent hostname: b3f09f52f4d0
I0901 23:09:33.183712  6809 status_update_manager.cpp:177] Pausing sending status updates
I0901 23:09:33.185436  6822 state.cpp:64] Recovering state from '/tmp/Endpoint_SlaveEndpointTest_UnauthorizedRequest_1_Pxtweu/meta'
I0901 23:09:33.185827  6805 status_update_manager.cpp:203] Recovering status update manager
I0901 23:09:33.186041  6818 containerizer.cpp:646] Recovering containerizer
I0901 23:09:33.187376  6819 provisioner.cpp:416] Provisioner recovery complete
I0901 23:09:33.187690  6821 slave.cpp:6296] Finished recovery
I0901 23:09:33.188241  6821 slave.cpp:6478] Querying resource estimator for oversubscribable
resources
I0901 23:09:33.188540  6807 slave.cpp:6492] Received oversubscribable resources {} from the
resource estimator
I0901 23:09:33.191403  6809 process.cpp:3956] Handling HTTP event for process 'slave(809)'
with path: '/slave(809)/monitor/statistics.json'
I0901 23:09:33.192692  6805 http.cpp:1185] HTTP GET for /slave(809)/monitor/statistics.json
from 172.17.0.11:54164
I0901 23:09:33.192796  6805 http.cpp:976] Authorizing principal 'test-principal' to GET the
'/monitor/statistics.json' endpoint
I0901 23:09:33.194844  6810 slave.cpp:859] Agent terminating
[       OK ] Endpoint/SlaveEndpointTest.UnauthorizedRequest/1 (31 ms)
[ RUN      ] Endpoint/SlaveEndpointTest.UnauthorizedRequest/2
I0901 23:09:33.207602  6782 containerizer.cpp:290] Using isolation { environment_secret, posix/cpu,
posix/mem, filesystem/posix, network/cni }
W0901 23:09:33.208169  6782 backend.cpp:76] Failed to create 'aufs' backend: AufsBackend requires
root privileges
W0901 23:09:33.208297  6782 backend.cpp:76] Failed to create 'bind' backend: BindBackend requires
root privileges
I0901 23:09:33.208334  6782 provisioner.cpp:255] Using default backend 'copy'
I0901 23:09:33.212244  6801 slave.cpp:252] Mesos agent started on (810)@172.17.0.11:42575
I0901 23:09:33.212272  6801 slave.cpp:253] Flags at startup: --acls="" --appc_simple_discovery_uri_prefix="http://"
--appc_store_dir="/tmp/Endpoint_SlaveEndpointTest_UnauthorizedRequest_2_Lcmqm4/store/appc"
--authenticate_http_readonly="true" --authenticate_http_readwrite="true" --authenticatee="crammd5"
--authentication_backoff_factor="1secs" --authorizer="local" --cgroups_cpu_enable_pids_and_tids_count="false"
--cgroups_enable_cfs="false" --cgroups_hierarchy="/sys/fs/cgroup" --cgroups_limit_swap="false"
--cgroups_root="mesos" --container_disk_watch_interval="15secs" --containerizers="mesos" --credential="/tmp/Endpoint_SlaveEndpointTest_UnauthorizedRequest_2_Lcmqm4/credential"
--default_role="*" --disallow_sharing_agent_pid_namespace="false" --disk_watch_interval="1mins"
--docker="docker" --docker_kill_orphans="true" --docker_registry="https://registry-1.docker.io"
--docker_remove_delay="6hrs" --docker_socket="/var/run/docker.sock" --docker_stop_timeout="0ns"
--docker_store_dir="/tmp/Endpoint_SlaveEndpointTest_UnauthorizedRequest_2_Lcmqm4/store/docker"
--docker_volume_checkpoint_dir="/var/run/mesos/isolators/docker/volume" --enforce_container_disk_quota="false"
--executor_registration_timeout="1mins" --executor_reregistration_timeout="2secs" --executor_shutdown_grace_period="5secs"
--fetcher_cache_dir="/tmp/Endpoint_SlaveEndpointTest_UnauthorizedRequest_2_Lcmqm4/fetch" --fetcher_cache_size="2GB"
--frameworks_home="" --gc_delay="1weeks" --gc_disk_headroom="0.1" --hadoop_home="" --help="false"
--hostname_lookup="true" --http_command_executor="false" --http_credentials="/tmp/Endpoint_SlaveEndpointTest_UnauthorizedRequest_2_Lcmqm4/http_credentials"
--http_heartbeat_interval="30secs" --initialize_driver_logging="true" --isolation="posix/cpu,posix/mem"
--launcher="posix" --launcher_dir="/mesos/mesos-1.5.0/_build/src" --logbufsecs="0" --logging_level="INFO"
--max_completed_executors_per_framework="150" --oversubscribed_resources_interval="15secs"
--perf_duration="10secs" --perf_interval="1mins" --port="5051" --qos_correction_interval_min="0ns"
--quiet="false" --recover="reconnect" --recovery_timeout="15mins" --registration_backoff_factor="10ms"
--resources="cpus:2;gpus:0;mem:1024;disk:1024;ports:[31000-32000]" --revocable_cpu_low_priority="true"
--runtime_dir="/tmp/Endpoint_SlaveEndpointTest_UnauthorizedRequest_2_Lcmqm4" --sandbox_directory="/mnt/mesos/sandbox"
--strict="true" --switch_user="true" --systemd_enable_support="true" --systemd_runtime_directory="/run/systemd/system"
--version="false" --work_dir="/tmp/Endpoint_SlaveEndpointTest_UnauthorizedRequest_2_X297HK"
--zk_session_timeout="10secs"
I0901 23:09:33.212719  6801 credentials.hpp:86] Loading credential for authentication from
'/tmp/Endpoint_SlaveEndpointTest_UnauthorizedRequest_2_Lcmqm4/credential'
I0901 23:09:33.212920  6801 slave.cpp:285] Agent using credential for: test-principal
I0901 23:09:33.212945  6801 credentials.hpp:37] Loading credentials for authentication from
'/tmp/Endpoint_SlaveEndpointTest_UnauthorizedRequest_2_Lcmqm4/http_credentials'
I0901 23:09:33.213240  6801 http.cpp:1045] Creating default 'basic' HTTP authenticator for
realm 'mesos-agent-readonly'
I0901 23:09:33.213441  6801 http.cpp:1045] Creating default 'basic' HTTP authenticator for
realm 'mesos-agent-readwrite'
I0901 23:09:33.214896  6801 slave.cpp:581] Agent resources: [{"name":"cpus","scalar":{"value":2.0},"type":"SCALAR"},{"name":"mem","scalar":{"value":1024.0},"type":"SCALAR"},{"name":"disk","scalar":{"value":1024.0},"type":"SCALAR"},{"name":"ports","ranges":{"range":[{"begin":31000,"end":32000}]},"type":"RANGES"}]
I0901 23:09:33.215143  6801 slave.cpp:589] Agent attributes: [  ]
I0901 23:09:33.215157  6801 slave.cpp:598] Agent hostname: b3f09f52f4d0
I0901 23:09:33.215306  6811 status_update_manager.cpp:177] Pausing sending status updates
I0901 23:09:33.216989  6822 state.cpp:64] Recovering state from '/tmp/Endpoint_SlaveEndpointTest_UnauthorizedRequest_2_X297HK/meta'
I0901 23:09:33.217306  6803 status_update_manager.cpp:203] Recovering status update manager
I0901 23:09:33.217530  6815 containerizer.cpp:646] Recovering containerizer
I0901 23:09:33.219002  6823 provisioner.cpp:416] Provisioner recovery complete
I0901 23:09:33.219426  6801 slave.cpp:6296] Finished recovery
I0901 23:09:33.219947  6801 slave.cpp:6478] Querying resource estimator for oversubscribable
resources
I0901 23:09:33.220262  6816 slave.cpp:6492] Received oversubscribable resources {} from the
resource estimator
I0901 23:09:33.223204  6804 process.cpp:3956] Handling HTTP event for process 'slave(810)'
with path: '/slave(810)/containers'
I0901 23:09:33.224601  6803 http.cpp:1185] HTTP GET for /slave(810)/containers from 172.17.0.11:54166
I0901 23:09:33.224686  6803 http.cpp:976] Authorizing principal 'test-principal' to GET the
'/containers' endpoint
I0901 23:09:33.226958  6807 slave.cpp:859] Agent terminating
[       OK ] Endpoint/SlaveEndpointTest.UnauthorizedRequest/2 (32 ms)
[ RUN      ] Endpoint/SlaveEndpointTest.NoAuthorizer/0
I0901 23:09:33.240254  6782 containerizer.cpp:290] Using isolation { environment_secret, posix/cpu,
posix/mem, filesystem/posix, network/cni }
W0901 23:09:33.240881  6782 backend.cpp:76] Failed to create 'aufs' backend: AufsBackend requires
root privileges
W0901 23:09:33.241013  6782 backend.cpp:76] Failed to create 'bind' backend: BindBackend requires
root privileges
I0901 23:09:33.241058  6782 provisioner.cpp:255] Using default backend 'copy'
I0901 23:09:33.243249  6782 cluster.cpp:448] Creating default 'local' authorizer
I0901 23:09:33.245579  6810 slave.cpp:252] Mesos agent started on (811)@172.17.0.11:42575
I0901 23:09:33.245604  6810 slave.cpp:253] Flags at startup: --acls="" --appc_simple_discovery_uri_prefix="http://"
--appc_store_dir="/tmp/Endpoint_SlaveEndpointTest_NoAuthorizer_0_vqWPdl/store/appc" --authenticate_http_readonly="true"
--authenticate_http_readwrite="true" --authenticatee="crammd5" --authentication_backoff_factor="1secs"
--authorizer="local" --cgroups_cpu_enable_pids_and_tids_count="false" --cgroups_enable_cfs="false"
--cgroups_hierarchy="/sys/fs/cgroup" --cgroups_limit_swap="false" --cgroups_root="mesos" --container_disk_watch_interval="15secs"
--containerizers="mesos" --credential="/tmp/Endpoint_SlaveEndpointTest_NoAuthorizer_0_vqWPdl/credential"
--default_role="*" --disallow_sharing_agent_pid_namespace="false" --disk_watch_interval="1mins"
--docker="docker" --docker_kill_orphans="true" --docker_registry="https://registry-1.docker.io"
--docker_remove_delay="6hrs" --docker_socket="/var/run/docker.sock" --docker_stop_timeout="0ns"
--docker_store_dir="/tmp/Endpoint_SlaveEndpointTest_NoAuthorizer_0_vqWPdl/store/docker" --docker_volume_checkpoint_dir="/var/run/mesos/isolators/docker/volume"
--enforce_container_disk_quota="false" --executor_registration_timeout="1mins" --executor_reregistration_timeout="2secs"
--executor_shutdown_grace_period="5secs" --fetcher_cache_dir="/tmp/Endpoint_SlaveEndpointTest_NoAuthorizer_0_vqWPdl/fetch"
--fetcher_cache_size="2GB" --frameworks_home="" --gc_delay="1weeks" --gc_disk_headroom="0.1"
--hadoop_home="" --help="false" --hostname_lookup="true" --http_command_executor="false" --http_credentials="/tmp/Endpoint_SlaveEndpointTest_NoAuthorizer_0_vqWPdl/http_credentials"
--http_heartbeat_interval="30secs" --initialize_driver_logging="true" --isolation="posix/cpu,posix/mem"
--launcher="posix" --launcher_dir="/mesos/mesos-1.5.0/_build/src" --logbufsecs="0" --logging_level="INFO"
--max_completed_executors_per_framework="150" --oversubscribed_resources_interval="15secs"
--perf_duration="10secs" --perf_interval="1mins" --port="5051" --qos_correction_interval_min="0ns"
--quiet="false" --recover="reconnect" --recovery_timeout="15mins" --registration_backoff_factor="10ms"
--resources="cpus:2;gpus:0;mem:1024;disk:1024;ports:[31000-32000]" --revocable_cpu_low_priority="true"
--runtime_dir="/tmp/Endpoint_SlaveEndpointTest_NoAuthorizer_0_vqWPdl" --sandbox_directory="/mnt/mesos/sandbox"
--strict="true" --switch_user="true" --systemd_enable_support="true" --systemd_runtime_directory="/run/systemd/system"
--version="false" --work_dir="/tmp/Endpoint_SlaveEndpointTest_NoAuthorizer_0_TU0Ku1" --zk_session_timeout="10secs"
I0901 23:09:33.246085  6810 credentials.hpp:86] Loading credential for authentication from
'/tmp/Endpoint_SlaveEndpointTest_NoAuthorizer_0_vqWPdl/credential'
I0901 23:09:33.246278  6810 slave.cpp:285] Agent using credential for: test-principal
I0901 23:09:33.246299  6810 credentials.hpp:37] Loading credentials for authentication from
'/tmp/Endpoint_SlaveEndpointTest_NoAuthorizer_0_vqWPdl/http_credentials'
I0901 23:09:33.246533  6810 http.cpp:1045] Creating default 'basic' HTTP authenticator for
realm 'mesos-agent-readonly'
I0901 23:09:33.246698  6810 http.cpp:1045] Creating default 'basic' HTTP authenticator for
realm 'mesos-agent-readwrite'
I0901 23:09:33.247992  6810 slave.cpp:581] Agent resources: [{"name":"cpus","scalar":{"value":2.0},"type":"SCALAR"},{"name":"mem","scalar":{"value":1024.0},"type":"SCALAR"},{"name":"disk","scalar":{"value":1024.0},"type":"SCALAR"},{"name":"ports","ranges":{"range":[{"begin":31000,"end":32000}]},"type":"RANGES"}]
I0901 23:09:33.248212  6810 slave.cpp:589] Agent attributes: [  ]
I0901 23:09:33.248227  6810 slave.cpp:598] Agent hostname: b3f09f52f4d0
I0901 23:09:33.248347  6824 status_update_manager.cpp:177] Pausing sending status updates
I0901 23:09:33.249955  6801 state.cpp:64] Recovering state from '/tmp/Endpoint_SlaveEndpointTest_NoAuthorizer_0_TU0Ku1/meta'
I0901 23:09:33.250304  6815 status_update_manager.cpp:203] Recovering status update manager
I0901 23:09:33.250486  6818 containerizer.cpp:646] Recovering containerizer
I0901 23:09:33.251888  6824 provisioner.cpp:416] Provisioner recovery complete
I0901 23:09:33.252355  6812 slave.cpp:6296] Finished recovery
I0901 23:09:33.253110  6812 slave.cpp:6478] Querying resource estimator for oversubscribable
resources
I0901 23:09:33.253527  6809 slave.cpp:6492] Received oversubscribable resources {} from the
resource estimator
I0901 23:09:33.256458  6803 process.cpp:3956] Handling HTTP event for process 'slave(811)'
with path: '/slave(811)/monitor/statistics'
I0901 23:09:33.257697  6805 http.cpp:1185] HTTP GET for /slave(811)/monitor/statistics from
172.17.0.11:54170
I0901 23:09:33.257783  6805 http.cpp:976] Authorizing principal 'test-principal' to GET the
'/monitor/statistics' endpoint
I0901 23:09:33.260782  6782 slave.cpp:859] Agent terminating
[       OK ] Endpoint/SlaveEndpointTest.NoAuthorizer/0 (33 ms)
[ RUN      ] Endpoint/SlaveEndpointTest.NoAuthorizer/1
I0901 23:09:33.273735  6782 containerizer.cpp:290] Using isolation { environment_secret, posix/cpu,
posix/mem, filesystem/posix, network/cni }
W0901 23:09:33.274269  6782 backend.cpp:76] Failed to create 'aufs' backend: AufsBackend requires
root privileges
W0901 23:09:33.274382  6782 backend.cpp:76] Failed to create 'bind' backend: BindBackend requires
root privileges
I0901 23:09:33.274416  6782 provisioner.cpp:255] Using default backend 'copy'
I0901 23:09:33.276321  6782 cluster.cpp:448] Creating default 'local' authorizer
I0901 23:09:33.278471  6805 slave.cpp:252] Mesos agent started on (812)@172.17.0.11:42575
I0901 23:09:33.278504  6805 slave.cpp:253] Flags at startup: --acls="" --appc_simple_discovery_uri_prefix="http://"
--appc_store_dir="/tmp/Endpoint_SlaveEndpointTest_NoAuthorizer_1_s4cjpC/store/appc" --authenticate_http_readonly="true"
--authenticate_http_readwrite="true" --authenticatee="crammd5" --authentication_backoff_factor="1secs"
--authorizer="local" --cgroups_cpu_enable_pids_and_tids_count="false" --cgroups_enable_cfs="false"
--cgroups_hierarchy="/sys/fs/cgroup" --cgroups_limit_swap="false" --cgroups_root="mesos" --container_disk_watch_interval="15secs"
--containerizers="mesos" --credential="/tmp/Endpoint_SlaveEndpointTest_NoAuthorizer_1_s4cjpC/credential"
--default_role="*" --disallow_sharing_agent_pid_namespace="false" --disk_watch_interval="1mins"
--docker="docker" --docker_kill_orphans="true" --docker_registry="https://registry-1.docker.io"
--docker_remove_delay="6hrs" --docker_socket="/var/run/docker.sock" --docker_stop_timeout="0ns"
--docker_store_dir="/tmp/Endpoint_SlaveEndpointTest_NoAuthorizer_1_s4cjpC/store/docker" --docker_volume_checkpoint_dir="/var/run/mesos/isolators/docker/volume"
--enforce_container_disk_quota="false" --executor_registration_timeout="1mins" --executor_reregistration_timeout="2secs"
--executor_shutdown_grace_period="5secs" --fetcher_cache_dir="/tmp/Endpoint_SlaveEndpointTest_NoAuthorizer_1_s4cjpC/fetch"
--fetcher_cache_size="2GB" --frameworks_home="" --gc_delay="1weeks" --gc_disk_headroom="0.1"
--hadoop_home="" --help="false" --hostname_lookup="true" --http_command_executor="false" --http_credentials="/tmp/Endpoint_SlaveEndpointTest_NoAuthorizer_1_s4cjpC/http_credentials"
--http_heartbeat_interval="30secs" --initialize_driver_logging="true" --isolation="posix/cpu,posix/mem"
--launcher="posix" --launcher_dir="/mesos/mesos-1.5.0/_build/src" --logbufsecs="0" --logging_level="INFO"
--max_completed_executors_per_framework="150" --oversubscribed_resources_interval="15secs"
--perf_duration="10secs" --perf_interval="1mins" --port="5051" --qos_correction_interval_min="0ns"
--quiet="false" --recover="reconnect" --recovery_timeout="15mins" --registration_backoff_factor="10ms"
--resources="cpus:2;gpus:0;mem:1024;disk:1024;ports:[31000-32000]" --revocable_cpu_low_priority="true"
--runtime_dir="/tmp/Endpoint_SlaveEndpointTest_NoAuthorizer_1_s4cjpC" --sandbox_directory="/mnt/mesos/sandbox"
--strict="true" --switch_user="true" --systemd_enable_support="true" --systemd_runtime_directory="/run/systemd/system"
--version="false" --work_dir="/tmp/Endpoint_SlaveEndpointTest_NoAuthorizer_1_pFibBi" --zk_session_timeout="10secs"
I0901 23:09:33.279022  6805 credentials.hpp:86] Loading credential for authentication from
'/tmp/Endpoint_SlaveEndpointTest_NoAuthorizer_1_s4cjpC/credential'
I0901 23:09:33.279235  6805 slave.cpp:285] Agent using credential for: test-principal
I0901 23:09:33.279260  6805 credentials.hpp:37] Loading credentials for authentication from
'/tmp/Endpoint_SlaveEndpointTest_NoAuthorizer_1_s4cjpC/http_credentials'
I0901 23:09:33.279520  6805 http.cpp:1045] Creating default 'basic' HTTP authenticator for
realm 'mesos-agent-readonly'
I0901 23:09:33.279721  6805 http.cpp:1045] Creating default 'basic' HTTP authenticator for
realm 'mesos-agent-readwrite'
I0901 23:09:33.281200  6805 slave.cpp:581] Agent resources: [{"name":"cpus","scalar":{"value":2.0},"type":"SCALAR"},{"name":"mem","scalar":{"value":1024.0},"type":"SCALAR"},{"name":"disk","scalar":{"value":1024.0},"type":"SCALAR"},{"name":"ports","ranges":{"range":[{"begin":31000,"end":32000}]},"type":"RANGES"}]
I0901 23:09:33.281466  6805 slave.cpp:589] Agent attributes: [  ]
I0901 23:09:33.281481  6805 slave.cpp:598] Agent hostname: b3f09f52f4d0
I0901 23:09:33.281677  6820 status_update_manager.cpp:177] Pausing sending status updates
I0901 23:09:33.283360  6821 state.cpp:64] Recovering state from '/tmp/Endpoint_SlaveEndpointTest_NoAuthorizer_1_pFibBi/meta'
I0901 23:09:33.283740  6801 status_update_manager.cpp:203] Recovering status update manager
I0901 23:09:33.283956  6808 containerizer.cpp:646] Recovering containerizer
I0901 23:09:33.285396  6824 provisioner.cpp:416] Provisioner recovery complete
I0901 23:09:33.285712  6816 slave.cpp:6296] Finished recovery
I0901 23:09:33.286192  6816 slave.cpp:6478] Querying resource estimator for oversubscribable
resources
I0901 23:09:33.286440  6812 slave.cpp:6492] Received oversubscribable resources {} from the
resource estimator
I0901 23:09:33.289583  6819 process.cpp:3956] Handling HTTP event for process 'slave(812)'
with path: '/slave(812)/monitor/statistics.json'
I0901 23:09:33.291036  6801 http.cpp:1185] HTTP GET for /slave(812)/monitor/statistics.json
from 172.17.0.11:54172
I0901 23:09:33.291116  6801 http.cpp:976] Authorizing principal 'test-principal' to GET the
'/monitor/statistics.json' endpoint
I0901 23:09:33.294689  6814 slave.cpp:859] Agent terminating
[       OK ] Endpoint/SlaveEndpointTest.NoAuthorizer/1 (33 ms)
[ RUN      ] Endpoint/SlaveEndpointTest.NoAuthorizer/2
I0901 23:09:33.307569  6782 containerizer.cpp:290] Using isolation { environment_secret, posix/cpu,
posix/mem, filesystem/posix, network/cni }
W0901 23:09:33.308117  6782 backend.cpp:76] Failed to create 'aufs' backend: AufsBackend requires
root privileges
W0901 23:09:33.308233  6782 backend.cpp:76] Failed to create 'bind' backend: BindBackend requires
root privileges
I0901 23:09:33.308267  6782 provisioner.cpp:255] Using default backend 'copy'
I0901 23:09:33.310088  6782 cluster.cpp:448] Creating default 'local' authorizer
I0901 23:09:33.312111  6821 slave.cpp:252] Mesos agent started on (813)@172.17.0.11:42575
I0901 23:09:33.312141  6821 slave.cpp:253] Flags at startup: --acls="" --appc_simple_discovery_uri_prefix="http://"
--appc_store_dir="/tmp/Endpoint_SlaveEndpointTest_NoAuthorizer_2_miHLUT/store/appc" --authenticate_http_readonly="true"
--authenticate_http_readwrite="true" --authenticatee="crammd5" --authentication_backoff_factor="1secs"
--authorizer="local" --cgroups_cpu_enable_pids_and_tids_count="false" --cgroups_enable_cfs="false"
--cgroups_hierarchy="/sys/fs/cgroup" --cgroups_limit_swap="false" --cgroups_root="mesos" --container_disk_watch_interval="15secs"
--containerizers="mesos" --credential="/tmp/Endpoint_SlaveEndpointTest_NoAuthorizer_2_miHLUT/credential"
--default_role="*" --disallow_sharing_agent_pid_namespace="false" --disk_watch_interval="1mins"
--docker="docker" --docker_kill_orphans="true" --docker_registry="https://registry-1.docker.io"
--docker_remove_delay="6hrs" --docker_socket="/var/run/docker.sock" --docker_stop_timeout="0ns"
--docker_store_dir="/tmp/Endpoint_SlaveEndpointTest_NoAuthorizer_2_miHLUT/store/docker" --docker_volume_checkpoint_dir="/var/run/mesos/isolators/docker/volume"
--enforce_container_disk_quota="false" --executor_registration_timeout="1mins" --executor_reregistration_timeout="2secs"
--executor_shutdown_grace_period="5secs" --fetcher_cache_dir="/tmp/Endpoint_SlaveEndpointTest_NoAuthorizer_2_miHLUT/fetch"
--fetcher_cache_size="2GB" --frameworks_home="" --gc_delay="1weeks" --gc_disk_headroom="0.1"
--hadoop_home="" --help="false" --hostname_lookup="true" --http_command_executor="false" --http_credentials="/tmp/Endpoint_SlaveEndpointTest_NoAuthorizer_2_miHLUT/http_credentials"
--http_heartbeat_interval="30secs" --initialize_driver_logging="true" --isolation="posix/cpu,posix/mem"
--launcher="posix" --launcher_dir="/mesos/mesos-1.5.0/_build/src" --logbufsecs="0" --logging_level="INFO"
--max_completed_executors_per_framework="150" --oversubscribed_resources_interval="15secs"
--perf_duration="10secs" --perf_interval="1mins" --port="5051" --qos_correction_interval_min="0ns"
--quiet="false" --recover="reconnect" --recovery_timeout="15mins" --registration_backoff_factor="10ms"
--resources="cpus:2;gpus:0;mem:1024;disk:1024;ports:[31000-32000]" --revocable_cpu_low_priority="true"
--runtime_dir="/tmp/Endpoint_SlaveEndpointTest_NoAuthorizer_2_miHLUT" --sandbox_directory="/mnt/mesos/sandbox"
--strict="true" --switch_user="true" --systemd_enable_support="true" --systemd_runtime_directory="/run/systemd/system"
--version="false" --work_dir="/tmp/Endpoint_SlaveEndpointTest_NoAuthorizer_2_8gXC1z" --zk_session_timeout="10secs"
I0901 23:09:33.312530  6821 credentials.hpp:86] Loading credential for authentication from
'/tmp/Endpoint_SlaveEndpointTest_NoAuthorizer_2_miHLUT/credential'
I0901 23:09:33.312685  6821 slave.cpp:285] Agent using credential for: test-principal
I0901 23:09:33.312708  6821 credentials.hpp:37] Loading credentials for authentication from
'/tmp/Endpoint_SlaveEndpointTest_NoAuthorizer_2_miHLUT/http_credentials'
I0901 23:09:33.312937  6821 http.cpp:1045] Creating default 'basic' HTTP authenticator for
realm 'mesos-agent-readonly'
I0901 23:09:33.313133  6821 http.cpp:1045] Creating default 'basic' HTTP authenticator for
realm 'mesos-agent-readwrite'
I0901 23:09:33.314497  6821 slave.cpp:581] Agent resources: [{"name":"cpus","scalar":{"value":2.0},"type":"SCALAR"},{"name":"mem","scalar":{"value":1024.0},"type":"SCALAR"},{"name":"disk","scalar":{"value":1024.0},"type":"SCALAR"},{"name":"ports","ranges":{"range":[{"begin":31000,"end":32000}]},"type":"RANGES"}]
I0901 23:09:33.314731  6821 slave.cpp:589] Agent attributes: [  ]
I0901 23:09:33.314743  6821 slave.cpp:598] Agent hostname: b3f09f52f4d0
I0901 23:09:33.314880  6813 status_update_manager.cpp:177] Pausing sending status updates
I0901 23:09:33.316360  6806 state.cpp:64] Recovering state from '/tmp/Endpoint_SlaveEndpointTest_NoAuthorizer_2_8gXC1z/meta'
I0901 23:09:33.316756  6805 status_update_manager.cpp:203] Recovering status update manager
I0901 23:09:33.317018  6804 containerizer.cpp:646] Recovering containerizer
I0901 23:09:33.318403  6803 provisioner.cpp:416] Provisioner recovery complete
I0901 23:09:33.318871  6823 slave.cpp:6296] Finished recovery
I0901 23:09:33.319435  6823 slave.cpp:6478] Querying resource estimator for oversubscribable
resources
I0901 23:09:33.319720  6811 slave.cpp:6492] Received oversubscribable resources {} from the
resource estimator
I0901 23:09:33.322407  6820 process.cpp:3956] Handling HTTP event for process 'slave(813)'
with path: '/slave(813)/containers'
I0901 23:09:33.323678  6806 http.cpp:1185] HTTP GET for /slave(813)/containers from 172.17.0.11:54174
I0901 23:09:33.323760  6806 http.cpp:976] Authorizing principal 'test-principal' to GET the
'/containers' endpoint
I0901 23:09:33.327738  6782 slave.cpp:859] Agent terminating
[       OK ] Endpoint/SlaveEndpointTest.NoAuthorizer/2 (32 ms)
[----------] 9 tests from Endpoint/SlaveEndpointTest (291 ms total)

[----------] 2 tests from ContainerizerType/DefaultContainerDNSFlagTest
[ RUN      ] ContainerizerType/DefaultContainerDNSFlagTest.ValidateFlag/0
[       OK ] ContainerizerType/DefaultContainerDNSFlagTest.ValidateFlag/0 (12 ms)
[ RUN      ] ContainerizerType/DefaultContainerDNSFlagTest.ValidateFlag/1
[       OK ] ContainerizerType/DefaultContainerDNSFlagTest.ValidateFlag/1 (9 ms)
[----------] 2 tests from ContainerizerType/DefaultContainerDNSFlagTest (21 ms total)

[----------] Global test environment tear-down
[==========] 1664 tests from 183 test cases ran. (645399 ms total)
[  PASSED  ] 1658 tests.
[  FAILED  ] 6 tests, listed below:
[  FAILED  ] CommandExecutorCheckTest.CommandCheckDeliveredAndReconciled
[  FAILED  ] DefaultExecutorCheckTest.CommandCheckDeliveredAndReconciled
[  FAILED  ] DefaultExecutorCheckTest.CommandCheckStatusChange
[  FAILED  ] DefaultExecutorCheckTest.CommandCheckSeesParentsEnv
[  FAILED  ] DefaultExecutorCheckTest.CommandCheckSharesWorkDirWithTask
[  FAILED  ] ExamplesTest.NoExecutorFramework

 6 FAILED TESTS
  YOU HAVE 20 DISABLED TESTS

I0901 23:09:33.422938  6825 process.cpp:1072] Failed to accept socket: future discarded
make[4]: *** [check-local] Error 1
make[4]: Leaving directory `/mesos/mesos-1.5.0/_build/src'
make[3]: *** [check-am] Error 2
make[3]: Leaving directory `/mesos/mesos-1.5.0/_build/src'
make[2]: *** [check] Error 2
make[2]: Leaving directory `/mesos/mesos-1.5.0/_build/src'
make[1]: *** [check-recursive] Error 1
make[1]: Leaving directory `/mesos/mesos-1.5.0/_build'
make: *** [distcheck] Error 1
+ docker rmi mesos-1504304439-21592
Untagged: mesos-1504304439-21592:latest
Deleted: sha256:0f15a03f123b55ddc2cb8c4b43022f0770d223c667ea5b4a66e09d01a9b6dca5
Deleted: sha256:23f189f3116100d7d178d03d4afcd49ce5305b7449fbf729b4f3ea6b88683a84
Deleted: sha256:01b454b05876037ca4f3baa48b51b2dfcb958b7fbe265e9c3baff5600afae5ee
Deleted: sha256:e2829303976f5fe87be31387b79aa6a607eb3e9d4fb009013c9c1080d01c25ba
Deleted: sha256:227629c4e666a7edefb27b42baa867699c53b720071986d94d7e3e994720d3ed
Deleted: sha256:053261874cd1bfae96f326502f492c0bae10aa75f7cc8ff44989a85ceaa3e126
Deleted: sha256:6751277994de8a1b0ffa57fc42af02afc74a8fd20fe1481b56443ba79bc5975f
Deleted: sha256:50e0727c5751e1df24ea6a3282dfd10625972f8bdda58ad605f9f2a8f88fadcb
Deleted: sha256:f5dc14e64e0f0ee040b5441044f4e610f81a7e1e69f4e2dd3892c11c48d45648
Deleted: sha256:732bac9bc7f981bfa220e4a8320d4631199058f83ccaebeb4eab00e27e9fbe5f
Deleted: sha256:b87c504510b4e0e4ae393a7a89abd900bcc2fa057a7ccc929acd3ca510988d3c
Deleted: sha256:e5a44185d23721b838aa5ec4ba2599f70db4be60382aa3505c2008e592d5e01d
Deleted: sha256:fecf2b8f7be1718766c5feb1ae99321c770fc4f142bb779dd6df223a4d95613d
Deleted: sha256:945084805148a58b2f227ec19ea6749ee1ba0c8fac26badeade2c9a205367f5e
Deleted: sha256:18843e940bcdf5f9acb989785c5658edd6b6165a2c073acfe167ed00d4605132
Deleted: sha256:682c312ad82a46ad1693596d5e09fac225e220871eab03cccf6598a46d509f2a
Deleted: sha256:57fca9d4149e7594ce31676994b8c9ec33424b713553b1b66cb1c272ee3a4169
Deleted: sha256:52b024d75dc7d15ec18e05a0be95a5fc0c991451a87511d6550751e052008a91
Deleted: sha256:53893c9478911d40facb67c027b96f339d18b7f59efa5d1a536ccbe48dad84c0
Deleted: sha256:8bb8e2a7b4a19ff15e8d3ac7712e796fcb184a0baeeb11b18282f12c56b94400
Deleted: sha256:54b77b53ab4169af9394aaf6600eb8ea6a290522e471d540032ed820d447ccc4
Deleted: sha256:9e6cccbc755ca8cb9d20f0c862cc6e3a97c9d7a3c809ecdbbf581e19b787532b
Deleted: sha256:e46aa8f11e63ad7562377408f8ecaf5646f060cf407f621516a538680980f40e
Deleted: sha256:419b1fefd256f9b1de3eaac26f57c6bf5de1026bf37690ee2574c65831010fe3
Deleted: sha256:c960f2208a7a81ea205dcfc0dc1ad30d6e02f6ed8dd753679f601bb737bf4c31
Build step 'Execute shell' marked build as failure
Not sending mail to unregistered user yujie.jay@gmail.com
Not sending mail to unregistered user songzihao1990@gmail.com

Mime
View raw message